{
    "posts": [
        {
            "id": 1,
            "title": "Lorem ipsum dolor sit amet, consectetur adipisicing elit",
            "content": "Lorem ipsum dolor sit amet, consectetur adipisicing elit Lorem ipsum dolor sit amet, consectetur adipisicing elit Lorem ipsum dolor sit amet, consectetur adipisicing elit"
        },
        {
            "id": 2,
            "title": "Lorem ipsum dolor sit amet, consectetur adipisicing elit",
            "content": "Lorem ipsum dolor sit amet, consectetur adipisicing elit Lorem ipsum dolor sit amet, consectetur adipisicing elit Lorem ipsum dolor sit amet, consectetur adipisicing elit"
        },
        {
            "id": 3,
            "title": "Lorem ipsum dolor sit amet, consectetur adipisicing elit",
            "content": "Lorem ipsum dolor sit amet, consectetur adipisicing elit Lorem ipsum dolor sit amet, consectetur adipisicing elit Lorem ipsum dolor sit amet, consectetur adipisicing elit"
        },
        {
            "id": 4,
            "title": "Lorem ipsum dolor sit amet, consectetur adipisicing elit",
            "content": "Lorem ipsum dolor sit amet, consectetur adipisicing elit Lorem ipsum dolor sit amet, consectetur adipisicing elit Lorem ipsum dolor sit amet, consectetur adipisicing elit"
        }
    ]
}