{
  "name": "prometheus-local",
  "isDefault": false,
  "type": "prometheus",
  "url": "http://prometheus:9090",
  "access": "proxy",
  "user": "",
  "password": "",
  "database": "",
  "basicAuth": false
}
