{
  "uid": "01_stack_admin_distribution_list_alert_notification",
  "name": "stack admin distribution list alert notification",
  "type":  "email",
  "isDefault": false,
  "sendReminder": false,
  "settings": {
    "addresses": "ryszardszewczyk2204@gmail.com"
  }
}