<svg width="37" height="25" viewBox="0 0 37 25" fill="none" xmlns="http://www.w3.org/2000/svg">
<rect x="0.634766" y="0.246094" width="35.6127" height="2.666" fill="#2A2A43"/>
<rect x="0.634766" y="10.91" width="35.6127" height="2.666" fill="#2A2A43"/>
<rect x="0.634766" y="21.5757" width="35.6127" height="2.666" fill="#2A2A43"/>
</svg>
