You're running out of storage (97%). … 
Soon you won't be able to upload new files to Drive and send or receive emails in Gmail.Learn more
piplist.txt
Who has access
I
P
System properties
Type
Text
Size
2 KB
Storage used
2 KBOwned by UBITECH LTD
Location
Regale-modules_jars
Owner
Ioannis Plakas
Modified
Jul 20, 2022 by Ioannis Plakas
Opened
Jul 21, 2022 by me
Created
Jul 20, 2022
Add a description
Viewers can download

aiokafka (0.7.1)
apturl (0.5.2)
asn1crypto (0.24.0)
attrs (20.2.0)
beautifulsoup4 (4.6.0)
Brlapi (0.6.6)
certifi (2021.10.8)
chardet (4.0.0)
click (7.1.2)
colorama (0.3.7)
command-not-found (0.3)
cryptography (2.1.4)
cupshelpers (1.0)
dataclasses (0.8)
defer (1.0.6)
distro-info (0.18ubuntu0.18.04.1)
docopt (0.6.2)
elasticsearch (7.15.1)
f.lux-indicator-applet (1.1.11-pre)
Flask (1.1.2)
gensim (4.0.1)
graphframes (0.6)
grip (4.5.2)
html5lib (0.999999999)
httplib2 (0.11.3)
idna (2.10)
imagezmq (1.1.1)
importlib-metadata (3.7.2)
iniconfig (1.0.1)
itsdangerous (1.1.0)
Jinja2 (2.11.3)
kafka (1.3.5)
kafka-python (2.0.2)
kazam (1.4.5)
keyring (10.6.0)
keyrings.alt (3.0)
language-selector (0.1)
launchpadlib (1.10.6)
lazr.restfulclient (0.13.5)
lazr.uri (1.0.3)
louis (3.5.0)
lxml (4.6.2)
macaroonbakery (1.1.3)
Mako (1.0.7)
Markdown (3.3.4)
MarkupSafe (1.1.1)
mysql-connector-python (8.0.27)
netifaces (0.10.4)
nose (1.3.7)
numpy (1.19.5)
oauth (1.0.1)
olefile (0.45.1)
packaging (20.4)
pandas (1.1.5)
path-and-address (2.0.1)
pexpect (4.2.1)
Pillow (5.1.0)
pip (9.0.1)
pluggy (0.13.1)
protobuf (3.19.1)
py (1.9.0)
py4j (0.10.9)
pycairo (1.16.2)
pycrypto (2.6.1)
pycups (1.9.73)
Pygments (2.8.1)
pygobject (3.26.1)
pymacaroons (0.13.0)
pymongo (3.11.4)
PyNaCl (1.1.2)
pyparsing (2.4.7)
pyRFC3339 (1.0)
pyspark (3.0.0)
pytest (6.1.0)
python-apt (1.6.5+ubuntu0.6)
python-dateutil (2.8.1)
python-debian (0.1.32)
pytz (2021.1)
pyxdg (0.25)
PyYAML (3.12)
pyzmq (22.3.0)
remarkable (1.87)
reportlab (3.4.0)
requests (2.25.1)
requests-unixsocket (0.1.5)
scipy (1.5.4)
SecretStorage (2.3.1)
setuptools (39.0.1)
simplejson (3.13.2)
six (1.16.0)
smart-open (5.1.0)
spark (0.2.1)
ssh-import-id (5.7)
system-service (0.3)
systemd-python (234)
termcolor (1.1.0)
toml (0.10.1)
typing-extensions (3.7.4.3)
ubuntu-advantage-tools (27.0)
ubuntu-drivers-common (0.0.0)
ufw (0.36)
unattended-upgrades (0.1)
urllib3 (1.26.7)
usb-creator (0.3.3)
vboxapi (1.0)
wadllib (1.3.2)
webencodings (0.5)
websockets (8.1)
Werkzeug (1.0.1)
wheel (0.30.0)
xkit (0.0.0)
youtube-dl (2020.9.20)
zipp (3.4.1)
zope.interface (4.3.2)
