{
  "name": "design",
  "$schema": "../../node_modules/nx/schemas/project-schema.json",
  "projectType": "library",
  "sourceRoot": "libs/design/src",
  "prefix": "ryax-front",
  "targets": {
    "test": {
      "executor": "@nx/jest:jest",
      "outputs": ["{workspaceRoot}/coverage/libs/design"],
      "options": {
        "jestConfig": "libs/design/jest.config.ts",
        "passWithNoTests": true
      }
    },
    "lint": {
      "executor": "@nx/linter:eslint",
      "options": {
        "lintFilePatterns": [
          "libs/design/src/**/*.ts",
          "libs/design/src/**/*.html"
        ]
      }
    },
    "storybook": {
      "executor": "@storybook/angular:start-storybook",
      "options": {
        "port": 4400,
        "configDir": "libs/design/.storybook",
        "browserTarget": "design:build-storybook",
        "compodoc": false
      },
      "configurations": {
        "ci": {
          "quiet": true
        }
      }
    },
    "build-storybook": {
      "executor": "@storybook/angular:build-storybook",
      "outputs": ["{options.outputPath}"],
      "options": {
        "outputDir": "dist/storybook/design",
        "configDir": "libs/design/.storybook",
        "browserTarget": "design:build-storybook",
        "compodoc": false
      },
      "configurations": {
        "ci": {
          "quiet": true
        }
      }
    }
  },
  "tags": []
}
