A 41 I
A 42 I
A 44 I
A 45 I
A 46 I
A 47 I
A 48 I
A 49 I
A 50 I
A 51 I
A 52 I
A 53 I
A 54 I
A 56 I
A 57 I
A 58 I
A 59 I
A 60 C
A 61 I
A 62 C
A 63 C
A 64 C
A 65 C
A 66 C
A 67 C
A 68 C
A 69 C
A 70 I
A 71 I
A 72 C
A 73 C
A 74 I
A 75 C
A 76 I
A 77 C
A 78 I
A 79 I
A 80 I
A 83 I
A 84 I
A 86 I
A 95 I
A 96 I
A 97 I
A 98 I
A 99 I
A 100 I
A 101 C
A 102 I
A 103 C
A 104 I
A 105 I
A 106 I
A 107 C
A 108 I
A 109 I
A 110 I
A 111 I
A 112 C
A 113 I
A 114 C
A 115 I
A 116 I
A 117 I
A 118 I
A 119 I
A 120 I
A 122 I
A 123 I
A 124 I
A 125 I
A 126 I
A 127 I
A 128 C
A 129 I
A 130 C
A 131 I
A 132 I
A 133 I
A 134 I
A 135 C
A 136 I
A 137 C
A 138 I
A 139 I
A 140 I
A 141 I
A 142 I
A 143 I
A 144 I
A 145 I
A 146 I
A 147 I
A 148 I
A 149 I
A 154 I
A 155 I
A 156 I
A 157 I
A 158 I
A 159 I
A 160 I
A 161 I
A 172 I
A 173 I
A 174 I
A 175 I
A 176 I
A 195 I
A 199 I
A 200 I
A 204 I
A 205 I
A 206 I
A 207 I
A 208 I
A 209 I
A 210 I
A 211 I
A 212 I
A 213 I
A 214 I
A 215 I
A 216 I
A 217 I
A 218 I
A 219 I
A 220 I
A 221 I
A 222 I
A 223 C
A 224 C
A 225 C
A 226 I
A 227 I
A 228 I
A 229 I
A 230 I
A 233 I
A 234 I
A 235 I
A 236 I
A 237 I
A 238 I
A 239 C
A 240 I
A 241 I
A 242 I
A 243 I
A 245 I
A 246 I
A 247 I
A 253 I
A 254 I
A 255 I
A 256 I
A 257 I
A 258 C
A 259 I
A 260 C
A 261 C
A 262 I
A 263 C
A 264 I
A 265 I
A 266 I
A 267 I
A 269 I
A 270 I
A 271 I
A 272 C
A 273 I
A 274 C
A 275 C
A 276 I
A 277 I
A 278 I
A 279 I
A 280 I
A 286 I
A 287 I
A 288 I
A 289 I
A 290 I
A 291 C
A 292 C
A 293 C
A 294 I
A 295 I
A 296 I
A 297 I
A 298 I
A 299 I
A 300 I
A 303 I
A 305 I
A 306 I
A 309 I
A 420 I
A 421 I
A 423 I
A 424 I
