{
  "resourceName": "notesimages",
  "policyUUID": "f30024b4",
  "bucketName": "amplifyapp2s3buckettutorial",
  "storageAccess": "auth",
  "guestAccess": [],
  "authAccess": [
    "CREATE_AND_UPDATE",
    "READ",
    "DELETE"
  ],
  "triggerFunction": "NONE",
  "groupAccess": {}
}