{
    "users": [
        {
            "trips": [
                {
                    "key": "Ak67",
                    "name": "Chicago"
                },
                {
                    "key": "Pw99",
                    "name": "Topeka"
                },
                {
                    "key": "Or01",
                    "name": "Omaha"
                }
            ]
        }
    ]
}