{
  "images": [
    {
      "appearances": [],
      "scale": "1x",
      "idiom": "universal",
      "filename": "frisco_sat_map.png"
    },
    {
      "appearances": [],
      "scale": "2x",
      "idiom": "universal",
      "filename": "frisco_sat_map1.png"
    },
    {
      "appearances": [],
      "scale": "3x",
      "idiom": "universal",
      "filename": "frisco_sat_map2.png"
    }
  ],
  "properties": {},
  "info": {
    "version": 1,
    "author": ""
  }
}