{
  "name": "workspace-tools",
  "$schema": "../node_modules/nx/schemas/project-schema.json",
  "sourceRoot": "tools/src",
  "projectType": "library",
  "tags": ["internal"],
  "targets": {
    "lint": {
      "executor": "@nx/eslint:lint"
    },
    "test": {
      "executor": "@nx/jest:jest",
      "outputs": ["{workspaceRoot}/coverage/{projectRoot}"],
      "options": {
        "jestConfig": "tools/jest.config.ts"
      }
    }
  }
}
