[
    {
        "id": "c6f41776fd33346b",
        "type": "tab",
        "label": "Flow 1",
        "disabled": false,
        "info": "",
        "env": []
    },
    {
        "id": "4a2e7606e19db3db",
        "type": "ui_tab",
        "name": "Home",
        "icon": "dashboard",
        "disabled": false,
        "hidden": false
    },
    {
        "id": "77165efef99ba5dd",
        "type": "ui_base",
        "theme": {
            "name": "theme-light",
            "lightTheme": {
                "default": "#0094CE",
                "baseColor": "#0094CE",
                "baseFont": "-apple-system,BlinkMacSystemFont,Segoe UI,Roboto,Oxygen-Sans,Ubuntu,Cantarell,Helvetica Neue,sans-serif",
                "edited": true,
                "reset": false
            },
            "darkTheme": {
                "default": "#097479",
                "baseColor": "#097479",
                "baseFont": "-apple-system,BlinkMacSystemFont,Segoe UI,Roboto,Oxygen-Sans,Ubuntu,Cantarell,Helvetica Neue,sans-serif",
                "edited": false
            },
            "customTheme": {
                "name": "Untitled Theme 1",
                "default": "#4B7930",
                "baseColor": "#4B7930",
                "baseFont": "-apple-system,BlinkMacSystemFont,Segoe UI,Roboto,Oxygen-Sans,Ubuntu,Cantarell,Helvetica Neue,sans-serif"
            },
            "themeState": {
                "base-color": {
                    "default": "#0094CE",
                    "value": "#0094CE",
                    "edited": false
                },
                "page-titlebar-backgroundColor": {
                    "value": "#0094CE",
                    "edited": false
                },
                "page-backgroundColor": {
                    "value": "#fafafa",
                    "edited": false
                },
                "page-sidebar-backgroundColor": {
                    "value": "#ffffff",
                    "edited": false
                },
                "group-textColor": {
                    "value": "#1bbfff",
                    "edited": false
                },
                "group-borderColor": {
                    "value": "#ffffff",
                    "edited": false
                },
                "group-backgroundColor": {
                    "value": "#ffffff",
                    "edited": false
                },
                "widget-textColor": {
                    "value": "#111111",
                    "edited": false
                },
                "widget-backgroundColor": {
                    "value": "#0094ce",
                    "edited": false
                },
                "widget-borderColor": {
                    "value": "#ffffff",
                    "edited": false
                },
                "base-font": {
                    "value": "-apple-system,BlinkMacSystemFont,Segoe UI,Roboto,Oxygen-Sans,Ubuntu,Cantarell,Helvetica Neue,sans-serif"
                }
            },
            "angularTheme": {
                "primary": "indigo",
                "accents": "blue",
                "warn": "red",
                "background": "grey",
                "palette": "light"
            }
        },
        "site": {
            "name": "Node-RED Dashboard",
            "hideToolbar": "false",
            "allowSwipe": "false",
            "lockMenu": "false",
            "allowTempTheme": "true",
            "dateFormat": "DD/MM/YYYY",
            "sizes": {
                "sx": 48,
                "sy": 48,
                "gx": 6,
                "gy": 6,
                "cx": 6,
                "cy": 6,
                "px": 0,
                "py": 0
            }
        }
    },
    {
        "id": "300fcec8b9e568e0",
        "type": "ui_group",
        "name": "M1 Up/Down",
        "tab": "4a2e7606e19db3db",
        "order": 1,
        "disp": true,
        "width": "6",
        "collapse": false,
        "className": ""
    },
    {
        "id": "3f5ec1a43e0c0a03",
        "type": "ui_group",
        "name": "M2 away/close",
        "tab": "4a2e7606e19db3db",
        "order": 2,
        "disp": true,
        "width": "6",
        "collapse": false,
        "className": ""
    },
    {
        "id": "61c13f454f5be771",
        "type": "ui_group",
        "name": "Joystick",
        "tab": "4a2e7606e19db3db",
        "order": 3,
        "disp": true,
        "width": "6",
        "collapse": false,
        "className": ""
    },
    {
        "id": "88315f245cb20c2f",
        "type": "rpi-gpio out",
        "z": "c6f41776fd33346b",
        "name": "",
        "pin": "12",
        "set": "",
        "level": "0",
        "freq": "100",
        "out": "pwm",
        "bcm": true,
        "x": 640,
        "y": 680,
        "wires": []
    },
    {
        "id": "c547c73f67eb0bc1",
        "type": "rpi-gpio out",
        "z": "c6f41776fd33346b",
        "name": "",
        "pin": "22",
        "set": "",
        "level": "0",
        "freq": "",
        "out": "out",
        "bcm": true,
        "x": 640,
        "y": 620,
        "wires": []
    },
    {
        "id": "d974da6d7dc8081f",
        "type": "ui_switch",
        "z": "c6f41776fd33346b",
        "name": "",
        "label": "M1 EN",
        "tooltip": "",
        "group": "300fcec8b9e568e0",
        "order": 1,
        "width": 0,
        "height": 0,
        "passthru": true,
        "decouple": "false",
        "topic": "topic",
        "topicType": "msg",
        "style": "",
        "onvalue": "true",
        "onvalueType": "bool",
        "onicon": "",
        "oncolor": "",
        "offvalue": "false",
        "offvalueType": "bool",
        "officon": "",
        "offcolor": "",
        "animate": false,
        "className": "",
        "x": 450,
        "y": 620,
        "wires": [
            [
                "c547c73f67eb0bc1"
            ]
        ]
    },
    {
        "id": "6f37b85555222248",
        "type": "ui_switch",
        "z": "c6f41776fd33346b",
        "name": "",
        "label": "M1 direction",
        "tooltip": "",
        "group": "300fcec8b9e568e0",
        "order": 3,
        "width": 0,
        "height": 0,
        "passthru": true,
        "decouple": "false",
        "topic": "topic",
        "topicType": "msg",
        "style": "",
        "onvalue": "true",
        "onvalueType": "bool",
        "onicon": "",
        "oncolor": "",
        "offvalue": "false",
        "offvalueType": "bool",
        "officon": "",
        "offcolor": "",
        "animate": false,
        "className": "",
        "x": 470,
        "y": 760,
        "wires": [
            [
                "e6b3fc7d5756fb45"
            ]
        ]
    },
    {
        "id": "e6b3fc7d5756fb45",
        "type": "rpi-gpio out",
        "z": "c6f41776fd33346b",
        "name": "",
        "pin": "24",
        "set": "",
        "level": "0",
        "freq": "",
        "out": "out",
        "bcm": true,
        "x": 640,
        "y": 760,
        "wires": []
    },
    {
        "id": "2556dff2c994e150",
        "type": "ui_slider",
        "z": "c6f41776fd33346b",
        "name": "",
        "label": "M1 Speed",
        "tooltip": "",
        "group": "300fcec8b9e568e0",
        "order": 2,
        "width": 0,
        "height": 0,
        "passthru": true,
        "outs": "all",
        "topic": "topic",
        "topicType": "msg",
        "min": 0,
        "max": "100",
        "step": 1,
        "className": "",
        "x": 470,
        "y": 680,
        "wires": [
            [
                "88315f245cb20c2f"
            ]
        ]
    },
    {
        "id": "178fd472b375124a",
        "type": "ui_switch",
        "z": "c6f41776fd33346b",
        "name": "",
        "label": "M2 EN",
        "tooltip": "",
        "group": "3f5ec1a43e0c0a03",
        "order": 1,
        "width": 0,
        "height": 0,
        "passthru": true,
        "decouple": "false",
        "topic": "topic",
        "topicType": "msg",
        "style": "",
        "onvalue": "true",
        "onvalueType": "bool",
        "onicon": "",
        "oncolor": "",
        "offvalue": "false",
        "offvalueType": "bool",
        "officon": "",
        "offcolor": "",
        "animate": false,
        "className": "",
        "x": 450,
        "y": 900,
        "wires": [
            [
                "c2747dcf90cc2338"
            ]
        ]
    },
    {
        "id": "9a0082ba15bc4ee4",
        "type": "ui_switch",
        "z": "c6f41776fd33346b",
        "name": "",
        "label": "M2 direction",
        "tooltip": "",
        "group": "3f5ec1a43e0c0a03",
        "order": 3,
        "width": 0,
        "height": 0,
        "passthru": true,
        "decouple": "false",
        "topic": "topic",
        "topicType": "msg",
        "style": "",
        "onvalue": "true",
        "onvalueType": "bool",
        "onicon": "",
        "oncolor": "",
        "offvalue": "false",
        "offvalueType": "bool",
        "officon": "",
        "offcolor": "",
        "animate": false,
        "className": "",
        "x": 470,
        "y": 1020,
        "wires": [
            [
                "254433bf9b3f6ab7"
            ]
        ]
    },
    {
        "id": "086488136b64b4f9",
        "type": "ui_slider",
        "z": "c6f41776fd33346b",
        "name": "",
        "label": "M2 Speed",
        "tooltip": "",
        "group": "3f5ec1a43e0c0a03",
        "order": 2,
        "width": 0,
        "height": 0,
        "passthru": true,
        "outs": "all",
        "topic": "topic",
        "topicType": "msg",
        "min": 0,
        "max": "100",
        "step": 1,
        "className": "",
        "x": 470,
        "y": 960,
        "wires": [
            [
                "ad7cad3b75439040"
            ]
        ]
    },
    {
        "id": "c2747dcf90cc2338",
        "type": "rpi-gpio out",
        "z": "c6f41776fd33346b",
        "name": "",
        "pin": "23",
        "set": "",
        "level": "0",
        "freq": "",
        "out": "out",
        "bcm": true,
        "x": 640,
        "y": 900,
        "wires": []
    },
    {
        "id": "ad7cad3b75439040",
        "type": "rpi-gpio out",
        "z": "c6f41776fd33346b",
        "name": "",
        "pin": "13",
        "set": "",
        "level": "0",
        "freq": "",
        "out": "pwm",
        "bcm": true,
        "x": 640,
        "y": 960,
        "wires": []
    },
    {
        "id": "254433bf9b3f6ab7",
        "type": "rpi-gpio out",
        "z": "c6f41776fd33346b",
        "name": "",
        "pin": "25",
        "set": "",
        "level": "0",
        "freq": "",
        "out": "out",
        "bcm": true,
        "x": 640,
        "y": 1020,
        "wires": []
    },
    {
        "id": "ed9b215eb5744843",
        "type": "rpi-keyboard",
        "z": "c6f41776fd33346b",
        "name": "",
        "x": 130,
        "y": 520,
        "wires": [
            [
                "e2dfb5a43df2b9f6"
            ]
        ]
    },
    {
        "id": "e2dfb5a43df2b9f6",
        "type": "debug",
        "z": "c6f41776fd33346b",
        "name": "",
        "active": false,
        "tosidebar": true,
        "console": false,
        "tostatus": false,
        "complete": "false",
        "statusVal": "",
        "statusType": "auto",
        "x": 310,
        "y": 520,
        "wires": []
    },
    {
        "id": "d4e4e384d75c18db",
        "type": "ui_joystick",
        "z": "c6f41776fd33346b",
        "name": "",
        "group": "61c13f454f5be771",
        "order": 3,
        "width": "6",
        "height": "6",
        "trigger": "all",
        "timeInterval": "200",
        "useThemeColor": true,
        "color": "#000000",
        "threshold": "0",
        "directions": "all",
        "shape": "squere",
        "centerAtRelease": true,
        "x": 70,
        "y": 720,
        "wires": [
            [
                "2556dff2c994e150",
                "8b74a2392ac6b79b",
                "d6fd2cbb268e4d99"
            ]
        ]
    },
    {
        "id": "8b74a2392ac6b79b",
        "type": "function",
        "z": "c6f41776fd33346b",
        "name": "",
        "func": "x = msg.payload.vector.x * 100\ny = msg.payload.vector.y * 100\nm1_direction = false\nm2_direction = false\nif(x<0) m1_direction = true\nif(y>0) m2_direction = true\n\nmsgs = []\nmsgs.push({payload: Math.abs(y)})\nmsgs.push({payload: m2_direction})\nmsgs.push({payload: Math.abs(x)})\nmsgs.push({payload: m1_direction})\n\nreturn msgs;",
        "outputs": 4,
        "noerr": 0,
        "initialize": "",
        "finalize": "",
        "libs": [],
        "x": 240,
        "y": 780,
        "wires": [
            [
                "2556dff2c994e150"
            ],
            [
                "086488136b64b4f9",
                "6f37b85555222248"
            ],
            [
                "086488136b64b4f9"
            ],
            [
                "9a0082ba15bc4ee4"
            ]
        ]
    },
    {
        "id": "d6fd2cbb268e4d99",
        "type": "debug",
        "z": "c6f41776fd33346b",
        "name": "",
        "active": true,
        "tosidebar": true,
        "console": false,
        "tostatus": false,
        "complete": "false",
        "statusVal": "",
        "statusType": "auto",
        "x": 230,
        "y": 900,
        "wires": []
    }
]