[
    {
        "id": "1065634571c83be1",
        "type": "tab",
        "label": "Flow 1",
        "disabled": false,
        "info": "",
        "env": []
    },
    {
        "id": "2661810d88c30bb9",
        "type": "debug",
        "z": "1065634571c83be1",
        "name": "",
        "active": true,
        "tosidebar": true,
        "console": false,
        "tostatus": false,
        "complete": "false",
        "statusVal": "",
        "statusType": "auto",
        "x": 250,
        "y": 160,
        "wires": []
    },
    {
        "id": "532ee7c673c95a4a",
        "type": "inject",
        "z": "1065634571c83be1",
        "name": "",
        "props": [
            {
                "p": "payload"
            },
            {
                "p": "topic",
                "vt": "str"
            }
        ],
        "repeat": "",
        "crontab": "",
        "once": false,
        "onceDelay": 0.1,
        "topic": "",
        "payload": "",
        "payloadType": "date",
        "x": 60,
        "y": 160,
        "wires": [
            [
                "2661810d88c30bb9"
            ]
        ]
    }
]