[
    {
        "id": "9a2d82adc13d6477",
        "type": "tab",
        "label": "Flow 1",
        "disabled": false,
        "info": "",
        "env": []
    },
    {
        "id": "3b3564714089613c",
        "type": "mqtt-broker",
        "name": "",
        "broker": "broker.emqx.io",
        "port": "1883",
        "clientid": "",
        "autoConnect": true,
        "usetls": false,
        "protocolVersion": "4",
        "keepalive": "60",
        "cleansession": true,
        "birthTopic": "",
        "birthQos": "0",
        "birthPayload": "",
        "birthMsg": {},
        "closeTopic": "",
        "closeQos": "0",
        "closePayload": "",
        "closeMsg": {},
        "willTopic": "",
        "willQos": "0",
        "willPayload": "",
        "willMsg": {},
        "sessionExpiry": ""
    },
    {
        "id": "f913fe0e8ac3d97a",
        "type": "ui_tab",
        "name": "Excavator",
        "icon": "dashboard",
        "disabled": false,
        "hidden": false
    },
    {
        "id": "79843ca2cb1b627a",
        "type": "ui_group",
        "name": "Assignment",
        "tab": "f913fe0e8ac3d97a",
        "order": 1,
        "disp": true,
        "width": "6",
        "collapse": false,
        "className": ""
    },
    {
        "id": "4fb545e9361dbcf6",
        "type": "mqtt out",
        "z": "9a2d82adc13d6477",
        "name": "",
        "topic": "rwth/bcma/sessions/sx4IGKtOYlgtfC/command",
        "qos": "",
        "retain": "",
        "respTopic": "",
        "contentType": "",
        "userProps": "",
        "correl": "",
        "expiry": "",
        "broker": "3b3564714089613c",
        "x": 760,
        "y": 320,
        "wires": []
    },
    {
        "id": "d220c75edc41bf9a",
        "type": "ui_slider",
        "z": "9a2d82adc13d6477",
        "name": "",
        "label": "q0",
        "tooltip": "",
        "group": "79843ca2cb1b627a",
        "order": 0,
        "width": 0,
        "height": 0,
        "passthru": true,
        "outs": "all",
        "topic": "topic",
        "topicType": "msg",
        "min": "-1.57",
        "max": "+1.57",
        "step": "0.05",
        "className": "",
        "x": 150,
        "y": 100,
        "wires": [
            [
                "bf8fbeb9ce7d180c"
            ]
        ]
    },
    {
        "id": "bf8fbeb9ce7d180c",
        "type": "change",
        "z": "9a2d82adc13d6477",
        "name": "",
        "rules": [
            {
                "t": "set",
                "p": "temp",
                "pt": "msg",
                "to": "payload",
                "tot": "msg"
            },
            {
                "t": "set",
                "p": "payload",
                "pt": "msg",
                "to": "{\"command\":\"setJointValue\",\"jointName\":\"q0\",\"jointValue\":0}",
                "tot": "json"
            },
            {
                "t": "set",
                "p": "payload.jointValue",
                "pt": "msg",
                "to": "temp",
                "tot": "msg"
            }
        ],
        "action": "",
        "property": "",
        "from": "",
        "to": "",
        "reg": false,
        "x": 340,
        "y": 100,
        "wires": [
            [
                "4fb545e9361dbcf6"
            ]
        ]
    },
    {
        "id": "998a780cdf35f53e",
        "type": "ui_slider",
        "z": "9a2d82adc13d6477",
        "name": "",
        "label": "q1",
        "tooltip": "",
        "group": "79843ca2cb1b627a",
        "order": 0,
        "width": 0,
        "height": 0,
        "passthru": true,
        "outs": "all",
        "topic": "topic",
        "topicType": "msg",
        "min": " -0.785",
        "max": " +0.785",
        "step": "0.05",
        "className": "",
        "x": 150,
        "y": 200,
        "wires": [
            [
                "c0cf1f8bc6b2f2b4"
            ]
        ]
    },
    {
        "id": "c0cf1f8bc6b2f2b4",
        "type": "change",
        "z": "9a2d82adc13d6477",
        "name": "",
        "rules": [
            {
                "t": "set",
                "p": "temp",
                "pt": "msg",
                "to": "payload",
                "tot": "msg"
            },
            {
                "t": "set",
                "p": "payload",
                "pt": "msg",
                "to": "{\"command\":\"setJointValue\",\"jointName\":\"q1\",\"jointValue\":0}",
                "tot": "json"
            },
            {
                "t": "set",
                "p": "payload.jointValue",
                "pt": "msg",
                "to": "temp",
                "tot": "msg"
            }
        ],
        "action": "",
        "property": "",
        "from": "",
        "to": "",
        "reg": false,
        "x": 340,
        "y": 200,
        "wires": [
            [
                "4fb545e9361dbcf6"
            ]
        ]
    },
    {
        "id": "db40fd601a13717c",
        "type": "ui_slider",
        "z": "9a2d82adc13d6477",
        "name": "",
        "label": "q2",
        "tooltip": "",
        "group": "79843ca2cb1b627a",
        "order": 0,
        "width": 0,
        "height": 0,
        "passthru": true,
        "outs": "all",
        "topic": "topic",
        "topicType": "msg",
        "min": "-0.2",
        "max": "0.0",
        "step": "0.05",
        "className": "",
        "x": 150,
        "y": 280,
        "wires": [
            [
                "85be98d4db342650"
            ]
        ]
    },
    {
        "id": "85be98d4db342650",
        "type": "change",
        "z": "9a2d82adc13d6477",
        "name": "",
        "rules": [
            {
                "t": "set",
                "p": "temp",
                "pt": "msg",
                "to": "payload",
                "tot": "msg"
            },
            {
                "t": "set",
                "p": "payload",
                "pt": "msg",
                "to": "{\"command\":\"setJointValue\",\"jointName\":\"q2\",\"jointValue\":0}",
                "tot": "json"
            },
            {
                "t": "set",
                "p": "payload.jointValue",
                "pt": "msg",
                "to": "temp",
                "tot": "msg"
            }
        ],
        "action": "",
        "property": "",
        "from": "",
        "to": "",
        "reg": false,
        "x": 340,
        "y": 280,
        "wires": [
            [
                "4fb545e9361dbcf6"
            ]
        ]
    },
    {
        "id": "6d955e4a84fdeecd",
        "type": "ui_slider",
        "z": "9a2d82adc13d6477",
        "name": "",
        "label": "q3",
        "tooltip": "",
        "group": "79843ca2cb1b627a",
        "order": 0,
        "width": 0,
        "height": 0,
        "passthru": true,
        "outs": "all",
        "topic": "topic",
        "topicType": "msg",
        "min": "-0.41",
        "max": "0.0",
        "step": "0.05",
        "className": "",
        "x": 150,
        "y": 360,
        "wires": [
            [
                "48e2df6bd50518a3"
            ]
        ]
    },
    {
        "id": "48e2df6bd50518a3",
        "type": "change",
        "z": "9a2d82adc13d6477",
        "name": "",
        "rules": [
            {
                "t": "set",
                "p": "temp",
                "pt": "msg",
                "to": "payload",
                "tot": "msg"
            },
            {
                "t": "set",
                "p": "payload",
                "pt": "msg",
                "to": "{\"command\":\"setJointValue\",\"jointName\":\"q3\",\"jointValue\":0}",
                "tot": "json"
            },
            {
                "t": "set",
                "p": "payload.jointValue",
                "pt": "msg",
                "to": "temp",
                "tot": "msg"
            }
        ],
        "action": "",
        "property": "",
        "from": "",
        "to": "",
        "reg": false,
        "x": 340,
        "y": 360,
        "wires": [
            [
                "4fb545e9361dbcf6"
            ]
        ]
    },
    {
        "id": "36485cdc70a42a8a",
        "type": "ui_slider",
        "z": "9a2d82adc13d6477",
        "name": "",
        "label": "q4",
        "tooltip": "",
        "group": "79843ca2cb1b627a",
        "order": 0,
        "width": 0,
        "height": 0,
        "passthru": true,
        "outs": "all",
        "topic": "topic",
        "topicType": "msg",
        "min": "-0.32",
        "max": "0.0",
        "step": "0.05",
        "className": "",
        "x": 150,
        "y": 440,
        "wires": [
            [
                "a3e1887cf70553a6"
            ]
        ]
    },
    {
        "id": "a3e1887cf70553a6",
        "type": "change",
        "z": "9a2d82adc13d6477",
        "name": "",
        "rules": [
            {
                "t": "set",
                "p": "temp",
                "pt": "msg",
                "to": "payload",
                "tot": "msg"
            },
            {
                "t": "set",
                "p": "payload",
                "pt": "msg",
                "to": "{\"command\":\"setJointValue\",\"jointName\":\"q4\",\"jointValue\":0}",
                "tot": "json"
            },
            {
                "t": "set",
                "p": "payload.jointValue",
                "pt": "msg",
                "to": "temp",
                "tot": "msg"
            }
        ],
        "action": "",
        "property": "",
        "from": "",
        "to": "",
        "reg": false,
        "x": 340,
        "y": 440,
        "wires": [
            [
                "4fb545e9361dbcf6"
            ]
        ]
    },
    {
        "id": "e4409692076a20d0",
        "type": "ui_slider",
        "z": "9a2d82adc13d6477",
        "name": "",
        "label": "q5",
        "tooltip": "",
        "group": "79843ca2cb1b627a",
        "order": 0,
        "width": 0,
        "height": 0,
        "passthru": true,
        "outs": "all",
        "topic": "topic",
        "topicType": "msg",
        "min": "0.0",
        "max": "0.14",
        "step": "0.05",
        "className": "",
        "x": 150,
        "y": 520,
        "wires": [
            [
                "5d761257d0543dd9"
            ]
        ]
    },
    {
        "id": "5d761257d0543dd9",
        "type": "change",
        "z": "9a2d82adc13d6477",
        "name": "",
        "rules": [
            {
                "t": "set",
                "p": "temp",
                "pt": "msg",
                "to": "payload",
                "tot": "msg"
            },
            {
                "t": "set",
                "p": "payload",
                "pt": "msg",
                "to": "{\"command\":\"setJointValue\",\"jointName\":\"q5\",\"jointValue\":0}",
                "tot": "json"
            },
            {
                "t": "set",
                "p": "payload.jointValue",
                "pt": "msg",
                "to": "temp",
                "tot": "msg"
            }
        ],
        "action": "",
        "property": "",
        "from": "",
        "to": "",
        "reg": false,
        "x": 340,
        "y": 520,
        "wires": [
            [
                "4fb545e9361dbcf6"
            ]
        ]
    }
]