[
    {
        "id": "2cc826698351d3d2",
        "type": "tab",
        "label": "Flow 1",
        "disabled": false,
        "info": "",
        "env": []
    },
    {
        "id": "50cc8fc8d66bea63",
        "type": "ui_base",
        "theme": {
            "name": "theme-light",
            "lightTheme": {
                "default": "#0094CE",
                "baseColor": "#0094CE",
                "baseFont": "-apple-system,BlinkMacSystemFont,Segoe UI,Roboto,Oxygen-Sans,Ubuntu,Cantarell,Helvetica Neue,sans-serif",
                "edited": true,
                "reset": false
            },
            "darkTheme": {
                "default": "#097479",
                "baseColor": "#097479",
                "baseFont": "-apple-system,BlinkMacSystemFont,Segoe UI,Roboto,Oxygen-Sans,Ubuntu,Cantarell,Helvetica Neue,sans-serif",
                "edited": false
            },
            "customTheme": {
                "name": "Untitled Theme 1",
                "default": "#4B7930",
                "baseColor": "#4B7930",
                "baseFont": "-apple-system,BlinkMacSystemFont,Segoe UI,Roboto,Oxygen-Sans,Ubuntu,Cantarell,Helvetica Neue,sans-serif"
            },
            "themeState": {
                "base-color": {
                    "default": "#0094CE",
                    "value": "#0094CE",
                    "edited": false
                },
                "page-titlebar-backgroundColor": {
                    "value": "#0094CE",
                    "edited": false
                },
                "page-backgroundColor": {
                    "value": "#fafafa",
                    "edited": false
                },
                "page-sidebar-backgroundColor": {
                    "value": "#ffffff",
                    "edited": false
                },
                "group-textColor": {
                    "value": "#1bbfff",
                    "edited": false
                },
                "group-borderColor": {
                    "value": "#ffffff",
                    "edited": false
                },
                "group-backgroundColor": {
                    "value": "#ffffff",
                    "edited": false
                },
                "widget-textColor": {
                    "value": "#111111",
                    "edited": false
                },
                "widget-backgroundColor": {
                    "value": "#0094ce",
                    "edited": false
                },
                "widget-borderColor": {
                    "value": "#ffffff",
                    "edited": false
                },
                "base-font": {
                    "value": "-apple-system,BlinkMacSystemFont,Segoe UI,Roboto,Oxygen-Sans,Ubuntu,Cantarell,Helvetica Neue,sans-serif"
                }
            },
            "angularTheme": {
                "primary": "indigo",
                "accents": "blue",
                "warn": "red",
                "background": "grey",
                "palette": "light"
            }
        },
        "site": {
            "name": "Node-RED Dashboard",
            "hideToolbar": "false",
            "allowSwipe": "false",
            "lockMenu": "false",
            "allowTempTheme": "true",
            "dateFormat": "DD/MM/YYYY",
            "sizes": {
                "sx": 48,
                "sy": 48,
                "gx": 6,
                "gy": 6,
                "cx": 6,
                "cy": 6,
                "px": 0,
                "py": 0
            }
        }
    },
    {
        "id": "ec70ee6110246c75",
        "type": "ui_tab",
        "name": "DSSIPD Assignment",
        "icon": "dashboard",
        "order": 1,
        "disabled": false,
        "hidden": false
    },
    {
        "id": "aa4f5ed992c0cfb5",
        "type": "ui_group",
        "name": "Excavator simulator",
        "tab": "ec70ee6110246c75",
        "order": 1,
        "disp": true,
        "width": 10,
        "collapse": false,
        "className": ""
    },
    {
        "id": "d5d2d7af27b343b9",
        "type": "mqtt-broker",
        "name": "",
        "broker": "broker.emqx.io",
        "port": "1883",
        "clientid": "",
        "autoConnect": true,
        "usetls": false,
        "protocolVersion": "4",
        "keepalive": "60",
        "cleansession": true,
        "birthTopic": "",
        "birthQos": "0",
        "birthPayload": "",
        "birthMsg": {},
        "closeTopic": "",
        "closeQos": "0",
        "closePayload": "",
        "closeMsg": {},
        "willTopic": "",
        "willQos": "0",
        "willPayload": "",
        "willMsg": {},
        "sessionExpiry": ""
    },
    {
        "id": "7e644f086b561b69",
        "type": "ui_link",
        "name": "Simulator_Link",
        "link": "https://rwth-crmasters-sose22.gitlab.io/course-material/excavator-simulator/simple.html",
        "icon": "open_in_browser",
        "target": "newtab",
        "order": 3
    },
    {
        "id": "871856b0203e30a4",
        "type": "ui_text_input",
        "z": "2cc826698351d3d2",
        "name": "",
        "label": "token",
        "tooltip": "",
        "group": "aa4f5ed992c0cfb5",
        "order": 2,
        "width": 0,
        "height": 0,
        "passthru": true,
        "mode": "text",
        "delay": "0",
        "topic": "topic",
        "sendOnBlur": true,
        "className": "",
        "topicType": "msg",
        "x": 70,
        "y": 60,
        "wires": [
            [
                "ada96f7e0b25101e"
            ]
        ]
    },
    {
        "id": "ada96f7e0b25101e",
        "type": "change",
        "z": "2cc826698351d3d2",
        "name": "",
        "rules": [
            {
                "t": "set",
                "p": "token",
                "pt": "msg",
                "to": "payload",
                "tot": "msg"
            }
        ],
        "action": "",
        "property": "",
        "from": "",
        "to": "",
        "reg": false,
        "x": 240,
        "y": 40,
        "wires": [
            [
                "b66de254f20a140d"
            ]
        ]
    },
    {
        "id": "b66de254f20a140d",
        "type": "template",
        "z": "2cc826698351d3d2",
        "name": "",
        "field": "topic",
        "fieldType": "flow",
        "format": "handlebars",
        "syntax": "mustache",
        "template": "rwth/bcma/sessions/{{{token}}}/command",
        "output": "str",
        "x": 440,
        "y": 60,
        "wires": [
            [
                "e71a05c1ea888811"
            ]
        ]
    },
    {
        "id": "e71a05c1ea888811",
        "type": "change",
        "z": "2cc826698351d3d2",
        "name": "",
        "rules": [
            {
                "t": "set",
                "p": "topic",
                "pt": "msg",
                "to": "topic",
                "tot": "flow"
            }
        ],
        "action": "",
        "property": "",
        "from": "",
        "to": "",
        "reg": false,
        "x": 710,
        "y": 260,
        "wires": [
            [
                "9d4cb3330f127920",
                "da65719c1761ab6c"
            ]
        ]
    },
    {
        "id": "2c877551a975ddf5",
        "type": "mqtt out",
        "z": "2cc826698351d3d2",
        "name": "",
        "topic": "",
        "qos": "",
        "retain": "",
        "respTopic": "",
        "contentType": "",
        "userProps": "",
        "correl": "",
        "expiry": "",
        "broker": "d5d2d7af27b343b9",
        "x": 890,
        "y": 480,
        "wires": []
    },
    {
        "id": "e8353571cf45776b",
        "type": "ui_slider",
        "z": "2cc826698351d3d2",
        "name": "",
        "label": "q0",
        "tooltip": "",
        "group": "aa4f5ed992c0cfb5",
        "order": 3,
        "width": 0,
        "height": 0,
        "passthru": true,
        "outs": "all",
        "topic": "topic",
        "topicType": "msg",
        "min": "-1.57",
        "max": "1.57",
        "step": "0.01",
        "className": "",
        "x": 110,
        "y": 180,
        "wires": [
            [
                "a8a1a46afdbbcc09"
            ]
        ]
    },
    {
        "id": "a8a1a46afdbbcc09",
        "type": "change",
        "z": "2cc826698351d3d2",
        "name": "",
        "rules": [
            {
                "t": "set",
                "p": "temp",
                "pt": "msg",
                "to": "payload",
                "tot": "msg"
            },
            {
                "t": "set",
                "p": "payload",
                "pt": "msg",
                "to": "{\"command\":\"setJointValue\",\"jointName\":\"q0\",\"jointValue\":0}",
                "tot": "json"
            },
            {
                "t": "set",
                "p": "payload.jointValue",
                "pt": "msg",
                "to": "temp",
                "tot": "msg"
            }
        ],
        "action": "",
        "property": "",
        "from": "",
        "to": "",
        "reg": false,
        "x": 300,
        "y": 180,
        "wires": [
            [
                "e71a05c1ea888811"
            ]
        ]
    },
    {
        "id": "9d4cb3330f127920",
        "type": "delay",
        "z": "2cc826698351d3d2",
        "name": "",
        "pauseType": "rate",
        "timeout": "5",
        "timeoutUnits": "seconds",
        "rate": "20",
        "nbRateUnits": "1",
        "rateUnits": "second",
        "randomFirst": "1",
        "randomLast": "5",
        "randomUnits": "seconds",
        "drop": false,
        "allowrate": false,
        "outputs": 1,
        "x": 780,
        "y": 360,
        "wires": [
            [
                "2c877551a975ddf5"
            ]
        ]
    },
    {
        "id": "da65719c1761ab6c",
        "type": "debug",
        "z": "2cc826698351d3d2",
        "name": "",
        "active": false,
        "tosidebar": true,
        "console": false,
        "tostatus": false,
        "complete": "true",
        "targetType": "full",
        "statusVal": "",
        "statusType": "auto",
        "x": 890,
        "y": 80,
        "wires": []
    },
    {
        "id": "736615bc67d22dfc",
        "type": "ui_slider",
        "z": "2cc826698351d3d2",
        "name": "",
        "label": "q1",
        "tooltip": "",
        "group": "aa4f5ed992c0cfb5",
        "order": 4,
        "width": 0,
        "height": 0,
        "passthru": true,
        "outs": "all",
        "topic": "topic",
        "topicType": "msg",
        "min": "-0.785",
        "max": "0.785",
        "step": "0.01",
        "className": "",
        "x": 110,
        "y": 260,
        "wires": [
            [
                "762f4fab9aeab2bf"
            ]
        ]
    },
    {
        "id": "0dc84fb0c9e58c10",
        "type": "ui_slider",
        "z": "2cc826698351d3d2",
        "name": "",
        "label": "q2",
        "tooltip": "",
        "group": "aa4f5ed992c0cfb5",
        "order": 5,
        "width": 0,
        "height": 0,
        "passthru": true,
        "outs": "all",
        "topic": "topic",
        "topicType": "msg",
        "min": "-0.2",
        "max": "0",
        "step": "0.01",
        "className": "",
        "x": 110,
        "y": 320,
        "wires": [
            [
                "88a1ddf8aebe87e4"
            ]
        ]
    },
    {
        "id": "abdbb1775a318cbc",
        "type": "ui_slider",
        "z": "2cc826698351d3d2",
        "name": "",
        "label": "q3",
        "tooltip": "",
        "group": "aa4f5ed992c0cfb5",
        "order": 6,
        "width": 0,
        "height": 0,
        "passthru": true,
        "outs": "all",
        "topic": "topic",
        "topicType": "msg",
        "min": "-0.41",
        "max": "0",
        "step": "0.01",
        "className": "",
        "x": 110,
        "y": 380,
        "wires": [
            [
                "3facacb649f3d02b"
            ]
        ]
    },
    {
        "id": "067675faa4084288",
        "type": "ui_slider",
        "z": "2cc826698351d3d2",
        "name": "",
        "label": "q4",
        "tooltip": "",
        "group": "aa4f5ed992c0cfb5",
        "order": 7,
        "width": 0,
        "height": 0,
        "passthru": true,
        "outs": "all",
        "topic": "topic",
        "topicType": "msg",
        "min": "-0.32",
        "max": "0",
        "step": "0.01",
        "className": "",
        "x": 110,
        "y": 440,
        "wires": [
            [
                "01d180c3735f21eb"
            ]
        ]
    },
    {
        "id": "a33da387dd072910",
        "type": "ui_slider",
        "z": "2cc826698351d3d2",
        "name": "",
        "label": "q5",
        "tooltip": "",
        "group": "aa4f5ed992c0cfb5",
        "order": 8,
        "width": 0,
        "height": 0,
        "passthru": true,
        "outs": "all",
        "topic": "topic",
        "topicType": "msg",
        "min": 0,
        "max": "0.14",
        "step": "0.01",
        "className": "",
        "x": 110,
        "y": 500,
        "wires": [
            [
                "bfd4be488a2684cd"
            ]
        ]
    },
    {
        "id": "762f4fab9aeab2bf",
        "type": "change",
        "z": "2cc826698351d3d2",
        "name": "",
        "rules": [
            {
                "t": "set",
                "p": "temp",
                "pt": "msg",
                "to": "payload",
                "tot": "msg"
            },
            {
                "t": "set",
                "p": "payload",
                "pt": "msg",
                "to": "{\"command\":\"setJointValue\",\"jointName\":\"q1\",\"jointValue\":0}",
                "tot": "json"
            },
            {
                "t": "set",
                "p": "payload.jointValue",
                "pt": "msg",
                "to": "temp",
                "tot": "msg"
            }
        ],
        "action": "",
        "property": "",
        "from": "",
        "to": "",
        "reg": false,
        "x": 300,
        "y": 260,
        "wires": [
            [
                "e71a05c1ea888811"
            ]
        ]
    },
    {
        "id": "88a1ddf8aebe87e4",
        "type": "change",
        "z": "2cc826698351d3d2",
        "name": "",
        "rules": [
            {
                "t": "set",
                "p": "temp",
                "pt": "msg",
                "to": "payload",
                "tot": "msg"
            },
            {
                "t": "set",
                "p": "payload",
                "pt": "msg",
                "to": "{\"command\":\"setJointValue\",\"jointName\":\"q2\",\"jointValue\":0}",
                "tot": "json"
            },
            {
                "t": "set",
                "p": "payload.jointValue",
                "pt": "msg",
                "to": "temp",
                "tot": "msg"
            }
        ],
        "action": "",
        "property": "",
        "from": "",
        "to": "",
        "reg": false,
        "x": 300,
        "y": 320,
        "wires": [
            [
                "e71a05c1ea888811"
            ]
        ]
    },
    {
        "id": "3facacb649f3d02b",
        "type": "change",
        "z": "2cc826698351d3d2",
        "name": "",
        "rules": [
            {
                "t": "set",
                "p": "temp",
                "pt": "msg",
                "to": "payload",
                "tot": "msg"
            },
            {
                "t": "set",
                "p": "payload",
                "pt": "msg",
                "to": "{\"command\":\"setJointValue\",\"jointName\":\"q3\",\"jointValue\":0}",
                "tot": "json"
            },
            {
                "t": "set",
                "p": "payload.jointValue",
                "pt": "msg",
                "to": "temp",
                "tot": "msg"
            }
        ],
        "action": "",
        "property": "",
        "from": "",
        "to": "",
        "reg": false,
        "x": 300,
        "y": 380,
        "wires": [
            [
                "e71a05c1ea888811"
            ]
        ]
    },
    {
        "id": "01d180c3735f21eb",
        "type": "change",
        "z": "2cc826698351d3d2",
        "name": "",
        "rules": [
            {
                "t": "set",
                "p": "temp",
                "pt": "msg",
                "to": "payload",
                "tot": "msg"
            },
            {
                "t": "set",
                "p": "payload",
                "pt": "msg",
                "to": "{\"command\":\"setJointValue\",\"jointName\":\"q4\",\"jointValue\":0}",
                "tot": "json"
            },
            {
                "t": "set",
                "p": "payload.jointValue",
                "pt": "msg",
                "to": "temp",
                "tot": "msg"
            }
        ],
        "action": "",
        "property": "",
        "from": "",
        "to": "",
        "reg": false,
        "x": 300,
        "y": 440,
        "wires": [
            [
                "e71a05c1ea888811"
            ]
        ]
    },
    {
        "id": "bfd4be488a2684cd",
        "type": "change",
        "z": "2cc826698351d3d2",
        "name": "",
        "rules": [
            {
                "t": "set",
                "p": "temp",
                "pt": "msg",
                "to": "payload",
                "tot": "msg"
            },
            {
                "t": "set",
                "p": "payload",
                "pt": "msg",
                "to": "{\"command\":\"setJointValue\",\"jointName\":\"q5\",\"jointValue\":0}",
                "tot": "json"
            },
            {
                "t": "set",
                "p": "payload.jointValue",
                "pt": "msg",
                "to": "temp",
                "tot": "msg"
            }
        ],
        "action": "",
        "property": "",
        "from": "",
        "to": "",
        "reg": false,
        "x": 300,
        "y": 500,
        "wires": [
            [
                "e71a05c1ea888811"
            ]
        ]
    },
    {
        "id": "c98cd912ed38934d",
        "type": "ui_text",
        "z": "2cc826698351d3d2",
        "group": "aa4f5ed992c0cfb5",
        "order": 1,
        "width": 0,
        "height": 0,
        "name": "",
        "label": "Copy and Paste your Token and then press Enter",
        "format": "{{msg.payload}}",
        "layout": "col-center",
        "className": "",
        "x": 250,
        "y": 560,
        "wires": []
    }
]