<?xml version="1.0" encoding="UTF-8" standalone="no"?>
<!-- Created with Inkscape (http://www.inkscape.org/) -->

<svg
   width="237.06895mm"
   height="253.82318mm"
   viewBox="0 0 237.06895 253.82318"
   version="1.1"
   id="svg5"
   xmlns="http://www.w3.org/2000/svg"
   xmlns:svg="http://www.w3.org/2000/svg">
  <defs
     id="defs2" />
  <g
     id="layer1"
     transform="translate(82.161401,-18.105751)">
    <path
       style="fill:#010101;stroke:none;stroke-width:0.264583"
       d="m -14.425783,51.793353 h -42.333329 c -7.87816,0 -15.44797,-0.596371 -21.20096,5.831152 -4.43919,4.959879 -4.19904,10.958776 -4.19904,17.187597 V 249.70168 c 0,6.56722 0.13958,13.19318 5.56013,17.87552 5.3176,4.59343 11.38563,4.34948 17.98778,4.34948 H 98.286719 c 5.765011,0 11.693521,0.13388 16.404161,-3.79042 6.34022,-5.28188 6.35,-12.46002 6.35,-20.02208 v -26.9875 h -16.93333 v 33.86667 H -65.225782 V 102.59336 H 104.10755 v 50.79999 h 16.93333 V 82.749601 c 0,-9.801489 1.83754,-21.174603 -7.14375,-27.801356 -5.63509,-4.157663 -12.98971,-3.154892 -19.579161,-3.154892 H 53.307552 C 53.267599,46.978201 52.173812,42.186121 50.284158,37.770437 48.653266,33.959855 46.169622,30.629042 43.253385,27.716271 27.363568,11.845902 -0.80661984,16.231378 -10.914762,36.44752 c -2.378339,4.756917 -3.511021,10.054167 -3.511021,15.345833 M 87.174219,85.660018 H -48.292452 c 0.002,-2.366169 0.42122,-4.710641 1.40547,-6.879166 0.79322,-1.746779 1.87219,-3.339306 3.16812,-4.752181 9.775296,-10.656094 25.297871,-1.105165 36.7014132,-7.124965 4.577556,-2.416704 8.097308,-6.829689 9.141354,-11.935353 0.619654,-3.030273 0.30189,-6.026679 1.362075,-8.995833 1.878277,-5.259361 6.5677518,-9.392999 11.9861538,-10.674773 6.515101,-1.541251 13.266738,0.918951 17.386036,6.176857 3.446992,4.40002 2.785269,8.972284 4.018227,14.022915 1.034786,4.238096 3.601773,7.828756 7.170738,10.308431 11.637169,8.084873 28.813654,-3.135048 38.958573,8.745537 1.150673,1.347523 2.158207,2.852473 2.840832,4.493948 0.859366,2.06666 1.309158,4.380441 1.327679,6.614583 M -48.292452,119.52669 v 16.93333 h 84.66667 v -16.93333 h -84.66667 M 69.976302,136.7246 20.02482,187.26002 70.240885,237.79543 V 204.19335 H 154.90755 V 170.32669 H 70.240885 L 69.976302,136.7246 m -118.268754,16.66875 v 16.93334 H -5.9591158 V 153.39335 H -48.292452 m 0,33.86667 v 16.93333 H -5.9591158 V 187.26002 H -48.292452 m 0,33.86666 v 16.93334 h 67.733336 v -16.93334 z"
       id="path515" />
  </g>
</svg>
