(kicad_pcb (version 20221018) (generator pcbnew)

  (general
    (thickness 1.6)
  )

  (paper "A5")
  (title_block
    (title "TV-Port VGA Stackup")
    (date "2024-01-07")
    (rev "1.1")
  )

  (layers
    (0 "F.Cu" signal)
    (31 "B.Cu" signal)
    (32 "B.Adhes" user "B.Adhesive")
    (33 "F.Adhes" user "F.Adhesive")
    (34 "B.Paste" user)
    (35 "F.Paste" user)
    (36 "B.SilkS" user "B.Silkscreen")
    (37 "F.SilkS" user "F.Silkscreen")
    (38 "B.Mask" user)
    (39 "F.Mask" user)
    (40 "Dwgs.User" user "User.Drawings")
    (41 "Cmts.User" user "User.Comments")
    (42 "Eco1.User" user "User.Eco1")
    (43 "Eco2.User" user "User.Eco2")
    (44 "Edge.Cuts" user)
    (45 "Margin" user)
    (46 "B.CrtYd" user "B.Courtyard")
    (47 "F.CrtYd" user "F.Courtyard")
    (48 "B.Fab" user)
    (49 "F.Fab" user)
    (50 "User.1" user)
    (51 "User.2" user)
    (52 "User.3" user)
    (53 "User.4" user)
    (54 "User.5" user)
    (55 "User.6" user)
    (56 "User.7" user)
    (57 "User.8" user)
    (58 "User.9" user)
  )

  (setup
    (pad_to_mask_clearance 0)
    (aux_axis_origin 80 81.6)
    (pcbplotparams
      (layerselection 0x00010fc_ffffffff)
      (plot_on_all_layers_selection 0x0000000_00000000)
      (disableapertmacros false)
      (usegerberextensions false)
      (usegerberattributes true)
      (usegerberadvancedattributes true)
      (creategerberjobfile true)
      (dashed_line_dash_ratio 12.000000)
      (dashed_line_gap_ratio 3.000000)
      (svgprecision 4)
      (plotframeref false)
      (viasonmask false)
      (mode 1)
      (useauxorigin false)
      (hpglpennumber 1)
      (hpglpenspeed 20)
      (hpglpendiameter 15.000000)
      (dxfpolygonmode true)
      (dxfimperialunits true)
      (dxfusepcbnewfont true)
      (psnegative false)
      (psa4output false)
      (plotreference true)
      (plotvalue true)
      (plotinvisibletext false)
      (sketchpadsonfab false)
      (subtractmaskfromsilk false)
      (outputformat 1)
      (mirror false)
      (drillshape 1)
      (scaleselection 1)
      (outputdirectory "")
    )
  )

  (net 0 "")
  (net 1 "Net-(J1-Pin_1)")
  (net 2 "Net-(J2-Pin_1)")
  (net 3 "Net-(J3-Pin_1)")
  (net 4 "Net-(J4-Pin_1)")
  (net 5 "Net-(J5-Pin_1)")
  (net 6 "Net-(J6-Pin_1)")
  (net 7 "unconnected-(J7-Pin_4-Pad4)")
  (net 8 "unconnected-(J7-Pin_9-Pad9)")
  (net 9 "unconnected-(J7-Pin_11-Pad11)")
  (net 10 "unconnected-(J7-Pin_12-Pad12)")
  (net 11 "unconnected-(J7-Pin_15-Pad15)")

  (footprint "1.Eigenes:PCB_Stack_Pin_2x3mm" (layer "F.Cu")
    (tstamp 0fe50da8-b56a-47a4-a080-6f2ce17b561f)
    (at 81.5 80 90)
    (attr smd)
    (fp_text reference "REF**" (at 0 -2.6 90 unlocked) (layer "F.SilkS") hide
        (effects (font (size 1 1) (thickness 0.15)))
      (tstamp 768c2d1b-784e-4c0c-ab97-5cc871b9e930)
    )
    (fp_text value "PCB_Stack_Pin_2x3mm" (at 0 2.6 90 unlocked) (layer "F.Fab")
        (effects (font (size 1 1) (thickness 0.15)))
      (tstamp 562f5274-246f-42e3-94e3-10c996db7ef5)
    )
    (fp_text user "${REF}" (at 0 4.8 90 unlocked) (layer "F.Fab")
        (effects (font (size 1 1) (thickness 0.15)))
      (tstamp 7f7f1c47-1f6a-4eb7-ab25-d1cae2d82c6c)
    )
    (pad "1" smd rect (at 1.5 0 90) (size 3 2) (layers "F.Cu" "F.Paste" "F.Mask")
      (thermal_bridge_angle 45) (tstamp 694a146a-8e5f-44e3-9912-7f4482da89d7))
  )

  (footprint "1.Eigenes:PCB_Stack_Pin_2x3mm" (layer "F.Cu")
    (tstamp 30024bd5-d33c-48db-a01c-48f49426d092)
    (at 107 80 90)
    (attr smd)
    (fp_text reference "REF**" (at 0 -2.6 90 unlocked) (layer "F.SilkS") hide
        (effects (font (size 1 1) (thickness 0.15)))
      (tstamp 959316bd-4fbe-4694-9803-863a8c2d5c10)
    )
    (fp_text value "PCB_Stack_Pin_2x3mm" (at 0 2.6 90 unlocked) (layer "F.Fab")
        (effects (font (size 1 1) (thickness 0.15)))
      (tstamp 821f6204-4836-472e-a72c-4e9236f455ae)
    )
    (fp_text user "${REF}" (at 0 4.8 90 unlocked) (layer "F.Fab")
        (effects (font (size 1 1) (thickness 0.15)))
      (tstamp 977a8f8a-d849-461a-bd8e-3efa20f0366f)
    )
    (pad "1" smd rect (at 1.5 0 90) (size 3 2) (layers "F.Cu" "F.Paste" "F.Mask")
      (thermal_bridge_angle 45) (tstamp 923de85a-cfb3-4260-bca3-4de65370e816))
  )

  (footprint "1.Eigenes:PCB_Stack_Pin_2x3mm" (layer "F.Cu")
    (tstamp 4e81469c-d860-4483-b095-c45e3ef3187e)
    (at 84.5 80 90)
    (attr smd)
    (fp_text reference "REF**" (at 0 -2.6 90 unlocked) (layer "F.SilkS") hide
        (effects (font (size 1 1) (thickness 0.15)))
      (tstamp b62aa8b7-28d4-49f7-80ad-74f95f8c7166)
    )
    (fp_text value "PCB_Stack_Pin_2x3mm" (at 0 2.6 90 unlocked) (layer "F.Fab")
        (effects (font (size 1 1) (thickness 0.15)))
      (tstamp e2f35de4-a2b1-4f3e-a9b3-1d32ff52e5cc)
    )
    (fp_text user "${REF}" (at 0 4.8 90 unlocked) (layer "F.Fab")
        (effects (font (size 1 1) (thickness 0.15)))
      (tstamp 74916739-639f-4182-8b47-e5bfc8d34b4b)
    )
    (pad "1" smd rect (at 1.5 0 90) (size 3 2) (layers "F.Cu" "F.Paste" "F.Mask")
      (thermal_bridge_angle 45) (tstamp beaf0605-55d3-4a64-a05c-815e1c125556))
  )

  (footprint "1.Eigenes:PCB_Stack_Pin_2x3mm" (layer "F.Cu")
    (tstamp 670ce96e-aa7c-48f1-885a-2e340634ea14)
    (at 110 80 90)
    (attr smd)
    (fp_text reference "REF**" (at 0 -2.6 90 unlocked) (layer "F.SilkS") hide
        (effects (font (size 1 1) (thickness 0.15)))
      (tstamp e55f0d9e-e02c-4f0b-975e-3207ffdc17e7)
    )
    (fp_text value "PCB_Stack_Pin_2x3mm" (at 0 2.6 90 unlocked) (layer "F.Fab")
        (effects (font (size 1 1) (thickness 0.15)))
      (tstamp 97d00139-e05d-4218-833a-686af10170ef)
    )
    (fp_text user "${REF}" (at 0 4.8 90 unlocked) (layer "F.Fab")
        (effects (font (size 1 1) (thickness 0.15)))
      (tstamp 324be64d-e757-48c5-b33a-54eec9ed2110)
    )
    (pad "1" smd rect (at 1.5 0 90) (size 3 2) (layers "F.Cu" "F.Paste" "F.Mask")
      (thermal_bridge_angle 45) (tstamp 517193df-4ab9-4da8-8f17-bd6fcf24168a))
  )

  (footprint "1.Eigenes:DSUB-15-HD_Female_Vertical_P2.29x1.98mm" (layer "F.Cu")
    (tstamp e424f712-0dc9-468f-bcdb-fbc15b328a01)
    (at 98.5 74.8)
    (descr "15-pin D-Sub connector, straight/vertical, THT-mount, female, pitch 2.29x1.98mm, distance of mounting holes 25mm, see https://disti-assets.s3.amazonaws.com/tonar/files/datasheets/16730.pdf")
    (tags "15-pin D-Sub connector straight vertical THT female pitch 2.29x1.98mm mounting holes distance 25mm")
    (property "Sheetfile" "Amiga_TV-Port_VGA_Stackup.kicad_sch")
    (property "Sheetname" "")
    (property "ki_description" "Generic connector, single row, 01x15, script generated (kicad-library-utils/schlib/autogen/connector/)")
    (property "ki_keywords" "connector")
    (path "/87bc0611-6176-43cb-882a-a7bd13eb78a1")
    (attr through_hole)
    (fp_text reference "J7" (at -4.315 -5.33) (layer "F.SilkS") hide
        (effects (font (size 1 1) (thickness 0.15)))
      (tstamp 6b5cca9e-ba97-4d19-933d-f285b12697d3)
    )
    (fp_text value "VGA" (at -4.315 9.29) (layer "F.Fab")
        (effects (font (size 1 1) (thickness 0.15)))
      (tstamp fba8f88c-b1c2-4161-96dc-c36e34b86672)
    )
    (fp_text user "${REFERENCE}" (at -4.315 1.98) (layer "F.Fab")
        (effects (font (size 1 1) (thickness 0.15)))
      (tstamp f659a4f8-3300-417c-9c53-1d8b3f00c5df)
    )
    (fp_line (start -15.7925 5.25) (end -15.7925 -5.25)
      (stroke (width 0.12) (type solid)) (layer "F.SilkS") (tstamp bf26a2a2-88fa-456f-a0fe-c728f035f919))
    (fp_line (start -14.7325 -6.31) (end 14.1175 -6.31)
      (stroke (width 0.12) (type solid)) (layer "F.SilkS") (tstamp 3c113c38-5391-43a9-a857-8f2614c52161))
    (fp_line (start -8.17397 -2.061744) (end -7.345233 2.638256)
      (stroke (width 0.12) (type solid)) (layer "F.SilkS") (tstamp 3dbc9544-1da6-4bfc-b277-b280bc4a93c3))
    (fp_line (start -6.539189 -4.01) (end 5.924189 -4.01)
      (stroke (width 0.12) (type solid)) (layer "F.SilkS") (tstamp 7b17042f-66fe-47a6-891d-05d8b8032315))
    (fp_line (start -5.710452 4.01) (end 5.095452 4.01)
      (stroke (width 0.12) (type solid)) (layer "F.SilkS") (tstamp 0f6f6205-e63f-4259-8df5-fad1afd9f6d2))
    (fp_line (start 3.7575 -7.204338) (end 4.2575 -7.204338)
      (stroke (width 0.12) (type solid)) (layer "F.SilkS") (tstamp 799335ca-ab12-47be-8f4c-8902fbf5f6cb))
    (fp_line (start 4.0075 -6.771325) (end 3.7575 -7.204338)
      (stroke (width 0.12) (type solid)) (layer "F.SilkS") (tstamp 2556c67a-78bb-4b2b-a331-bd1ed9c7260e))
    (fp_line (start 4.2575 -7.204338) (end 4.0075 -6.771325)
      (stroke (width 0.12) (type solid)) (layer "F.SilkS") (tstamp 095e21fd-391e-46be-9868-6426001352e6))
    (fp_line (start 7.55897 -2.061744) (end 6.730233 2.638256)
      (stroke (width 0.12) (type solid)) (layer "F.SilkS") (tstamp 1b9a6298-486b-4cf3-8d4c-040037aa24c3))
    (fp_line (start 14.1175 6.31) (end -14.7325 6.31)
      (stroke (width 0.12) (type solid)) (layer "F.SilkS") (tstamp c2639ffa-a9bc-4790-a625-f72bb7a2a3e9))
    (fp_line (start 15.1775 -5.25) (end 15.1775 5.25)
      (stroke (width 0.12) (type solid)) (layer "F.SilkS") (tstamp 2664a2de-3a51-4f08-8897-0576a9f06a08))
    (fp_arc (start -15.7925 -5.25) (mid -15.482033 -5.999533) (end -14.7325 -6.31)
      (stroke (width 0.12) (type solid)) (layer "F.SilkS") (tstamp f7b82543-94b0-4f09-bbca-b5b5f8cf3ee1))
    (fp_arc (start -14.7325 6.31) (mid -15.482033 5.999533) (end -15.7925 5.25)
      (stroke (width 0.12) (type solid)) (layer "F.SilkS") (tstamp 8a65a0ce-5ded-4a33-a1fc-9a6418ca2c3f))
    (fp_arc (start -8.17397 -2.061744) (mid -7.810823 -3.417028) (end -6.539189 -4.01)
      (stroke (width 0.12) (type solid)) (layer "F.SilkS") (tstamp 2f1231bd-3d0a-411e-9652-099398f31455))
    (fp_arc (start -5.710452 4.01) (mid -6.77748 3.621634) (end -7.345233 2.638256)
      (stroke (width 0.12) (type solid)) (layer "F.SilkS") (tstamp 66852214-df9e-4515-bef4-9acf3add0499))
    (fp_arc (start 5.924189 -4.01) (mid 7.195824 -3.417028) (end 7.55897 -2.061744)
      (stroke (width 0.12) (type solid)) (layer "F.SilkS") (tstamp 4e5e9132-1d8d-4835-93af-3ceaa6a9afa1))
    (fp_arc (start 6.730233 2.638256) (mid 6.16248 3.621634) (end 5.095452 4.01)
      (stroke (width 0.12) (type solid)) (layer "F.SilkS") (tstamp 317965c5-1423-43d3-b4f8-e8003fd6650a))
    (fp_arc (start 14.1175 -6.31) (mid 14.867033 -5.999533) (end 15.1775 -5.25)
      (stroke (width 0.12) (type solid)) (layer "F.SilkS") (tstamp 6b28921e-8450-4700-bc15-7fd5cb41771b))
    (fp_arc (start 15.1775 5.25) (mid 14.867033 5.999533) (end 14.1175 6.31)
      (stroke (width 0.12) (type solid)) (layer "F.SilkS") (tstamp a72bbdf2-24ec-4631-8137-2f1808e68359))
    (fp_line (start -16.2425 -6.78) (end -16.2425 6.77)
      (stroke (width 0.05) (type solid)) (layer "F.CrtYd") (tstamp b938f203-2231-4fba-811c-e544efeacedb))
    (fp_line (start -16.2425 6.77) (end 15.6575 6.77)
      (stroke (width 0.05) (type solid)) (layer "F.CrtYd") (tstamp 01e7ac09-512e-4aaa-b172-a8c555f01f7f))
    (fp_line (start 15.6575 -6.78) (end -16.2425 -6.78)
      (stroke (width 0.05) (type solid)) (layer "F.CrtYd") (tstamp ed661c2a-8259-4f0a-bb3b-13dcd44bf626))
    (fp_line (start 15.6575 6.77) (end 15.6575 -6.78)
      (stroke (width 0.05) (type solid)) (layer "F.CrtYd") (tstamp 9f8d835e-e314-430d-828b-30ee4ba0ef89))
    (fp_line (start -15.7325 5.25) (end -15.7325 -5.25)
      (stroke (width 0.1) (type solid)) (layer "F.Fab") (tstamp ba7f4903-ac4f-4670-9889-74673511449b))
    (fp_line (start -14.7325 -6.25) (end 14.1175 -6.25)
      (stroke (width 0.1) (type solid)) (layer "F.Fab") (tstamp 0e323ac9-ebb8-42cc-b942-06b837dfb7d7))
    (fp_line (start -8.126387 -2.072163) (end -7.29765 2.627837)
      (stroke (width 0.1) (type solid)) (layer "F.Fab") (tstamp e25e3574-7d29-4746-8ff4-25fa343c50f7))
    (fp_line (start -6.550694 -3.95) (end 5.935694 -3.95)
      (stroke (width 0.1) (type solid)) (layer "F.Fab") (tstamp 32f28775-daa8-4e42-9db9-7525b8843bf5))
    (fp_line (start -5.721957 3.95) (end 5.106957 3.95)
      (stroke (width 0.1) (type solid)) (layer "F.Fab") (tstamp 9dbb7d7c-082e-4297-8e06-5c1a43c103c4))
    (fp_line (start 7.511387 -2.072163) (end 6.68265 2.627837)
      (stroke (width 0.1) (type solid)) (layer "F.Fab") (tstamp 83cc8228-5576-4c5e-98c4-901aa6b50124))
    (fp_line (start 14.1175 6.25) (end -14.7325 6.25)
      (stroke (width 0.1) (type solid)) (layer "F.Fab") (tstamp 94c74494-36fb-436e-bc51-19c155426426))
    (fp_line (start 15.1175 -5.25) (end 15.1175 5.25)
      (stroke (width 0.1) (type solid)) (layer "F.Fab") (tstamp 91aaddce-b5db-4693-a334-1f09ec338b9d))
    (fp_arc (start -15.7325 -5.25) (mid -15.439607 -5.957107) (end -14.7325 -6.25)
      (stroke (width 0.1) (type solid)) (layer "F.Fab") (tstamp 28a990f6-e85b-46af-9ec4-101976a0fdf6))
    (fp_arc (start -14.7325 6.25) (mid -15.439607 5.957107) (end -15.7325 5.25)
      (stroke (width 0.1) (type solid)) (layer "F.Fab") (tstamp 52f85d19-0544-42d3-bc86-d55fc1e7ea3e))
    (fp_arc (start -8.126386 -2.072163) (mid -7.776365 -3.37846) (end -6.550694 -3.95)
      (stroke (width 0.1) (type solid)) (layer "F.Fab") (tstamp 1f7a215d-8619-48a7-b235-5c6549a59cc4))
    (fp_arc (start -5.721957 3.95) (mid -6.750417 3.575671) (end -7.297649 2.627837)
      (stroke (width 0.1) (type solid)) (layer "F.Fab") (tstamp 8c738883-e119-4f76-a108-e518b3291706))
    (fp_arc (start 5.935694 -3.95) (mid 7.161362 -3.378459) (end 7.511386 -2.072163)
      (stroke (width 0.1) (type solid)) (layer "F.Fab") (tstamp a0fee631-d522-47a7-aad0-54219e6636e4))
    (fp_arc (start 6.682649 2.627837) (mid 6.135417 3.575671) (end 5.106957 3.95)
      (stroke (width 0.1) (type solid)) (layer "F.Fab") (tstamp c9366114-8164-4d3d-8986-50838e63754c))
    (fp_arc (start 14.1175 -6.25) (mid 14.824607 -5.957107) (end 15.1175 -5.25)
      (stroke (width 0.1) (type solid)) (layer "F.Fab") (tstamp a22c904d-3fd0-487e-9e2a-b1e5d38a7407))
    (fp_arc (start 15.1175 5.25) (mid 14.824607 5.957107) (end 14.1175 6.25)
      (stroke (width 0.1) (type solid)) (layer "F.Fab") (tstamp 75d5b303-5280-45b2-9734-b9e3dd1ff9fd))
    (pad "1" thru_hole oval (at 4.0075 -1.98) (size 1.6 2) (drill 1.3) (layers "*.Cu" "*.Mask")
      (net 1 "Net-(J1-Pin_1)") (pinfunction "Pin_1") (pintype "passive") (tstamp b3d2b48e-ea04-48d9-b98d-45d4c27d76ee))
    (pad "2" thru_hole oval (at 1.7175 -1.98) (size 1.6 2) (drill 1.3) (layers "*.Cu" "*.Mask")
      (net 2 "Net-(J2-Pin_1)") (pinfunction "Pin_2") (pintype "passive") (tstamp 42ebb448-360c-4ea5-bb0c-97c81a96cf86))
    (pad "3" thru_hole oval (at -0.5725 -1.98) (size 1.6 2) (drill 1.3) (layers "*.Cu" "*.Mask")
      (net 3 "Net-(J3-Pin_1)") (pinfunction "Pin_3") (pintype "passive") (tstamp c964da19-1f2c-4973-8cee-25d4d7f0aff1))
    (pad "4" thru_hole oval (at -2.8625 -1.98) (size 1.6 2) (drill 1.3) (layers "*.Cu" "*.Mask")
      (net 7 "unconnected-(J7-Pin_4-Pad4)") (pinfunction "Pin_4") (pintype "passive+no_connect") (tstamp 74a01d10-6e66-46b2-8dfa-92ac3d59e468))
    (pad "5" thru_hole oval (at -5.1525 -1.98) (size 1.6 2) (drill 1.3) (layers "*.Cu" "*.Mask")
      (net 4 "Net-(J4-Pin_1)") (pinfunction "Pin_5") (pintype "passive") (tstamp 78437a98-0732-4541-a5eb-f9964ac5882d))
    (pad "6" thru_hole oval (at 5.1525 0) (size 1.6 2) (drill 1.3) (layers "*.Cu" "*.Mask")
      (net 4 "Net-(J4-Pin_1)") (pinfunction "Pin_6") (pintype "passive") (tstamp 22d07b23-7494-42eb-857d-144333569e2f))
    (pad "7" thru_hole oval (at 2.8625 0) (size 1.6 2) (drill 1.3) (layers "*.Cu" "*.Mask")
      (net 4 "Net-(J4-Pin_1)") (pinfunction "Pin_7") (pintype "passive") (tstamp c72de8b7-cdc8-4911-b1ab-95bd58463f1b))
    (pad "8" thru_hole oval (at 0.5725 0) (size 1.6 2) (drill 1.3) (layers "*.Cu" "*.Mask")
      (net 4 "Net-(J4-Pin_1)") (pinfunction "Pin_8") (pintype "passive") (tstamp 75af9d74-9b23-443f-bf09-b5d8e9bd3a36))
    (pad "9" thru_hole oval (at -1.7175 0) (size 1.6 2) (drill 1.3) (layers "*.Cu" "*.Mask")
      (net 8 "unconnected-(J7-Pin_9-Pad9)") (pinfunction "Pin_9") (pintype "passive+no_connect") (tstamp 16e2c793-28e8-4c84-89f8-8c061aff3ea1))
    (pad "10" thru_hole oval (at -4.0075 0) (size 1.6 2) (drill 1.3) (layers "*.Cu" "*.Mask")
      (net 4 "Net-(J4-Pin_1)") (pinfunction "Pin_10") (pintype "passive") (tstamp 0f2d470a-e064-4bdd-afcb-4a30a9605c58))
    (pad "11" thru_hole oval (at 4.0075 1.98) (size 1.6 2) (drill 1.3) (layers "*.Cu" "*.Mask")
      (net 9 "unconnected-(J7-Pin_11-Pad11)") (pinfunction "Pin_11") (pintype "passive+no_connect") (tstamp 5c21278d-016a-4ff3-9e1a-b6056f0053c7))
    (pad "12" thru_hole oval (at 1.7175 1.98) (size 1.6 2) (drill 1.3) (layers "*.Cu" "*.Mask")
      (net 10 "unconnected-(J7-Pin_12-Pad12)") (pinfunction "Pin_12") (pintype "passive+no_connect") (tstamp 773c4dba-4a5d-4179-87f6-771fbe779f18))
    (pad "13" thru_hole oval (at -0.5725 1.98) (size 1.6 2) (drill 1.3) (layers "*.Cu" "*.Mask")
      (net 5 "Net-(J5-Pin_1)") (pinfunction "Pin_13") (pintype "passive") (tstamp 51e9c683-4817-4847-80c8-430727cf5f57))
    (pad "14" thru_hole oval (at -2.8625 1.98) (size 1.6 2) (drill 1.3) (layers "*.Cu" "*.Mask")
      (net 6 "Net-(J6-Pin_1)") (pinfunction "Pin_14") (pintype "passive") (tstamp 0f6d4970-fd36-4c15-8846-738acbc7d8e7))
    (pad "15" thru_hole oval (at -5.1525 1.98) (size 1.6 2) (drill 1.3) (layers "*.Cu" "*.Mask")
      (net 11 "unconnected-(J7-Pin_15-Pad15)") (pinfunction "Pin_15") (pintype "passive+no_connect") (tstamp 79aad52e-b3ab-42b8-9355-0676c0b12bfb))
    (model "${KICAD6_3DMODEL_DIR}/Connector_Dsub.3dshapes/DSUB-15-HD_Female_Vertical_P2.29x1.98mm_MountingHoles.wrl"
      (offset (xyz 4 2 0))
      (scale (xyz 1 1 1))
      (rotate (xyz 0 0 0))
    )
  )

  (footprint "1.Eigenes:PCB_Stack_Pin_2x3mm" (layer "B.Cu")
    (tstamp 74498270-808a-4271-82ed-eec648480fa5)
    (at 110 80 90)
    (property "Sheetfile" "Amiga_TV-Port_VGA_Stackup.kicad_sch")
    (property "Sheetname" "")
    (property "ki_description" "Generic connector, single row, 01x01, script generated (kicad-library-utils/schlib/autogen/connector/)")
    (property "ki_keywords" "connector")
    (path "/cd1daec3-1595-44c5-b448-25caaf5e613f")
    (attr smd)
    (fp_text reference "J2" (at 0 2.6 270 unlocked) (layer "B.SilkS") hide
        (effects (font (size 1 1) (thickness 0.15)) (justify mirror))
      (tstamp e5002cb3-0a67-4845-9ae7-eded2aef4886)
    )
    (fp_text value "Green" (at -5 0 270 unlocked) (layer "B.Fab")
        (effects (font (size 1 1) (thickness 0.15)) (justify mirror))
      (tstamp 54547a71-57e3-4186-a0f2-1376037211cb)
    )
    (fp_text user "${REF}" (at 0 -4.8 270 unlocked) (layer "B.Fab")
        (effects (font (size 1 1) (thickness 0.15)) (justify mirror))
      (tstamp 19df0657-455b-44ab-b1ad-373a7519814c)
    )
    (pad "1" smd rect (at 1.5 0 90) (size 3 2) (layers "B.Cu" "B.Paste" "B.Mask")
      (net 2 "Net-(J2-Pin_1)") (pinfunction "Pin_1") (pintype "passive") (thermal_bridge_angle 45) (tstamp 9fd06374-d95e-4a10-84be-3fabcbfa7e2e))
  )

  (footprint "1.Eigenes:PCB_Stack_Pin_2x3mm" (layer "B.Cu")
    (tstamp 7c51a759-b22b-4dee-83f7-c3e102c3d164)
    (at 81.5 80 90)
    (property "Sheetfile" "Amiga_TV-Port_VGA_Stackup.kicad_sch")
    (property "Sheetname" "")
    (property "ki_description" "Generic connector, single row, 01x01, script generated (kicad-library-utils/schlib/autogen/connector/)")
    (property "ki_keywords" "connector")
    (path "/ca0d075a-496d-43d1-af1a-ea64e3307994")
    (attr smd)
    (fp_text reference "J3" (at 0 2.6 270 unlocked) (layer "B.SilkS") hide
        (effects (font (size 1 1) (thickness 0.15)) (justify mirror))
      (tstamp 6a3ec073-d719-4841-aac5-0f3c622cf383)
    )
    (fp_text value "Blue" (at -4.5 0 270 unlocked) (layer "B.Fab")
        (effects (font (size 1 1) (thickness 0.15)) (justify mirror))
      (tstamp 0a2e6f92-9882-47b0-9f79-dc27d9631158)
    )
    (fp_text user "${REF}" (at 0 -4.8 270 unlocked) (layer "B.Fab")
        (effects (font (size 1 1) (thickness 0.15)) (justify mirror))
      (tstamp 63d6a21f-266f-4d14-996b-994c4dab95e9)
    )
    (pad "1" smd rect (at 1.5 0 90) (size 3 2) (layers "B.Cu" "B.Paste" "B.Mask")
      (net 3 "Net-(J3-Pin_1)") (pinfunction "Pin_1") (pintype "passive") (thermal_bridge_angle 45) (tstamp d4bc0452-d64e-4752-a0a0-f259ac9d20f4))
  )

  (footprint "1.Eigenes:PCB_Stack_Pin_2x3mm" (layer "B.Cu")
    (tstamp 8be4d21e-7dea-4c96-a931-daa27748d044)
    (at 107 80 90)
    (property "Sheetfile" "Amiga_TV-Port_VGA_Stackup.kicad_sch")
    (property "Sheetname" "")
    (property "ki_description" "Generic connector, single row, 01x01, script generated (kicad-library-utils/schlib/autogen/connector/)")
    (property "ki_keywords" "connector")
    (path "/0d1fb4a0-50c5-40df-ab68-50d097c4f0ea")
    (attr smd)
    (fp_text reference "J1" (at 0 2.6 270 unlocked) (layer "B.SilkS") hide
        (effects (font (size 1 1) (thickness 0.15)) (justify mirror))
      (tstamp e2503c28-ff38-4387-9725-f953c57c080a)
    )
    (fp_text value "Red" (at -5 0 270 unlocked) (layer "B.Fab")
        (effects (font (size 1 1) (thickness 0.15)) (justify mirror))
      (tstamp 653982f5-85b0-4be2-b0ac-fe8c43176a86)
    )
    (fp_text user "${REF}" (at 0 -4.8 270 unlocked) (layer "B.Fab")
        (effects (font (size 1 1) (thickness 0.15)) (justify mirror))
      (tstamp 0642ce2a-b2b8-44cf-a0de-f255d6ccd503)
    )
    (pad "1" smd rect (at 1.5 0 90) (size 3 2) (layers "B.Cu" "B.Paste" "B.Mask")
      (net 1 "Net-(J1-Pin_1)") (pinfunction "Pin_1") (pintype "passive") (thermal_bridge_angle 45) (tstamp 7b290cd8-afc2-40a9-8f97-32fa83f212cd))
  )

  (footprint "1.Eigenes:PCB_Stack_Pin_2x3mm" (layer "B.Cu")
    (tstamp 96d4add5-c230-411f-b1e0-3a46fae42710)
    (at 90.5 80 90)
    (property "Sheetfile" "Amiga_TV-Port_VGA_Stackup.kicad_sch")
    (property "Sheetname" "")
    (property "ki_description" "Generic connector, single row, 01x01, script generated (kicad-library-utils/schlib/autogen/connector/)")
    (property "ki_keywords" "connector")
    (path "/8e8d5c82-72bd-4ada-96cc-e254035cb781")
    (attr smd)
    (fp_text reference "J5" (at 0 2.6 270 unlocked) (layer "B.SilkS") hide
        (effects (font (size 1 1) (thickness 0.15)) (justify mirror))
      (tstamp 14dc9b80-b19a-4216-a7f5-4a04442a193b)
    )
    (fp_text value "HSync" (at -5.5 0 270 unlocked) (layer "B.Fab")
        (effects (font (size 1 1) (thickness 0.15)) (justify mirror))
      (tstamp 2b6b5cff-289a-4ecb-80dd-8d2610914c31)
    )
    (fp_text user "${REF}" (at 0 -4.8 270 unlocked) (layer "B.Fab")
        (effects (font (size 1 1) (thickness 0.15)) (justify mirror))
      (tstamp 4e79c323-cc41-4766-88c6-8b6136f8c40c)
    )
    (pad "1" smd rect (at 1.5 0 90) (size 3 2) (layers "B.Cu" "B.Paste" "B.Mask")
      (net 5 "Net-(J5-Pin_1)") (pinfunction "Pin_1") (pintype "passive") (thermal_bridge_angle 45) (tstamp 0c38ad00-711b-4720-acbf-89121b59f3dd))
  )

  (footprint "1.Eigenes:PCB_Stack_Pin_2x3mm" (layer "B.Cu")
    (tstamp b500afcb-18e8-4c59-9129-e480c5d77f4f)
    (at 87.5 80 90)
    (property "Sheetfile" "Amiga_TV-Port_VGA_Stackup.kicad_sch")
    (property "Sheetname" "")
    (property "ki_description" "Generic connector, single row, 01x01, script generated (kicad-library-utils/schlib/autogen/connector/)")
    (property "ki_keywords" "connector")
    (path "/e2655d3f-856a-428c-8f7e-9103ba104e10")
    (attr smd)
    (fp_text reference "J6" (at 0 2.6 270 unlocked) (layer "B.SilkS") hide
        (effects (font (size 1 1) (thickness 0.15)) (justify mirror))
      (tstamp ae2986e1-dd81-476f-8fde-1ae0839732b4)
    )
    (fp_text value "VSync" (at -4.5 0 270 unlocked) (layer "B.Fab")
        (effects (font (size 1 1) (thickness 0.15)) (justify mirror))
      (tstamp 5aab3396-b9ae-4856-bcbf-6c12ec7a1595)
    )
    (fp_text user "${REF}" (at 0 -4.8 270 unlocked) (layer "B.Fab")
        (effects (font (size 1 1) (thickness 0.15)) (justify mirror))
      (tstamp 0f4b0686-ebfe-489b-8678-265f44c9fabb)
    )
    (pad "1" smd rect (at 1.5 0 90) (size 3 2) (layers "B.Cu" "B.Paste" "B.Mask")
      (net 6 "Net-(J6-Pin_1)") (pinfunction "Pin_1") (pintype "passive") (thermal_bridge_angle 45) (tstamp 9ff3d9d9-4515-4f2f-a750-8b9060f0d531))
  )

  (footprint "1.Eigenes:PCB_Stack_Pin_2x3mm" (layer "B.Cu")
    (tstamp ba86c460-3414-44be-81bc-91f91caab5df)
    (at 84.5 80 90)
    (property "Sheetfile" "Amiga_TV-Port_VGA_Stackup.kicad_sch")
    (property "Sheetname" "")
    (property "ki_description" "Generic connector, single row, 01x01, script generated (kicad-library-utils/schlib/autogen/connector/)")
    (property "ki_keywords" "connector")
    (path "/eddd034a-30da-4992-aede-f1d9c1e64e11")
    (attr smd)
    (fp_text reference "J4" (at 0 2.6 270 unlocked) (layer "B.SilkS") hide
        (effects (font (size 1 1) (thickness 0.15)) (justify mirror))
      (tstamp fac5d16e-324e-4bbf-9fac-8293d2a29c98)
    )
    (fp_text value "Gnd" (at -4.5 0 270 unlocked) (layer "B.Fab")
        (effects (font (size 1 1) (thickness 0.15)) (justify mirror))
      (tstamp 32da2240-2ff5-49e2-aa77-746abc3a3394)
    )
    (fp_text user "${REF}" (at 0 -4.8 270 unlocked) (layer "B.Fab")
        (effects (font (size 1 1) (thickness 0.15)) (justify mirror))
      (tstamp fcf0acb1-9c01-44c1-a25b-87c1f35d38f1)
    )
    (pad "1" smd rect (at 1.5 0 90) (size 3 2) (layers "B.Cu" "B.Paste" "B.Mask")
      (net 4 "Net-(J4-Pin_1)") (pinfunction "Pin_1") (pintype "passive") (thermal_bridge_angle 45) (tstamp 3a42c7e8-c4a7-4e90-ab20-013e100bace8))
  )

  (gr_line (start 86 82.5) (end 86 69)
    (stroke (width 0.15) (type default)) (layer "Dwgs.User") (tstamp 2a51398f-9397-4511-bbd6-7513092d253d))
  (gr_line (start 86 69) (end 110 69)
    (stroke (width 0.15) (type default)) (layer "Dwgs.User") (tstamp 7907be61-3d3c-4e01-a90a-4e91fda02188))
  (gr_line (start 111 82.5) (end 111 82)
    (stroke (width 0.15) (type default)) (layer "Dwgs.User") (tstamp 86dc5d78-6491-4efd-9533-e67071b7626f))
  (gr_line (start 86 82.5) (end 111 82.5)
    (stroke (width 0.15) (type default)) (layer "Dwgs.User") (tstamp bd98d010-59c3-4ba9-82cb-bb19849ce010))
  (gr_line (start 111 70) (end 80 70)
    (stroke (width 0.1) (type default)) (layer "Edge.Cuts") (tstamp 07bf2dd6-f9c4-482b-8847-8db5c4bc5b00))
  (gr_line (start 109.1 81.6) (end 109.1 80)
    (stroke (width 0.1) (type default)) (layer "Edge.Cuts") (tstamp 089de93b-469c-4564-ad19-07964980a939))
  (gr_line (start 80 81.6) (end 81.9 81.6)
    (stroke (width 0.1) (type default)) (layer "Edge.Cuts") (tstamp 25058f9f-0b15-4ccd-bf83-f622a1428f37))
  (gr_line (start 81.9 80) (end 109.1 80)
    (stroke (width 0.1) (type default)) (layer "Edge.Cuts") (tstamp 2f35ee36-2695-4187-ab3e-66f3f4cf4bda))
  (gr_line (start 111 81.6) (end 109.1 81.6)
    (stroke (width 0.1) (type default)) (layer "Edge.Cuts") (tstamp 545ce4de-55cb-4755-ade7-5b992d4364dc))
  (gr_line (start 111 80) (end 111 70)
    (stroke (width 0.1) (type default)) (layer "Edge.Cuts") (tstamp b677c1ea-b81f-4fd8-a68b-eff8f293e62d))
  (gr_line (start 81.9 81.6) (end 81.9 80)
    (stroke (width 0.1) (type default)) (layer "Edge.Cuts") (tstamp b7726fbf-a302-4a2d-a5d1-b3090533b64b))
  (gr_line (start 80 70) (end 80 80)
    (stroke (width 0.1) (type default)) (layer "Edge.Cuts") (tstamp c1f520ed-93e3-470f-b47e-85eaea2a035c))
  (gr_line (start 80 80) (end 80 81.6)
    (stroke (width 0.1) (type default)) (layer "Edge.Cuts") (tstamp e2c1bd47-aea3-4d48-b41c-15b61ae6da4a))
  (gr_line (start 111 80) (end 111 81.6)
    (stroke (width 0.1) (type default)) (layer "Edge.Cuts") (tstamp fec4ad44-73c9-4a3e-ac15-bf98f802dd40))
  (gr_text "TV-Port VGA Stackup v${REVISION}" (at 106.3625 71.4375) (layer "B.SilkS") (tstamp 02f919dd-181c-4563-b64e-fd66b067a069)
    (effects (font (size 1 1) (thickness 0.15)) (justify left bottom mirror))
  )
  (dimension (type aligned) (layer "Dwgs.User") (tstamp 4b2c504d-717e-4fda-942c-551db5717ba2)
    (pts (xy 80 70) (xy 111 70))
    (height -5)
    (gr_text "31,0 mm" (at 95.5 63.85) (layer "Dwgs.User") (tstamp 4b2c504d-717e-4fda-942c-551db5717ba2)
      (effects (font (size 1 1) (thickness 0.15)))
    )
    (format (prefix "") (suffix "") (units 3) (units_format 1) (precision 1))
    (style (thickness 0.15) (arrow_length 1.27) (text_position_mode 0) (extension_height 0.58642) (extension_offset 0.5) keep_text_aligned)
  )
  (dimension (type aligned) (layer "Dwgs.User") (tstamp b73e9ce9-c268-441b-871e-90b61fc84b20)
    (pts (xy 111 80) (xy 111 70))
    (height 5)
    (gr_text "10,0 mm" (at 114.85 75 90) (layer "Dwgs.User") (tstamp b73e9ce9-c268-441b-871e-90b61fc84b20)
      (effects (font (size 1 1) (thickness 0.15)))
    )
    (format (prefix "") (suffix "") (units 3) (units_format 1) (precision 1))
    (style (thickness 0.15) (arrow_length 1.27) (text_position_mode 0) (extension_height 0.58642) (extension_offset 0.5) keep_text_aligned)
  )
  (dimension (type orthogonal) (layer "Dwgs.User") (tstamp b113a973-ea80-4134-975e-f781a80a602f)
    (pts (xy 80 81.6) (xy 86 82.5))
    (height 3.4)
    (orientation 0)
    (gr_text "6,0 mm" (at 83 83.85) (layer "Dwgs.User") (tstamp b113a973-ea80-4134-975e-f781a80a602f)
      (effects (font (size 1 1) (thickness 0.15)))
    )
    (format (prefix "") (suffix "") (units 3) (units_format 1) (precision 1))
    (style (thickness 0.15) (arrow_length 1.27) (text_position_mode 0) (extension_height 0.58642) (extension_offset 0.5) keep_text_aligned)
  )

  (segment (start 107 75.9125) (end 107 78.5) (width 0.6) (layer "B.Cu") (net 1) (tstamp 09536347-3c3a-4989-bb7e-eadbe308d738))
  (segment (start 102.5075 72.82) (end 103.9075 72.82) (width 0.6) (layer "B.Cu") (net 1) (tstamp 438a3f38-a496-48ed-8d4f-1f27844eb2a7))
  (segment (start 103.9075 72.82) (end 107 75.9125) (width 0.6) (layer "B.Cu") (net 1) (tstamp fe46a011-0f53-4b12-925e-417784ee3bcb))
  (segment (start 100.2175 72.0825) (end 101.5 70.8) (width 0.6) (layer "B.Cu") (net 2) (tstamp 504e2200-b17c-4b7c-8dca-15175221455e))
  (segment (start 104.4 70.8) (end 110 76.4) (width 0.6) (layer "B.Cu") (net 2) (tstamp 8a3fef0a-fe2e-4504-8576-377ae4641bc5))
  (segment (start 101.5 70.8) (end 104.4 70.8) (width 0.6) (layer "B.Cu") (net 2) (tstamp b1ae7504-f884-4c77-8f64-a9fd7f78ba92))
  (segment (start 100.2175 72.82) (end 100.2175 72.0825) (width 0.6) (layer "B.Cu") (net 2) (tstamp be83d527-1b91-4f84-be02-c33db1b1cbf3))
  (segment (start 110 76.4) (end 110 78.5) (width 0.6) (layer "B.Cu") (net 2) (tstamp dcc15c63-a311-4af3-936f-2066faab2b2c))
  (segment (start 81.5 76) (end 81.5 78.5) (width 0.6) (layer "B.Cu") (net 3) (tstamp 1a7028e7-7480-4955-be4b-1fe41534e9f7))
  (segment (start 97.9275 71.7275) (end 97 70.8) (width 0.6) (layer "B.Cu") (net 3) (tstamp 5f644d5c-51c5-42c2-835b-9d0f6918c206))
  (segment (start 86.7 70.8) (end 97 70.8) (width 0.6) (layer "B.Cu") (net 3) (tstamp 89f4dc62-3b64-4ebd-b651-b3b0adc83cf3))
  (segment (start 86.7 70.8) (end 81.5 76) (width 0.6) (layer "B.Cu") (net 3) (tstamp f063f6dc-1b22-4676-923b-50b267264568))
  (segment (start 97.9275 72.82) (end 97.9275 71.7275) (width 0.6) (layer "B.Cu") (net 3) (tstamp f98f6c00-6bc5-4aa9-9528-132d18edca34))
  (segment (start 104 74.8) (end 105 73.8) (width 0.6) (layer "F.Cu") (net 4) (tstamp 4a2179b3-ecc4-4e8c-8787-5a54b3173127))
  (segment (start 103.5 70.8) (end 94.5 70.8) (width 0.6) (layer "F.Cu") (net 4) (tstamp 69e0ef63-433f-47d1-934f-282c90250fe0))
  (segment (start 103.6525 74.8) (end 104 74.8) (width 0.6) (layer "F.Cu") (net 4) (tstamp 829832a3-6e60-4fe2-90de-a95b95094708))
  (segment (start 93.3475 71.9525) (end 93.3475 72.82) (width 0.6) (layer "F.Cu") (net 4) (tstamp 873eb100-6329-48c3-b922-7c41cc07ccc4))
  (segment (start 105 73.8) (end 105 72.3) (width 0.6) (layer "F.Cu") (net 4) (tstamp 89afc74e-2dcd-489c-9073-bfd2a7305d8b))
  (segment (start 105 72.3) (end 103.5 70.8) (width 0.6) (layer "F.Cu") (net 4) (tstamp a50af522-df58-47b9-bed3-58b1aa451aae))
  (segment (start 94.5 70.8) (end 93.3475 71.9525) (width 0.6) (layer "F.Cu") (net 4) (tstamp c24a0304-92ff-4dde-946b-9dfce60184bc))
  (segment (start 93.3475 74.6475) (end 93.5 74.8) (width 0.6) (layer "B.Cu") (net 4) (tstamp 201ffa00-9793-4a54-8aae-d4411567400e))
  (segment (start 94.4925 74.8) (end 93.5 74.8) (width 0.6) (layer "B.Cu") (net 4) (tstamp 639800c7-b0f4-469a-b001-a3a046aa9738))
  (segment (start 86.8525 74.6475) (end 93.3475 74.6475) (width 0.6) (layer "B.Cu") (net 4) (tstamp 8f880264-41a4-415c-8705-5a140e62ae3e))
  (segment (start 101.3625 74.8) (end 99.0725 74.8) (width 0.6) (layer "B.Cu") (net 4) (tstamp c01a5665-61c9-4741-9325-2f21f5500d38))
  (segment (start 93.3475 72.82) (end 93.3475 74.6475) (width 0.6) (layer "B.Cu") (net 4) (tstamp e60de41a-4f4d-43be-aae1-7b6d20a9d3fb))
  (segment (start 84.5 77) (end 84.5 78.5) (width 0.6) (layer "B.Cu") (net 4) (tstamp f6bb9d28-c202-41bd-af48-1f92f10d11ff))
  (segment (start 103.6525 74.8) (end 101.3625 74.8) (width 0.6) (layer "B.Cu") (net 4) (tstamp f8575dd6-ee20-43a3-92de-94871fb3b4e5))
  (segment (start 86.8525 74.6475) (end 84.5 77) (width 0.6) (layer "B.Cu") (net 4) (tstamp ff416d8d-fc1e-4397-9a55-cf5cbe52b6b1))
  (segment (start 96.2075 78.5) (end 97.9275 76.78) (width 0.6) (layer "B.Cu") (net 5) (tstamp 1e66130f-148b-4ed4-8a70-b6e8d8a5262c))
  (segment (start 90.5 78.5) (end 96.2075 78.5) (width 0.6) (layer "B.Cu") (net 5) (tstamp 9a3231c2-a25a-4a06-ae0c-96eaf3304c16))
  (segment (start 95.6375 77.4) (end 94.615 78.4225) (width 0.6) (layer "F.Cu") (net 6) (tstamp 3741cf07-2a16-4acc-8c9c-913a1dbc61c4))
  (segment (start 94.615 78.4225) (end 92.075 78.4225) (width 0.6) (layer "F.Cu") (net 6) (tstamp 5846cea3-6f24-448d-923f-9719ad017d41))
  (segment (start 89.535 75.8825) (end 88.5825 75.8825) (width 0.6) (layer "F.Cu") (net 6) (tstamp 63b6d90e-2c52-418f-8b6f-2383fa6315a3))
  (segment (start 95.6375 76.78) (end 95.6375 77.4) (width 0.6) (layer "F.Cu") (net 6) (tstamp d3e0b236-2067-4972-a156-e70f7d8bcdfe))
  (segment (start 92.075 78.4225) (end 89.535 75.8825) (width 0.6) (layer "F.Cu") (net 6) (tstamp f44b6ea9-76b6-4c1d-9148-11fc6de969e5))
  (via (at 89.535 75.8825) (size 0.8) (drill 0.4) (layers "F.Cu" "B.Cu") (net 6) (tstamp 153da8b3-6fa1-416f-a922-b6c40562150f))
  (via (at 88.5825 75.8825) (size 0.8) (drill 0.4) (layers "F.Cu" "B.Cu") (net 6) (tstamp 4ca647f0-5763-45d4-8137-a752add8d5b7))
  (segment (start 87.5 78.5) (end 87.5 76.965) (width 0.6) (layer "B.Cu") (net 6) (tstamp 1d231449-5a5a-4e32-9888-6ef7910ed5da))
  (segment (start 87.5 76.965) (end 88.5825 75.8825) (width 0.6) (layer "B.Cu") (net 6) (tstamp 57079352-fc9f-4ca0-b30c-6ce9eb4d3353))
  (segment (start 95.6375 76.78) (end 95.6375 77.1625) (width 0.6) (layer "B.Cu") (net 6) (tstamp 965d57cc-a210-458f-8c81-4a1d5efdc5c1))
  (segment (start 89.535 75.8825) (end 88.5825 75.8825) (width 0.6) (layer "B.Cu") (net 6) (tstamp a51a2057-d496-4ce9-8fea-e08ca952f176))

)
