{
  "development": {
    "username": "review-api",
    "password": 123456,
    "database": "movie_database",
    "host": "localhost",
    "dialect": "postgres"
  },
  "test": {
    "username": "review-api",
    "password": 123456,
    "database": "movie_database_test",
    "host": "localhost",
    "dialect": "postgres"
  },
  "production": {
    "username": "review-api",
    "password": 123456,
    "database": "movie_database_production",
    "host": "localhost",
    "dialect": "postgres"
  }
}
