{
  "theme": {
    "type": "default",
    "value": "lightBaseTheme",
    "logo" : "https://entgra.io/assets/images/svg/logo.svg",
    "primaryColor": "rgb(24, 144, 255)",
    "footerText": "©2019 entgra.io"
  },
  "serverConfig": {
    "invoker": {
      "contextPath" : "/store-ui-request-handler",
      "uri": "/store-ui-request-handler/invoke",
      "publisher": "/application-mgt-publisher/v1.0",
      "store": "/application-mgt-store/v1.0",
      "admin" : "",
      "deviceMgt" : "/device-mgt/v1.0"
    },
    "loginUri": "/store-ui-request-handler/login",
    "logoutUri": "/store-ui-request-handler/logout",
    "platform": "store"
  },
  "defaultPlatformIcons": {
    "default": {
      "icon": "global",
      "color": "#535c68",
      "theme": "outlined"
    },
    "android": {
      "icon": "android",
      "color": "#7db343",
      "theme": "filled"
    },
    "ios": {
      "icon": "apple",
      "color": "#535c68",
      "theme": "filled"
    },
    "windows": {
      "icon": "windows",
      "color": "#008cc4",
      "theme": "filled"
    }
  }
}
