Distance (in)	Pull Force 1 (lb)
0	3.35
0.001	2.99
0.003	2.78
0.004	2.61
0.006	2.35
0.009	2.09
0.013	1.88
0.019	1.55
0.025	1.31
0.038	0.96
0.05	0.73
0.063	0.56
0.075	0.44
0.088	0.35
0.1	0.28
0.113	0.23
0.125	0.18
