1.000000000000000000e+01
1.466471150213532937e+01
1.664356663246515211e+01
1.585106562370603456e+01
1.306324860682910405e+01
1.000000000000000000e+01
2.752409412815901746e+01
2.608202654786505548e+01
1.000000000000000000e+01
3.032075999999999993e+01
4.043113999999999919e+01
4.994151999999999703e+01
5.954151999999999845e+01
6.884152000000000271e+01
7.814151999999999987e+01
5.544151999999999703e+01
6.554152000000000555e+01
9.056228000000000122e+01
9.817477042468103487e-02
0.000000000000000000e+00
0.000000000000000000e+00
0.000000000000000000e+00
4.908738521234051744e-02
4.908738521234051744e-02
0.000000000000000000e+00
0.000000000000000000e+00
0.000000000000000000e+00
