# FreeCAD v0.16 build6706 (Git) Arch module
# http://www.freecadweb.org
o Pocket
v 92.0 52.0 0.0
v -92.0 52.0 0.0
v -92.0 52.0 2.0
v 92.0 52.0 2.0
v -92.0 -52.0 0.0
v -92.0 -52.0 2.0
v -7.649088 -9.246159 0.0
v -9.708204 -7.053423 0.0
v -5.109351 -10.857925 0.0
v -11.157318 -4.417495 0.0
v -2.248576 -11.787447 0.0
v -11.905376 -1.503999 0.0
v 0.753486 -11.976321 0.0
v -11.905376 1.503999 0.0
v -11.157318 4.417495 0.0
v -9.708204 7.053423 0.0
v -7.649088 9.246159 0.0
v -5.109351 10.857925 0.0
v -2.248576 11.787447 0.0
v 0.753486 11.976321 0.0
v 11.622998 -2.984279 0.0
v 12.0 0.0 0.0
v 92.0 -52.0 0.0
v 10.51568 -5.781044 0.0
v 8.747624 -8.214565 0.0
v 6.429922 -10.131935 0.0
v 3.708204 -11.412678 0.0
v 3.708204 11.412678 0.0
v 6.429922 10.131935 0.0
v 8.747624 8.214565 0.0
v 10.51568 5.781044 0.0
v 11.622998 2.984279 0.0
v 92.0 52.0 22.0
v -92.0 52.0 22.0
v 92.0 -52.0 2.0
v -92.0 -52.0 22.0
v 3.708204 11.412678 -60.0
v 11.622998 -2.984279 -60.0
v 12.0 0.0 -60.0
v 6.429922 10.131935 -60.0
v 8.747624 8.214565 -60.0
v 10.51568 5.781044 -60.0
v 10.51568 -5.781044 -60.0
v 8.747624 -8.214565 -60.0
v 11.622998 2.984279 -60.0
v 6.429922 -10.131935 -60.0
v 3.708204 -11.412678 -60.0
v 0.753486 -11.976321 -60.0
v -2.248576 -11.787447 -60.0
v -5.109351 -10.857925 -60.0
v -7.649088 -9.246159 -60.0
v -9.708204 -7.053423 -60.0
v -11.157318 -4.417495 -60.0
v -11.905376 -1.503999 -60.0
v -11.905376 1.503999 -60.0
v -11.157318 4.417495 -60.0
v -9.708204 7.053423 -60.0
v -7.649088 9.246159 -60.0
v -5.109351 10.857925 -60.0
v -2.248576 11.787447 -60.0
v 0.753486 11.976321 -60.0
v -90.0 -50.0 22.0
v -90.0 50.0 22.0
v 90.0 -50.0 22.0
v 92.0 -52.0 22.0
v 90.0 50.0 22.0
v -1.873813 9.822873 -60.0
v 0.627905 9.980267 -60.0
v 9.685832 -2.486899 -60.0
v 10.0 0.0 -60.0
v -6.37424 -7.705132 -60.0
v 3.09017 9.510565 -60.0
v -8.09017 -5.877853 -60.0
v -4.257793 -9.048271 -60.0
v 9.685832 2.486899 -60.0
v -9.297765 -3.681246 -60.0
v 5.358268 8.443279 -60.0
v 8.763067 4.817537 -60.0
v -1.873813 -9.822873 -60.0
v 7.289686 6.845471 -60.0
v -9.921147 -1.253332 -60.0
v 0.627905 -9.980267 -60.0
v -9.921147 1.253332 -60.0
v 3.09017 -9.510565 -60.0
v -9.297765 3.681246 -60.0
v 5.358268 -8.443279 -60.0
v -8.09017 5.877853 -60.0
v 7.289686 -6.845471 -60.0
v -6.37424 7.705132 -60.0
v 8.763067 -4.817537 -60.0
v -4.257793 9.048271 -60.0
v -90.0 50.0 2.0
v 90.0 50.0 2.0
v 90.0 -50.0 2.0
v -90.0 -50.0 2.0
v 0.627905 -9.980267 2.0
v 3.09017 -9.510565 2.0
v 5.358268 -8.443279 2.0
v 9.685832 2.486899 2.0
v 10.0 0.0 2.0
v 7.289686 -6.845471 2.0
v 8.763067 4.817537 2.0
v 8.763067 -4.817537 2.0
v 7.289686 6.845471 2.0
v 9.685832 -2.486899 2.0
v 5.358268 8.443279 2.0
v 3.09017 9.510565 2.0
v 0.627905 9.980267 2.0
v -1.873813 9.822873 2.0
v -4.257793 9.048271 2.0
v -6.37424 7.705132 2.0
v -8.09017 5.877853 2.0
v -9.297765 3.681246 2.0
v -9.921147 1.253332 2.0
v -9.921147 -1.253332 2.0
v -9.297765 -3.681246 2.0
v -8.09017 -5.877853 2.0
v -6.37424 -7.705132 2.0
v -4.257793 -9.048271 2.0
v -1.873813 -9.822873 2.0
f 1 2 3
f 1 3 4
f 2 5 6
f 2 6 3
f 7 5 8
f 5 7 9
f 8 5 10
f 5 9 11
f 10 5 12
f 5 11 13
f 5 2 14
f 12 5 14
f 14 2 15
f 15 2 16
f 16 2 17
f 17 2 18
f 18 2 19
f 19 2 20
f 21 22 23
f 24 21 23
f 25 24 23
f 26 25 23
f 27 26 23
f 13 27 23
f 5 13 23
f 28 20 1
f 29 28 1
f 30 29 1
f 31 30 1
f 32 31 1
f 22 32 1
f 23 22 1
f 20 2 1
f 33 3 34
f 4 3 33
f 23 1 4
f 23 4 35
f 5 23 35
f 5 35 6
f 3 6 36
f 3 36 34
f 37 20 28
f 38 39 22
f 37 28 29
f 40 37 29
f 38 22 21
f 40 29 30
f 41 40 30
f 42 41 30
f 43 38 24
f 38 21 24
f 42 30 31
f 44 43 25
f 42 31 32
f 45 42 32
f 43 24 25
f 39 45 32
f 39 32 22
f 46 44 26
f 44 25 26
f 47 46 27
f 46 26 27
f 48 47 13
f 49 48 13
f 47 27 13
f 49 13 11
f 50 49 9
f 51 50 9
f 49 11 9
f 51 9 7
f 52 51 8
f 51 7 8
f 53 52 10
f 54 53 10
f 52 8 10
f 54 10 12
f 54 12 14
f 55 54 14
f 55 14 15
f 56 55 15
f 56 15 16
f 57 56 16
f 57 16 17
f 58 57 17
f 58 17 18
f 59 58 18
f 60 59 18
f 60 18 19
f 60 19 20
f 61 60 20
f 37 61 20
f 34 62 63
f 34 36 62
f 64 36 65
f 64 62 36
f 33 66 64
f 33 64 65
f 33 34 63
f 33 63 66
f 35 4 33
f 35 33 65
f 36 35 65
f 6 35 36
f 67 60 68
f 38 69 39
f 69 70 39
f 50 51 71
f 68 60 61
f 72 68 61
f 51 52 73
f 71 51 73
f 49 50 74
f 70 75 45
f 50 71 74
f 39 70 45
f 52 53 76
f 77 72 37
f 72 61 37
f 73 52 76
f 75 78 42
f 49 74 79
f 45 75 42
f 80 77 40
f 77 37 40
f 49 79 48
f 53 54 81
f 80 40 41
f 78 80 41
f 42 78 41
f 76 53 81
f 48 79 82
f 54 55 83
f 81 54 83
f 48 82 47
f 47 82 84
f 55 56 85
f 83 55 85
f 47 84 46
f 46 84 86
f 56 57 87
f 85 56 87
f 86 88 44
f 46 86 44
f 87 57 89
f 89 57 58
f 44 88 43
f 88 90 43
f 89 58 91
f 91 58 59
f 91 59 67
f 43 90 38
f 90 69 38
f 67 59 60
f 63 92 93
f 66 63 93
f 66 93 94
f 64 66 94
f 64 94 95
f 62 64 95
f 62 95 92
f 63 62 92
f 84 96 97
f 84 97 98
f 86 84 98
f 75 70 99
f 78 75 99
f 70 100 99
f 86 98 101
f 88 86 101
f 90 88 101
f 78 99 102
f 90 101 103
f 80 78 104
f 90 103 105
f 77 80 104
f 69 90 105
f 78 102 104
f 70 69 105
f 70 105 100
f 77 104 106
f 72 77 107
f 77 106 107
f 68 72 108
f 72 107 108
f 67 68 109
f 68 108 109
f 91 67 110
f 67 109 110
f 89 91 111
f 91 110 111
f 87 89 112
f 85 87 112
f 89 111 112
f 85 112 113
f 85 113 114
f 83 85 114
f 83 114 115
f 81 83 115
f 76 81 115
f 76 115 116
f 76 116 117
f 73 76 117
f 73 117 118
f 71 73 118
f 74 71 118
f 74 118 119
f 74 119 120
f 79 74 120
f 79 120 96
f 82 79 96
f 84 82 96
f 117 95 118
f 119 118 95
f 116 95 117
f 120 119 95
f 115 95 116
f 96 120 95
f 114 92 95
f 114 95 115
f 113 92 114
f 112 92 113
f 111 92 112
f 110 92 111
f 109 92 110
f 108 92 109
f 94 97 96
f 94 98 97
f 94 101 98
f 94 103 101
f 94 105 103
f 94 100 105
f 94 96 95
f 93 99 100
f 93 102 99
f 93 104 102
f 93 106 104
f 93 107 106
f 93 108 107
f 93 100 94
f 93 92 108
