# I (A)	A_d()	B_d()	delta{B_d}	A_p()	delta{A_p}	Ap yint est	Ap yint std	Ap slope est	Ap slope std	10% w	90% w	Ak est	Ak std
0.000000000000000000e+00	1.366991681368754304e+37	-2.197813018768540161e+01	1.608181117910875457e+01	inf	nan	nan	nan	nan	nan	1.130986208970039707e-05	2.851715151777127434e-04	nan	nan
1.000000000000000021e-03	8.651398572762299954e-01	-4.366662918831408779e-01	1.200602536373087004e+00	1.643586847274218599e+03	5.027578396725361927e+02	-1.083291330716146028e+01	nan	2.737331212317220164e+01	nan	1.789248752840673492e-04	3.854973188972114252e-03	1.690188874439348468e-02	7.471994603609574031e-04
2.000000000000000042e-03	5.319459789273845729e+01	-1.394990404064981204e+00	5.292267266688849281e-01	9.222788779243902582e+02	9.523863993120241389e+01	-4.873445712120424211e+00	nan	1.541155627406116935e+01	nan	2.604127869879743675e-04	3.819799734639174171e-03	9.461486891674618649e-01	3.063429221774203928e-03
3.000000000000000062e-03	3.144823215162484420e+00	-6.914168363419221919e-01	7.783796568586748288e-01	6.677159321329314707e+02	8.263733035009705929e+01	-4.952597737865938932e+00	nan	1.111031173385659443e+01	nan	1.544819291271551376e-04	4.405352609802961131e-03	5.822729180101358926e-02	1.874578080225631702e-03
4.000000000000000083e-03	1.859936577295695415e+01	-1.015942068866524384e+00	4.455823875153727687e-01	7.594521444074998726e+02	4.628782200931048152e+01	-4.728577208459477710e+00	nan	1.267129873546241114e+01	nan	2.542754677242510812e-04	6.138103629292721020e-03	3.318460877941006859e-01	5.632373103284018037e-03
5.000000000000000104e-03	2.070908635128882180e-01	7.535113822872573086e-02	5.757355581886488549e-01	6.224118194124123420e+02	3.316922955775778803e+01	-3.420831786098962546e+00	nan	1.039040499437178688e+01	nan	2.051434596681246062e-04	6.216053312508643992e-03	3.966260962667132739e-03	2.712838185757609241e-04
6.000000000000000125e-03	9.885042457792593495e+01	-1.333990988457046889e+00	2.838878773119016818e-01	7.126810260535065709e+02	5.197955878818225983e+01	-2.764382518670125854e+00	nan	1.182070288829991611e+01	nan	1.713881797741375723e-04	8.039579287639269864e-03	1.710056443307815366e+00	5.875568301138957804e-03
7.000000000000000146e-03	7.820691782882543919e+01	-1.224734330208638200e+00	1.497680746979443978e-01	7.584725791098957188e+02	2.505642549698976396e+01	-3.495262971054335033e+00	nan	1.264887544230135319e+01	nan	2.736507537123871099e-04	1.021242246278925535e-02	1.359522318024425580e+00	1.014836483863676767e-02
8.000000000000000167e-03	2.837808095517686979e+02	-1.473602610255161149e+00	1.864850508513266059e-01	8.697536115002925499e+02	5.215520007545886472e+01	-5.325879156658932523e+00	nan	1.446314626427851024e+01	nan	1.758634388582719409e-04	1.330643104685076336e-02	4.918981569642082441e+00	2.837673271771091674e-02
8.999999999999999320e-03	8.779605017937301170e+01	-1.196432311857553055e+00	1.055345896576236064e-01	7.464440461541985314e+02	1.971142350975183888e+01	-3.617083459647543187e+00	nan	1.242902522969084878e+01	nan	2.664991363211054566e-04	1.310273012653490401e-02	1.532623866583680661e+00	1.334318951627363851e-02
1.000000000000000021e-02	4.175716291137766234e+01	-1.048476600251335933e+00	2.329522320705513239e-01	5.830132266608629834e+02	3.637765596026487458e+01	-2.457272817041435964e+00	nan	9.778999630928888465e+00	nan	1.941162155955414347e-03	1.117638460448996604e-02	7.272804340968779258e-01	1.124458905352245311e-02
1.099999999999999936e-02	3.611449914969094266e+01	-9.743813875639009137e-01	1.989004341504591600e-01	6.282109817742242512e+02	3.121111544207244393e+01	-3.106087506491540307e+00	nan	1.054804582759078002e+01	nan	2.671136025097725283e-03	1.306089347508224488e-02	6.371410278531457472e-01	1.204853744783273770e-02
1.200000000000000025e-02	4.921839739911202116e+01	-1.002210744727633607e+00	1.407523242298963084e-01	7.009607754321900757e+02	3.724313143005149840e+01	-3.414579937049809999e+00	nan	1.165394598799264791e+01	nan	2.795964403160708118e-03	1.587931570073726831e-02	8.688030692427515245e-01	1.530159979005222236e-02
1.299999999999999940e-02	1.067670750201252758e+03	-1.764520515711829995e+00	1.719989496380399663e-01	6.028468939695529798e+02	2.872951290060854035e+01	-3.134189855539731617e+00	nan	1.009185342855024814e+01	nan	2.803714954415496841e-03	1.504841206583941091e-02	1.816250253646455093e+01	3.433375024982436297e-01
1.400000000000000029e-02	5.270242002455098884e+01	-1.000204805440587652e+00	1.701348145289627023e-01	6.461038070875378025e+02	3.022735750553674450e+01	-3.315985753468222441e+00	nan	1.080708071778196455e+01	nan	3.174733693651057061e-03	1.715784649071110460e-02	9.266644491033062536e-01	1.640728773412259214e-02
1.499999999999999944e-02	1.784947252312776129e+02	-1.285633961896198940e+00	1.698273411750313988e-01	6.298083611164053082e+02	3.031000192037916108e+01	-3.681329593161966507e+00	nan	1.053597168520651550e+01	nan	3.826385963639873482e-03	1.818728332990126803e-02	3.101472557701505650e+00	1.540257085649327819e-02
1.600000000000000033e-02	2.093234961568579138e+02	-1.322272487669551522e+00	1.952018836304766358e-01	6.005391813437223618e+02	2.890478343648224069e+01	-3.780688920794017083e+00	nan	1.001694467872398242e+01	nan	3.645730651511522487e-03	1.863247621258968395e-02	3.663179667873390777e+00	1.368786836367177732e-02
1.700000000000000122e-02	9.718841062980857259e+01	-1.128085371403739323e+00	1.588802595549205776e-01	5.813639008326824751e+02	3.043923717001811724e+01	-3.456861995995065495e+00	nan	9.686769955647015706e+00	nan	3.934327959505360198e-03	1.892018739387573215e-02	1.706010833778758951e+00	2.011663512054277445e-02
1.799999999999999864e-02	7.472944487981445718e+02	-1.586840964464964809e+00	1.053863523953788711e-01	6.294604644298063931e+02	2.280588196117160038e+01	-3.384840629565621928e+00	nan	1.049666453040659242e+01	nan	4.249732318489279209e-03	2.157632852866746970e-02	1.271537219556312515e+01	1.361090609379805305e-01
1.899999999999999953e-02	5.674452437085573138e+02	-1.515588808925886211e+00	1.334054419240365830e-01	6.163096294794096366e+02	1.997582563351681983e+01	-4.012771041510566405e+00	nan	1.031407774056596338e+01	nan	3.951107003949671896e-03	2.260303445929651156e-02	9.825501763142687750e+00	7.401977299534907850e-02
2.000000000000000042e-02	1.522679761204808813e+02	-1.184237148565732811e+00	1.087646355277241406e-01	6.155800869228503416e+02	1.860468730543072624e+01	-3.217085575532546482e+00	nan	1.032460594110631824e+01	nan	4.716523271129220013e-03	2.342414073623675860e-02	2.672392051244373512e+00	2.471789126538113598e-02
2.100000000000000130e-02	2.933554957672567980e+02	-1.320290016248818477e+00	7.369041234240422678e-02	6.445179951825076614e+02	1.493549676778665258e+01	-3.366636257720981185e+00	nan	1.078510259143695649e+01	nan	4.746873102849747360e-03	2.570464380530500942e-02	5.118444283212737034e+00	1.941490028616318572e-02
2.199999999999999872e-02	1.835727313021476448e+02	-1.203285294764012914e+00	1.088276494738861094e-01	6.264480089280185666e+02	1.698811296403091120e+01	-2.890701585497120529e+00	nan	1.056299020040217229e+01	nan	4.180049488920698983e-03	2.582119392109639283e-02	3.233309585516058959e+00	2.716880995148270722e-02
2.299999999999999961e-02	1.184261988405458794e+02	-1.085690920469884135e+00	5.303012752924642775e-02	6.250735497194708614e+02	1.193312469140909826e+01	-3.301013607713602305e+00	nan	1.043423627325514857e+01	nan	5.089716997512077484e-03	2.747014132568208894e-02	2.087482883932681332e+00	2.868067413941362623e-02
2.400000000000000050e-02	6.638548547370397728e+02	-1.490654355755079985e+00	8.129553762230740110e-02	6.278596219703831594e+02	1.512535772201448836e+01	-3.672299284436932432e+00	nan	1.053569112459108403e+01	nan	5.086903723295846218e-03	2.862302709380589588e-02	1.142046541877917676e+01	7.389315628408291148e-02
2.500000000000000139e-02	2.486376467792495362e+02	-1.236514036519245741e+00	6.188969705158711004e-02	6.429652106419458732e+02	1.429904693037908991e+01	-2.721729567911054470e+00	nan	1.073127174429883723e+01	nan	5.095373025093802299e-03	3.021107160887963328e-02	4.318673398985514389e+00	3.005147559926500331e-02
2.999999999999999889e-02	5.901867932744553400e+02	-1.407297361324024720e+00	5.560042340535203964e-02	6.292427717914431469e+02	1.317456983446285435e+01	-3.218938431952528489e+00	nan	1.052465577151534504e+01	nan	6.490868713204357016e-03	3.568024685924232886e-02	1.018163314979490153e+01	3.560775783132541505e-02
3.500000000000000333e-02	3.408786178752513365e+02	-1.243193609769595254e+00	6.447523355534079403e-02	6.130881016077903496e+02	1.347775817391549324e+01	-3.082820617995559065e+00	nan	1.025891346026850570e+01	nan	7.398876427733690891e-03	4.085292485688441638e-02	5.924484117933428884e+00	3.954636416808198635e-02
4.000000000000000083e-02	2.917201089233927291e+02	-1.168813153688695428e+00	4.478587083736387114e-02	6.252358734011457955e+02	1.004441463099843546e+01	-3.178116991654201140e+00	nan	1.044508383362377124e+01	nan	8.038482117788842488e-03	4.826935232665901382e-02	5.097507892581773170e+00	5.067842176527810605e-02
4.499999999999999833e-02	2.727479808381153816e+02	-1.120335522586265453e+00	3.921135004690914222e-02	6.348424003360045162e+02	1.047302651243948546e+01	-3.310558670823068095e+00	nan	1.058969501614366671e+01	nan	7.976916857216027890e-03	5.574778740592148396e-02	4.777830825473878384e+00	5.803291290764048260e-02
5.000000000000000278e-02	2.307878090435380045e+02	-1.055420477590742312e+00	3.954692177661571495e-02	6.319132948873702844e+02	1.026932179541508283e+01	-3.203972154675764017e+00	nan	1.054602105192116035e+01	nan	8.419570796866254758e-03	6.287520405040183946e-02	4.054663570222000857e+00	6.138439534976244255e-02
5.500000000000000028e-02	3.370243289807151541e+02	-1.123032374180962245e+00	3.544249855862448284e-02	6.346429075389520449e+02	9.512793853548231482e+00	-3.146717789873498816e+00	nan	1.061369140679026302e+01	nan	1.258549454210568241e-02	6.997457720887814703e-02	5.902325741116035474e+00	7.096241626656935031e-02
5.999999999999999778e-02	3.893238349667304874e+02	-1.139628701657351417e+00	3.591485844754446072e-02	6.283545187401790599e+02	8.586801789614478153e+00	-2.796604297234191794e+00	nan	1.051326776657074724e+01	nan	1.002761109759403406e-02	7.639772853392878815e-02	6.821742125789081790e+00	7.684521521227186125e-02
6.500000000000000222e-02	3.741265594018958609e+02	-1.112195959700688297e+00	3.638001401102103349e-02	6.245178495813190693e+02	8.525496962280312729e+00	-3.217456942885998039e+00	nan	1.043734403782091036e+01	nan	1.126732723224880932e-02	8.210958298856832482e-02	6.567310817687244118e+00	8.221959508433863972e-02
7.000000000000000666e-02	7.021392630636645436e+02	-1.246730624535536069e+00	3.940734622906877371e-02	6.246249401846044975e+02	8.753360014961968361e+00	-3.427023727956545862e+00	nan	1.044539318788333482e+01	nan	1.401731726382103582e-02	8.651467739898154041e-02	1.224742685491927929e+01	7.992909091361445617e-02
7.499999999999999722e-02	5.224056528490607434e+02	-1.157311346559932508e+00	4.098436524245280266e-02	6.268608517888549159e+02	9.543892159996429925e+00	-2.957450654172635751e+00	nan	1.049756000472302198e+01	nan	1.329010536008622470e-02	9.521639414618517094e-02	9.143346714743264769e+00	9.565246765501683734e-02
8.000000000000000167e-02	5.841172725664902146e+02	-1.169440997072882293e+00	3.240328440594182624e-02	6.248894479700641114e+02	8.427626754808056120e+00	-3.273902214427873325e+00	nan	1.043703186766567725e+01	nan	1.403044406680293253e-02	1.004700049477834783e-01	1.021550287711686344e+01	1.012715278391164431e-01
8.500000000000000611e-02	6.239787554986086207e+02	-1.172020810925175072e+00	3.728431702414852777e-02	6.208600006778731313e+02	8.689993478516136349e+00	-2.868411679068271436e+00	nan	1.040942251286203302e+01	nan	1.047013629787511141e-02	1.067831516381545220e-01	1.089809625307550789e+01	1.067725443566206606e-01
8.999999999999999667e-02	4.807713528344461906e+02	-1.092539937746000778e+00	3.333470176390274098e-02	6.276944794022692804e+02	8.751039265433433911e+00	-2.990775705760457370e+00	nan	1.050558163054939875e+01	nan	1.301134557997960309e-02	1.127515448126156505e-01	8.435110576852073550e+00	1.132291628450683846e-01
9.500000000000000111e-02	6.311912846540830060e+02	-1.147635181937078031e+00	3.491307256683306992e-02	6.225618282832043633e+02	8.423211924947732854e+00	-3.106814194311280364e+00	nan	1.040369532916064621e+01	nan	1.165929226728809956e-02	1.180690391213595758e-01	1.105688430893387419e+01	1.205245155281014641e-01
