1.381447409988844122e+01
1.314197746441920600e+01
1.479251096818868305e+01
1.432964790338225924e+01
1.432964790338225924e+01
1.484130442988812071e+01
1.417050503162839448e+01
1.262892050706803992e+01
1.000000000000000000e+01
2.454403468369079633e+01
2.442075977822586808e+01
3.457334999999999781e+01
4.273632961189527180e+01
5.154151999999999845e+01
6.059929999999999950e+01
6.968339000000000283e+01
7.846228000000000691e+01
8.717265999999999337e+01
9.527785000000000082e+01
7.326227933467760067e+01
0.000000000000000000e+00
8.726646259971647390e-02
0.000000000000000000e+00
0.000000000000000000e+00
0.000000000000000000e+00
0.000000000000000000e+00
0.000000000000000000e+00
0.000000000000000000e+00
0.000000000000000000e+00
0.000000000000000000e+00
