# I (A)	A_d()	B_d()	delta{B_d}	A_p()	delta{A_p}	Ap yint est	Ap yint std	Ap slope est	Ap slope std	10% w	90% w	Ak est	Ak std
0.000000000000000000e+00	1.366991681368754304e+37	-2.197813018768540161e+01	1.608181117910875457e+01	inf	nan	nan	nan	nan	nan	1.130986208970039707e-05	2.851715151777127434e-04	nan	nan
5.000000000000000104e-03	2.070908635128882180e-01	7.535113822872573086e-02	5.757355581886488549e-01	6.224118194124123420e+02	3.316922955775778803e+01	-3.420831786098962546e+00	nan	1.039040499437178688e+01	nan	2.051434596681246062e-04	6.216053312508643992e-03	3.966260962667132739e-03	2.712838185757609241e-04
1.000000000000000021e-02	4.175716291137766234e+01	-1.048476600251335933e+00	2.329522320705513239e-01	5.830132266608629834e+02	3.637765596026487458e+01	-2.457272817041435964e+00	nan	9.778999630928888465e+00	nan	1.941162155955414347e-03	1.117638460448996604e-02	7.272804340968779258e-01	1.124458905352245311e-02
1.499999999999999944e-02	1.784947252312776129e+02	-1.285633961896198940e+00	1.698273411750313988e-01	6.298083611164053082e+02	3.031000192037916108e+01	-3.681329593161966507e+00	nan	1.053597168520651550e+01	nan	3.826385963639873482e-03	1.818728332990126803e-02	3.101472557701505650e+00	1.540257085649327819e-02
2.000000000000000042e-02	1.522679761204808813e+02	-1.184237148565732811e+00	1.087646355277241406e-01	6.155800869228503416e+02	1.860468730543072624e+01	-3.217085575532546482e+00	nan	1.032460594110631824e+01	nan	4.716523271129220013e-03	2.342414073623675860e-02	2.672392051244373512e+00	2.471789126538113598e-02
2.500000000000000139e-02	2.486376467792495362e+02	-1.236514036519245741e+00	6.188969705158711004e-02	6.429652106419458732e+02	1.429904693037908991e+01	-2.721729567911054470e+00	nan	1.073127174429883723e+01	nan	5.095373025093802299e-03	3.021107160887963328e-02	4.318673398985514389e+00	3.005147559926500331e-02
2.999999999999999889e-02	5.901867932744553400e+02	-1.407297361324024720e+00	5.560042340535203964e-02	6.292427717914431469e+02	1.317456983446285435e+01	-3.218938431952528489e+00	nan	1.052465577151534504e+01	nan	6.490868713204357016e-03	3.568024685924232886e-02	1.018163314979490153e+01	3.560775783132541505e-02
3.500000000000000333e-02	3.408786178752513365e+02	-1.243193609769595254e+00	6.447523355534079403e-02	6.130881016077903496e+02	1.347775817391549324e+01	-3.082820617995559065e+00	nan	1.025891346026850570e+01	nan	7.398876427733690891e-03	4.085292485688441638e-02	5.924484117933428884e+00	3.954636416808198635e-02
4.000000000000000083e-02	2.917201089233927291e+02	-1.168813153688695428e+00	4.478587083736387114e-02	6.252358734011457955e+02	1.004441463099843546e+01	-3.178116991654201140e+00	nan	1.044508383362377124e+01	nan	8.038482117788842488e-03	4.826935232665901382e-02	5.097507892581773170e+00	5.067842176527810605e-02
4.499999999999999833e-02	2.727479808381153816e+02	-1.120335522586265453e+00	3.921135004690914222e-02	6.348424003360045162e+02	1.047302651243948546e+01	-3.310558670823068095e+00	nan	1.058969501614366671e+01	nan	7.976916857216027890e-03	5.574778740592148396e-02	4.777830825473878384e+00	5.803291290764048260e-02
5.000000000000000278e-02	2.307878090435380045e+02	-1.055420477590742312e+00	3.954692177661571495e-02	6.319132948873702844e+02	1.026932179541508283e+01	-3.203972154675764017e+00	nan	1.054602105192116035e+01	nan	8.419570796866254758e-03	6.287520405040183946e-02	4.054663570222000857e+00	6.138439534976244255e-02
5.500000000000000028e-02	3.370243289807151541e+02	-1.123032374180962245e+00	3.544249855862448284e-02	6.346429075389520449e+02	9.512793853548231482e+00	-3.146717789873498816e+00	nan	1.061369140679026302e+01	nan	1.258549454210568241e-02	6.997457720887814703e-02	5.902325741116035474e+00	7.096241626656935031e-02
5.999999999999999778e-02	3.893238349667304874e+02	-1.139628701657351417e+00	3.591485844754446072e-02	6.283545187401790599e+02	8.586801789614478153e+00	-2.796604297234191794e+00	nan	1.051326776657074724e+01	nan	1.002761109759403406e-02	7.639772853392878815e-02	6.821742125789081790e+00	7.684521521227186125e-02
6.500000000000000222e-02	3.741265594018958609e+02	-1.112195959700688297e+00	3.638001401102103349e-02	6.245178495813190693e+02	8.525496962280312729e+00	-3.217456942885998039e+00	nan	1.043734403782091036e+01	nan	1.126732723224880932e-02	8.210958298856832482e-02	6.567310817687244118e+00	8.221959508433863972e-02
7.000000000000000666e-02	7.021392630636645436e+02	-1.246730624535536069e+00	3.940734622906877371e-02	6.246249401846044975e+02	8.753360014961968361e+00	-3.427023727956545862e+00	nan	1.044539318788333482e+01	nan	1.401731726382103582e-02	8.651467739898154041e-02	1.224742685491927929e+01	7.992909091361445617e-02
7.499999999999999722e-02	5.224056528490607434e+02	-1.157311346559932508e+00	4.098436524245280266e-02	6.268608517888549159e+02	9.543892159996429925e+00	-2.957450654172635751e+00	nan	1.049756000472302198e+01	nan	1.329010536008622470e-02	9.521639414618517094e-02	9.143346714743264769e+00	9.565246765501683734e-02
8.000000000000000167e-02	5.841172725664902146e+02	-1.169440997072882293e+00	3.240328440594182624e-02	6.248894479700641114e+02	8.427626754808056120e+00	-3.273902214427873325e+00	nan	1.043703186766567725e+01	nan	1.403044406680293253e-02	1.004700049477834783e-01	1.021550287711686344e+01	1.012715278391164431e-01
8.500000000000000611e-02	6.239787554986086207e+02	-1.172020810925175072e+00	3.728431702414852777e-02	6.208600006778731313e+02	8.689993478516136349e+00	-2.868411679068271436e+00	nan	1.040942251286203302e+01	nan	1.047013629787511141e-02	1.067831516381545220e-01	1.089809625307550789e+01	1.067725443566206606e-01
8.999999999999999667e-02	4.807713528344461906e+02	-1.092539937746000778e+00	3.333470176390274098e-02	6.276944794022692804e+02	8.751039265433433911e+00	-2.990775705760457370e+00	nan	1.050558163054939875e+01	nan	1.301134557997960309e-02	1.127515448126156505e-01	8.435110576852073550e+00	1.132291628450683846e-01
9.500000000000000111e-02	6.311912846540830060e+02	-1.147635181937078031e+00	3.491307256683306992e-02	6.225618282832043633e+02	8.423211924947732854e+00	-3.106814194311280364e+00	nan	1.040369532916064621e+01	nan	1.165929226728809956e-02	1.180690391213595758e-01	1.105688430893387419e+01	1.205245155281014641e-01
1.000000000000000056e-01	1.552968128136677933e+03	-1.360868763534145431e+00	5.031965192744267124e-02	6.019885563055826196e+02	1.173264315211777387e+01	-3.515078121663681276e+00	nan	1.003234885947646937e+01	nan	2.699358100292882298e-02	1.079402799521022027e-01	2.686485924957054294e+01	8.137435654752213365e-02
