Date,Headline,Sentiment Score
01/04/21,"15M Doses Of JNJ COVID-19 Vaccine Batch Ruined After Ingredient Issues At Emergent Biosolutions' US Plant: NYT
",0.0
01/04/21,"Tesla, GameStop, Johnson & Johnson, Dogecoin: What to Watch When the Market Opens
",0.0
01/04/21,"Johnson & Johnson stock underperforms Thursday when compared to competitors
",0.0
02/04/21,"FDA investigating cause of bad batch of Johnson & Johnson COVID-19 vaccine
",-0.6999999999999998
04/04/21,"US Puts Johnson & Johnson In Charge Of Troubled Vaccine Plant In Baltimore, Removes AstraZeneca
",-0.5
04/04/21,"Johnson & Johnson’s Covid-19 Vaccine Emerges as Preferred Shot for Homeless
",0.0
05/04/21,"Johnson & Johnson stock rises Monday, still underperforms market
",0.0
06/04/21,"Johnson & Johnson stock falls Tuesday, still outperforms market
",0.0
07/04/21,"Johnson & Johnson stock rises Wednesday, still underperforms market
",0.0
08/04/21,"Johnson Matthey sees FY 2021 at top end of views
",0.5
08/04/21,"Johnson Matthey leads FTSE after optimistic update, while AstraZeneca sees strength
",0.0
08/04/21,"Johnson & Johnson stock falls Thursday, underperforms market
",0.0
09/04/21,"Johnson & Johnson's COVID-19 Vaccine Under Review At EMA For Blood Clots, AstraZeneca Probe Expanded
",0.0
09/04/21,"Johnson Controls to acquire Canada's Silent-Aire for up to $870 million
",0.0
09/04/21,"Johnson & Johnson stock underperforms Friday when compared to competitors
",0.0
10/04/21,"Why Authorities Are Putting The Brakes on Johnson & Johnson's Vaccine In Several States
",0.0
12/04/21,"Johnson & Johnson: Don't Miss This Chance
",0.0
12/04/21,"Johnson & Johnson Provides Portfolio Ballast
",0.0
13/04/21,"How Does Johnson & Johnson's Debt Look?
",0.0
13/04/21,"US to pause Johnson & Johnson Covid-19 vaccine after blood clot death
",0.0
13/04/21,"FDA Recommends Pause In Use Of Johnson & Johnson's COVID-19 Vaccine On Blood Clot Concerns
",0.0
13/04/21,"S&P 500 ends at record as stocks shake off JNJ vaccine pause and bond-yield slide
",0.0
13/04/21,"NovoCure, Fastenal, FedEx, Johnson & Johnson: What to Watch When the Stock Market Opens Today
",0.0
13/04/21,"Price Over Earnings Overview: Johnson & Johnson
",0.0
13/04/21,"Johnson & Johnson to temporarily halt rollout of Covid vaccines in Europe
",0.0
13/04/21,"Johnson & Johnson pause ‘will not have a significant impact on our vaccination plan,’ White House says
",0.1875
13/04/21,"FDA, CDC Officials Discuss Johnson & Johnson Vaccine: A 'Pause Recommendation', Resolution Timeline And Advisory
",0.0
13/04/21,"Johnson & Johnson Covid-19 Vaccine Pause Disrupts Appointments in New York Region
",0.13636363636363635
13/04/21,"Johnson & Johnson vaccine pause won’t hurt shot momentum, McConnell hopes
",0.0
13/04/21,"Johnson & Johnson stock falls Tuesday, underperforms market
",0.0
13/04/21,"Johnson & Johnson Vaccine Pause: What to Know If You Got or Scheduled the Shot
",0.0
14/04/21,"Decision Delayed on Whether to Resume Johnson & Johnson Vaccine
",0.0
14/04/21,"Johnson & Johnson Vaccine Pause Sparks Scrambles Across Country 
",0.0
14/04/21,"Johnson & Johnson stock underperforms Wednesday when compared to competitors despite daily gains
",0.0
14/04/21,"Airlines fill middle seats against the CDC’s advice and the Johnson & Johnson saga reveals vulnerabilities in COVID-19 vaccine strategy
",0.0
14/04/21,"Johnson & Johnson: CDC Recommends Vaccine Halt Amid Blood Clot Scare
",0.0
15/04/21,"Johnson & Johnson stock rises Thursday, still underperforms market
",0.0
20/04/21,"Johnson & Johnson Beat Q1 Earnings, Boosts 2021 Guidance; Reports $100M In COVID-19 Vaccine Sales
",0.0
20/04/21,"Johnson & Johnson 2021 Q1 - Results - Earnings Call Presentation
",0.0
20/04/21,"The Daily Biotech Pulse: Q1 Beat From Johnson & Johnson, KalVista Study Placed On Hold, European Label Expansion For GW Pharma's Epidiolex
",0.0
20/04/21,"Johnson & Johnson Just Reported Earnings. This Number Is Critical.
",0.0
20/04/21,"Strong Results From IBM And Johnson & Johnson Not Enough As Covid Worries Rise
",0.21666666666666665
20/04/21,"Johnson & Johnson vaccine should get blood-clot warning, European agency says
",0.0
20/04/21,"Johnson & Johnson Shows Health Economy Is Nearing Full Strength 
",0.35
20/04/21,"Johnson & Johnson’s Covid-19 Vaccine Adds $100 Million to Quarterly Sales 
",0.0
20/04/21,"EMA Finds Potential Blood Clot Link With JNJ COVID-19 Shot, Adds Safety Warning
",0.0
20/04/21,"Johnson & Johnson (JNJ) CEO Alex Gorsky on Q1 2021 Results - Earnings Call Transcript
",0.0
20/04/21,"Johnson & Johnson stock outperforms competitors on strong trading day
",0.4333333333333333
21/04/21,"Johnson & Johnson Set To Resume COVID-19 Vaccine Rollout In Europe — With A Warning On The Label
",0.0
21/04/21,"Johnson & Johnson stock rises Wednesday, still underperforms market
",0.0
22/04/21,"Johnson & Johnson's Vaccine Is On Hold But lts Businesses Emerged Healthier From The Pandemic
",0.0
22/04/21,"Johnson & Johnson stock outperforms market despite losses on the day
",0.0
23/04/21,"Johnson & Johnson Resumes Vaccine Rollout As Blood Clot Scare Subsides
",0.0
23/04/21,"Johnson & Johnson’s Covid Vaccine Faces a Make-or-Break Vote Today
",0.0
23/04/21,"Johnson & Johnson: Management Raises Guidance, Looks To Ignite Growth
",0.0
23/04/21,"Johnson & Johnson stock rises Friday, still underperforms market
",0.0
23/04/21,"CDC committee votes to lift pause on Johnson & Johnson COVID-19 vaccine
",0.0
23/04/21,"U.S. Ends Pause on Johnson & Johnson’s Covid Vaccine. What to Know.
",0.0
23/04/21,"CDC, FDA lift pause, allowing Johnson & Johnson COVID-19 vaccinations to resume
",0.0
24/04/21,"Johnson & Johnson and 6 Other Companies Raised Their Dividends This Week. What to Know.
",-0.125
24/04/21,"Johnson & Johnson’s Covid-19 Shot to Be Given Again at Vaccination Sites
",0.0
25/04/21,"Johnson & Johnson Shot's Benefits Outweigh Risks: Dr. Collins
",0.0
26/04/21,"Johnson & Johnson Looks To Offload Breast Implant Business, Once Again: Bloomberg
",0.0
26/04/21,"Procter & Gamble Vs. Johnson & Johnson: The Battle Of Dividend Royalty - Dividend Stock Analysis
",0.0
26/04/21,"Johnson & Johnson Vaccinations Resume Amid Declining U.S. Infections
",0.0
26/04/21,"Johnson & Johnson stock falls Monday, underperforms market
",0.0
26/04/21,"Johnson & Johnson: A Huge Vaccine Upside
",0.4000000000000001
27/04/21,"3 Reasons Not to Buy Johnson & Johnson Stock Just Because Its COVID Vaccine Pause Was Lifted
",0.0
27/04/21,"Is JNJ Stock A Buy As Covid Vaccinations Resume Post Blood-Clot Scare?
",0.0
27/04/21,"Johnson & Johnson stock underperforms Tuesday when compared to competitors
",0.0
28/04/21,"Johnson & Johnson stock underperforms Wednesday when compared to competitors
",0.0
29/04/21,"Better Buy: Johnson & Johnson Stock or the Entire S&P 500?
",0.25
30/04/21,"Pharma Stock Roundup: Big Drugmakers' Q1 Earnings, Resumption of JNJ US COVID-19 Jabs
",0.0
30/04/21,"Johnson & Johnson stock falls Friday, underperforms market
",0.0
30/04/21,"Emergent BioSolutions Has Supply Of 60M Johnson & Johnson COVID-19 Vaccine Doses Awaiting Approval: Bloomberg
",0.0
01/05/21,"Canada to not distribute JNJ COVID-19 vaccines until quality checks complete
",0.1
03/05/21,"The Zacks Analyst Blog Highlights: Eli Lilly, Merck, GlaxoSmithKline, Novartis and Johnson & Johnson
",0.0
04/05/21,"The Big Winner for Johnson & Johnson in Q1
",0.0
04/05/21,"Zacks Industry Outlook Highlights: Johnson & Johnson, AstraZeneca and Pfizer
",0.0
04/05/21,"Johnson & Johnson stock outperforms competitors on strong trading day
",0.4333333333333333
04/05/21,"Johnson & Johnson (JNJ) Gains As Market Dips: What You Should Know
",0.0
05/05/21,"Johnson & Johnson stock outperforms competitors despite losses on the day
",0.0
06/05/21,"Is It Too Late to Buy Johnson & Johnson Stock?
",-0.3
06/05/21,"The Biggest Loser With Johnson & Johnson's COVID Vaccine Manufacturing Woes
",0.0
06/05/21,"This is Why Johnson & Johnson (JNJ) is a Great Dividend Stock
",0.8
06/05/21,"Johnson & Johnson stock rises Thursday, still underperforms market
",0.0
07/05/21,"Johnson & Johnson stock rises Friday, still underperforms market
",0.0
10/05/21,"Johnson & Johnson stock outperforms market on strong trading day
",0.4333333333333333
11/05/21,"Johnson & Johnson stock outperforms competitors despite losses on the day
",0.0
12/05/21,"Here's How Much You Could Be Making From Johnson & Johnson's Dividend 5 Years From Now
",0.2
12/05/21,"Johnson & Johnson stock outperforms market despite losses on the day
",0.0
13/05/21,"Johnson & Johnson: Up to 200,000 Ebola Vaccine Regimens Available as Part of WHO Program
",0.4
13/05/21,"Johnson & Johnson Joins World Health Organization in Efforts to Prevent Spread of Ebola in West Africa
",0.0
13/05/21,"Johnson & Johnson stock rises Thursday, still underperforms market
",0.0
13/05/21,"MedTech Round Up: Update On Johnson & Johnson, Becton Dickinson, Labcorp, Second Sight Medical, Biocept
",-0.06666666666666667
14/05/21,"Johnson & Johnson stock rises Friday, still underperforms market
",0.0
20/05/21,"14 Upcoming Dividend Increases Including Johnson & Johnson
",0.0
21/05/21,"Dividend Sleuthing: Johnson & Johnson
",0.0
25/05/21,"Why You Shouldn't Buy Johnson & Johnson
",0.0
25/05/21,"Johnson & Johnson: Compelling Free Cash Flows
",0.35
26/05/21,"Johnson & Johnson: Well-Known Brand, But Where's The Edge?
",0.0
01/06/21,"Supreme Court Won't Consider Johnson & Johnson Challenge to Baby Powder Judgment
",0.0
01/06/21,"Supreme Court Denies Johnson & Johnson's Challenge to Baby Powder Cancer Judgement
",0.0
02/06/21,"Johnson & Johnson (JNJ) Outpaces Stock Market Gains: What You Should Know
",0.0
03/06/21,"Johnson & Johnson (JNJ) CEO Alex Gorsky Presents at Bernstein's 37th Annual Strategic Decisions Virtual Conference (Transcript)
",0.0
04/06/21,"Johnson & Johnson talking to Taiwan about providing COVID-19 vaccine
",0.0
06/06/21,"3 Stocks That Could Be Worth More Than Johnson & Johnson by 2035
",0.4
07/06/21,"Johnson & Johnson Ends Cusatuzumab License Deal With Argenx
",0.0
07/06/21,"Argenx Regains Global Rights from Johnson & Johnson to Blood Cancer Candidate Cusatuzumab
",0.0
07/06/21,"Johnson & Johnson stock falls Monday, underperforms market
",0.0
07/06/21,"Safety Concerns, Lower Demand Interrupts Use of Johnson & Johnson COVID-19 Shot: Reuters
",0.0
08/06/21,"Johnson & Johnson's (JNJ) Management Presents at Goldman Sachs 42nd Annual Global Healthcare Conference (Transcript)
",0.0
08/06/21,"Johnson & Johnson stock falls Tuesday, underperforms market
",0.0
08/06/21,"Johnson & Johnson (JNJ) Stock Sinks As Market Gains: What You Should Know
",-0.1
09/06/21,"Is JNJ Stock A Buy As Covid Vaccinations Resume Post Blood-Clot Scare?
",0.0
09/06/21,"Johnson & Johnson Releases 2020 Health for Humanity Report Highlighting Performance and Progress on Environmental, Social and Governance Priorities
",0.03333333333333333
09/06/21,"Johnson & Johnson to Host Investor Conference Call on Second-Quarter Results
",0.0
09/06/21,"Are You Looking for a High-Growth Dividend Stock? Johnson & Johnson (JNJ) Could Be a Great Choice
",0.8
09/06/21,"Johnson & Johnson stock outperforms market on strong trading day
",0.4333333333333333
10/06/21,"UPDATE 2-FDA extends shelf life of Johnson & Johnson COVID-19 vaccine
",0.0
10/06/21,"Johnson & Johnson stock outperforms competitors on strong trading day
",0.4333333333333333
11/06/21,"Better Buy: Verizon Communications vs. Johnson & Johnson
",0.5
11/06/21,"Johnson & Johnson says FDA has extended shelf life of single-dose COVID vaccine by six weeks
",0.0
11/06/21,"Johnson & Johnson stock falls Friday, underperforms market
",0.0
11/06/21,"FDA Authorizes 10M JNJ COVID-19 Vaccine Doses, Asks To Discard 60M From Emergent Plant: NYT
",0.0
11/06/21,"Johnson & Johnson Can’t Use 60 Million Covid Doses Because of Possible Contamination, FDA Rules
",0.0
13/06/21,"FDA Reveals Details of Problems at Third-Party Maker of JNJ Shot
",0.0
13/06/21,"3 Reasons To Own Johnson & Johnson Today
",0.6
14/06/21,"Johnson & Johnson Building Case With New Patient Survival Data For Darzalex In Multiple Myeloma
",0.06818181818181818
14/06/21,"Johnson & Johnson stock rises Monday, outperforms market
",0.0
14/06/21,"Is Johnson & Johnson (JNJ) A Good Stock To Buy?
",0.7
14/06/21,"Johnson & Johnson (JNJ) Outpaces Stock Market Gains: What You Should Know
",0.0
15/06/21,"The Johnson & Johnson Charts Are Healthy Enough for Further Gains
",0.16666666666666666
15/06/21,"Johnson & Johnson stock falls Tuesday, underperforms market
",0.0
16/06/21,"UPDATE 2-U.S. authorizes another 14 mln doses of Johnson & Johnson's COVID-19 vaccine -sources
",0.0
16/06/21,"Johnson & Johnson stock outperforms market despite losses on the day
",0.0
16/06/21,"JNJ Unlikely To Meet Q2 COVID-19 Vaccine Supply Target To EU: Reuters
",-0.5
17/06/21,"Johnson & Johnson stock outperforms market on strong trading day
",0.4333333333333333
18/06/21,"Johnson & Johnson stock underperforms Friday when compared to competitors
",0.0
20/06/21,"Is Johnson & Johnson Now a Has-Been in the COVID Vaccine Market?
",0.0
20/06/21,"Nike, FedEx, Johnson & Johnson, Darden, and Other Stocks for Investors to Watch This Week
",-0.125
21/06/21,"Johnson & Johnson stock rises Monday, still underperforms market
",0.0
21/06/21,"Johnson & Johnson (JNJ) Gains But Lags Market: What You Should Know
",0.0
23/06/21,"Does Johnson & Johnson Have the Safest Dividend in Healthcare?
",0.0
24/06/21,"Pharma Stock Roundup: EU Nod to AZN, SNY, JNJ Drugs, Glaxo's New COVID-19 Drug Data
",0.13636363636363635
24/06/21,"Johnson & Johnson stock rises Thursday, still underperforms market
",0.0
24/06/21,"Top Analyst Reports for Tesla, Alibaba & Johnson & Johnson
",0.5
25/06/21,"The Zacks Analyst Blog Highlights: Tesla, Alibaba, Johnson & Johnson, Toyota Motor and 3M
",0.0
25/06/21,"This is Why Johnson & Johnson (JNJ) is a Great Dividend Stock
",0.8
25/06/21,"Johnson & Johnson stock rises Friday, outperforms market
",0.0
26/06/21,"Johnson & Johnson Settles New York Opioid Case for $230 Million
",0.13636363636363635
26/06/21,"Johnson & Johnson Reaches $230M Settlement With New York To End Sale Of Opioids Nationwide
",0.13636363636363635
28/06/21,"Boeing, Tesla and Johnson & Johnson Fall Premarket
",0.0
28/06/21,"Johnson & Johnson: A Gold Standard In Dividend Safety
",0.0
28/06/21,"Johnson & Johnson stock underperforms Monday when compared to competitors
",0.0
28/06/21,"Johnson & Johnson (JNJ) Stock Sinks As Market Gains: What You Should Know
",-0.1
29/06/21,"Johnson & Johnson: Any Share Price Dip Could Be A Buy Opportunity
",0.0
29/06/21,"3 Reasons to Buy Johnson & Johnson, and 1 Reason to Sell
",0.0
29/06/21,"Why Johnson & Johnson Is Trashing 60 Million Doses of Its COVID Vaccine
",0.0
29/06/21,"Johnson & Johnson stock rises Tuesday, still underperforms market
",0.0
30/06/21,"Will Johnson & Johnson Be a Trillion-Dollar Stock by 2030?
",0.0
30/06/21,"Johnson & Johnson stock outperforms market on strong trading day
",0.4333333333333333
01/07/21,"Johnson & Johnson: The Market Got It Right
",0.2857142857142857
01/07/21,"Johnson & Johnson stock rises Thursday, outperforms market
",0.0
02/07/21,"Positive New Data for Johnson & Johnson Single-Shot COVID-19 Vaccine on Activity Against Delta Variant and Long-lasting Durability of Response
",0.18181818181818182
02/07/21,"What's Going On With Johnson & Johnson (JNJ) Stock Today?
",0.0
02/07/21,"Johnson & Johnson says single shot COVID vaccine protects against Delta variant
",-0.07142857142857142
02/07/21,"How Potent Are JNJ & Other COVID-19 Jabs Against Delta Variant?
",0.1875
02/07/21,"Johnson & Johnson vaccine shows promise against delta variant
",0.0
02/07/21,"UPDATE 1-Europe approves upgrade to Johnson & Johnson's COVID-19 vaccine plant
",0.0
02/07/21,"Johnson & Johnson stock rises Friday, outperforms market
",0.0
02/07/21,"Why Johnson & Johnson’s vaccine update is ‘welcome news’
",0.8
06/07/21,"A Look Into Johnson & Johnson's Price Over Earnings
",0.0
06/07/21,"Johnson & Johnson stock falls Tuesday, underperforms market
",0.0
07/07/21,"Johnson & Johnson stock underperforms Wednesday when compared to competitors despite daily gains
",0.0
08/07/21,"Johnson & Johnson stock outperforms market despite losses on the day
",0.0
08/07/21,"Is JNJ Stock A Buy As The Pharma Giant Takes On Covid's Delta Variant?
",0.0
09/07/21,"Johnson & Johnson stock rises Friday, still underperforms market
",0.0
09/07/21,"Johnson & Johnson Posts Positive 3-Year Stelara Data In Ulcerative Colitis
",0.22727272727272727
12/07/21,"Why Johnson & Johnson (JNJ) is a Top Dividend Stock for Your Portfolio
",0.5
12/07/21,"UPDATE 1-Johnson & Johnson in discussion with FDA regarding COVID-19 vaccine side effects
",0.0
13/07/21,"Enel to Supply Johnson & Johnson With Renewable Power
",0.0
13/07/21,"Johnson & Johnson, AstraZeneca Aim to Cut Clot Risk in Vaccines
",0.0
13/07/21,"How Johnson & Johnson's COVID Vaccine Is Making a Comeback
",0.0
13/07/21,"FDA Adds Rare Nerve Condition As Second Warning To Johnson & Johnson's COVID-19 Vaccine
",0.15
13/07/21,"Johnson & Johnson stock outperforms competitors despite losses on the day
",0.0
13/07/21,"AstraZeneca, JNJ To Start Research On Potentially Modified COVID-19 Shots: WSJ
",0.0
13/07/21,"Johnson & Johnson (JNJ) Stock Moves -0.12%: What You Should Know
",0.0
14/07/21,"Johnson & Johnson stock underperforms Wednesday when compared to competitors despite daily gains
",0.0
14/07/21,"Is JNJ Stock A Buy Or A Sell After A New Covid Vaccine Side Effect Emerges?
",0.13636363636363635
14/07/21,"Johnson & Johnson (JNJ) Reports Next Week: Wall Street Expects Earnings Growth
",0.0
14/07/21,"Johnson & Johnson Consumer Inc. Issues Voluntary Recall of Specific NEUTROGENA® and AVEENO® Aerosol Sunscreen Products Due to the Presence of Benzene
",-0.0625
15/07/21,"Johnson & Johnson recalling 5 sunscreen products due to benzene traces
",-0.125
19/07/21,"Lawyers for Ovarian Cancer Victims Call on Regulators to Stop 'Contemptible' Johnson & Johnson Bankruptcy Plan
",0.0
19/07/21,"Johnson & Johnson Legal Rep Floats Subsidiary Bankruptcy Filing Over Talc Lawsuits 
",0.2
19/07/21,"How Does Johnson & Johnson's Debt Look?
",0.0
19/07/21,"Netflix, Johnson & Johnson, JPMorgan, Citigroup and Wells Fargo are part of Zacks Earnings Preview
",0.0
19/07/21,"Johnson & Johnson Legal Representatives Exploring Putting Talc Lawsuits Into Subsidiary For Bankruptcy Filing: Reuters
",0.2
19/07/21,"Johnson & Johnson stock outperforms competitors despite losses on the day
",0.0
19/07/21,"Johnson & Johnson Announces Quarterly Dividend for Third Quarter 2021
",0.0
20/07/21,"How Bankruptcy Could Help Johnson & Johnson Corral Vast Talc Litigation 
",0.0
20/07/21,"Johnson & Johnson, 3 Drug Distributors Near $26B Opioid Accord
",0.1
20/07/21,"Johnson & Johnson Taps Jones Day to Explore Talc Bankruptcy
",0.0
21/07/21,"Johnson & Johnson Beats Earnings Forecast; Vaccine Sales Top $160 Million
",0.5
21/07/21,"Johnson & Johnson Posts Higher Profit as Healthcare Demand Returns 
",0.25
21/07/21,"Premarket Movers Wednesday: Chembio, NeuroMetrix, Johnson & Johnson
",0.0
21/07/21,"Johnson & Johnson beats earnings estimates for Q2 and raises full-year guidance
",0.0
21/07/21,"Johnson & Johnson (JNJ) Q2 Earnings and Revenues Top Estimates
",0.5
21/07/21,"Johnson & Johnson (JNJ) on Q2 2021 Results - Earnings Call Transcript
",0.0
21/07/21,"JNJ CFO: We’re certain vaccine demand will increase
",0.21428571428571427
21/07/21,"Johnson & Johnson Shrugs Off Vaccine Worries But Stays Flat Despite Quarterly Beat
",-0.025
21/07/21,"Johnson & Johnson stock rises Wednesday, still underperforms market
",0.0
21/07/21,"Johnson & Johnson's COVID-19 Shot Is Less Effective Against Delta Variant: Study
",0.21666666666666667
21/07/21,"Is JNJ Stock A Buy Or A Sell As Delta Question Plagues Covid Shot?
",0.0
21/07/21,"Johnson & Johnson (JNJ) Q2 2021 Earnings Call Transcript
",0.0
21/07/21,"Dow Jones Up 270 Points After Coca-Cola, Johnson & Johnson, Verizon Announce Earnings
",0.0
22/07/21,"Johnson & Johnson: Nothing New, 7-8% Gains Per Year From Here
",0.13636363636363635
22/07/21,"What You Should Know About Johnson & Johnson's Newest COVID Vaccine Warning
",0.0
22/07/21,"Portnoy Law: Lawsuit Filed On Behalf of Johnson & Johnson Consumer, Inc. Investors
",0.0
22/07/21,"European Medicine Agency Lists Guillain-Barré Syndrome As Rare Side Effect For JNJ COVID-19 Vaccine
",0.15
22/07/21,"JNJ Beats on Q2 Earnings, Ups View: ETFs to Buy
",0.0
22/07/21,"Johnson & Johnson stock outperforms market on strong trading day
",0.4333333333333333
23/07/21,"The Big Winner With Johnson & Johnson's Recent FDA Approval
",0.0
23/07/21,"Bronstein, Gewirtz & Grossman, LLC Reminds Shareholders of Johnson & Johnson (NYSE:JNJ) Investigation
",0.0
23/07/21,"Johnson & Johnson stock rises Friday, outperforms market
",0.0
23/07/21,"Top Research Reports for Johnson & Johnson, Oracle & SAP
",0.5
26/07/21,"Johnson & Johnson stock rises Monday, still underperforms market
",0.0
26/07/21,"JNJ Option Traders Aim to Continue Positive Trend
",0.22727272727272727
27/07/21,"Pharma Heavyweights, Including Pfizer And JNJ Trying To Push Global Tax Deal Amid COVID-19 Role: WSJ
",0.0
27/07/21,"Johnson & Johnson stock outperforms competitors on strong trading day
",0.4333333333333333
28/07/21,"Johnson & Johnson stock underperforms Wednesday when compared to competitors
",0.0
29/07/21,"Wall Street Might Be Missing This Key to Growth at Johnson & Johnson
",-0.1
29/07/21,"Are Johnson & Johnson's Legal Troubles Enough of a Reason to Avoid the Stock?
",0.1
29/07/21,"Women Cancer Victims Opposed to Johnson & Johnson's 'Texas Two-Step' Bankruptcy Ploy Urge Passage of Reforms Introduced by Warren, Durbin, Nadler, Blumenthal, and Maloney
",0.0
29/07/21,"Johnson & Johnson stock remains steady Thursday, underperforms market
",0.16666666666666666
30/07/21,"Will Johnson & Johnson Be Hurt by Its Sunscreen Product Recall?
",0.0
30/07/21,"Johnson & Johnson not liable for Illinois woman's death in talc case
",0.05
02/08/21,"Johnson & Johnson Pulls Application For Accelerated Approval Of COVID-19 Shot In India: Report
",0.0
02/08/21,"Johnson & Johnson Cleared In Illinois Woman's Death In Talc Case, But Thousands Still Pending: Report
",0.0
02/08/21,"Johnson & Johnson stock rises Monday, outperforms market
",0.0
03/08/21,"Johnson & Johnson stock outperforms market on strong trading day
",0.4333333333333333
04/08/21,"Johnson & Johnson stock underperforms Wednesday when compared to competitors
",0.0
05/08/21,"Silver Lining From Delta Variant Makes Johnson & Johnson More Attractive
",0.65
05/08/21,"Johnson & Johnson stock rises Thursday, still underperforms market
",0.0
05/08/21,"CVS Health Stops Administration Of JNJ COVID-19 Shot In Several Locations: CNBC
",0.0
06/08/21,"Johnson & Johnson stock falls Friday, underperforms market
",0.0
09/08/21,"Were Hedge Funds Right About Johnson & Johnson (JNJ)?
",0.2857142857142857
09/08/21,"Johnson & Johnson stock outperforms market on strong trading day
",0.4333333333333333
10/08/21,"Johnson & Johnson stock rises Tuesday, still underperforms market
",0.0
11/08/21,"Johnson & Johnson stock rises Wednesday, still underperforms market
",0.0
13/08/21,"Johnson & Johnson's (NYSE:JNJ) Strong ROE Continues the Bullish Run
",0.4333333333333333
13/08/21,"Why Johnson & Johnson (JNJ) is a Top Dividend Stock for Your Portfolio
",0.5
13/08/21,"Johnson & Johnson stock outperforms market on strong trading day
",0.4333333333333333
16/08/21,"Johnson & Johnson stock rises Monday, outperforms market
",0.0
17/08/21,"If You Invested $1,000 In Johnson & Johnson Stock One Year Ago, Here's How Much You'd Have Now
",0.2
17/08/21,"Johnson & Johnson stock outperforms competitors on strong trading day
",0.4333333333333333
18/08/21,"Is Johnson & Johnson (JNJ) A Great Investment Pick?
",0.8
18/08/21,"Here's Why Johnson & Johnson's Vaccine Could Overtake Both Pfizer and Moderna
",0.0
18/08/21,"The White House Just Announced Its Covid Booster Plan. Still No Word on Johnson & Johnson Vaccine.
",0.0
18/08/21,"Johnson & Johnson stock falls Wednesday, underperforms market
",0.0
18/08/21,"Johnson & Johnson (JNJ) Dips More Than Broader Markets: What You Should Know
",0.5
19/08/21,"Johnson & Johnson stock rises Thursday, outperforms market
",0.0
19/08/21,"Johnson & Johnson Touts Rybrevant Label Expansion After Rare Lung Cancer Approval
",0.3
19/08/21,"Europe Faces Backlash For Importing JNJ COVID-19 Shots From South Africa: Reuters
",0.0
19/08/21,"Alex Gorsky to Serve as Executive Chairman and Transition Role of Chief Executive Officer of Johnson & Johnson to Joaquin Duato, Effective January 3, 2022
",0.6
19/08/21,"Johnson & Johnson CEO Gorsky to step down, become executive chairman
",-0.15555555555555559
20/08/21,"Johnson & Johnson CEO Alex Gorsky Is Stepping Aside
",0.0
20/08/21,"Johnson & Johnson Stock Lower as Alex Gorsky Plans Exit, Joaquin Duato Named CEO
",0.0
20/08/21,"Johnson & Johnson taps Duato as new CEO, replacing Gorsky
",0.13636363636363635
20/08/21,"Johnson & Johnson’s new leadership, OnlyFans to ban sexually explicit content, Topps SPAC Merger collapses
",0.3181818181818182
20/08/21,"Is JNJ Stock A Buy After Company Announces Looming CEO Departure?
",0.0
20/08/21,"Johnson & Johnson (JNJ) Up 5.1% Since Last Earnings Report: Can It Continue?
",0.0
20/08/21,"Johnson & Johnson stock rises Friday, still underperforms market
",0.0
21/08/21,"Better Dividend Stock: Johnson & Johnson or Pfizer?
",0.5
22/08/21,"Revisiting My Long Johnson & Johnson Vs. Short Merck Call In 2020
",-0.025
23/08/21,"Johnson & Johnson: Whether To Buy, Sell Or Hold
",0.0
23/08/21,"Johnson & Johnson stock falls Monday, underperforms market
",0.0
24/08/21,"Johnson & Johnson: A Gold Standard In Dividend Safety
",0.0
24/08/21,"Johnson & Johnson stock underperforms Tuesday when compared to competitors
",0.0
24/08/21,"Is JNJ Stock A Buy As Covid Vaccine Recipients Await News On Boosters?
",0.0
24/08/21,"Ovarian Cancer Victims Ask Court to Block Johnson & Johnson's 'Texas Two-Step' Bankruptcy Plan
",0.0
24/08/21,"Johnson & Johnson (JNJ) Stock Sinks As Market Gains: What You Should Know
",-0.1
25/08/21,"Johnson & Johnson Stock Gains After Promising COVID Booster Shot Data
",0.2
25/08/21,"Johnson & Johnson COVID-19 Booster Shot Generates 9X Spike-Binding Antibodies, Early Data Shows
",0.1
25/08/21,"Johnson & Johnson Announces Data to Support Boosting its Single-Shot COVID-19 Vaccine
",0.0
25/08/21,"Johnson & Johnson stock falls Wednesday, underperforms market
",0.0
26/08/21,"5 Things You Might Not Know About New Johnson & Johnson CEO Joaquin Duato
",0.13636363636363635
26/08/21,"Better Healthcare Stock: Johnson & Johnson vs. Pfizer
",0.5
26/08/21,"Johnson & Johnson stock falls Thursday, still outperforms market
",0.0
26/08/21,"/C O R R E C T I O N -- Johnson & Johnson/
",0.0
27/08/21,"Johnson & Johnson stock falls Friday, underperforms market
",0.0
27/08/21,"US Judge Allows Johnson & Johnson To Split Talc Powder Liabilities Into New Company
",0.13636363636363635
30/08/21,"UK's NICE Rejects Johnson & Johnson's Darzalex Regime For Newly Diagnosed Myeloma
",0.36818181818181817
30/08/21,"Why Johnson & Johnson (JNJ) is a Great Dividend Stock Right Now
",0.5428571428571429
30/08/21,"Johnson & Johnson stock rises Monday, still underperforms market
",0.0
30/08/21,"Johnson & Johnson (JNJ) Gains But Lags Market: What You Should Know
",0.0
31/08/21,"Johnson & Johnson Stops HIV Vaccine Trial In African Women
",0.0
31/08/21,"Johnson & Johnson HIV Vaccine Candidate Fails Mid-Stage Trial
",-0.5
31/08/21,"A Look Into Johnson & Johnson's Price Over Earnings
",0.0
31/08/21,"Johnson & Johnson and Global Partners Announce Results from Phase 2b Imbokodo HIV Vaccine Clinical Trial in Young Women in Sub-Saharan Africa
",0.05
31/08/21,"Johnson & Johnson's HIV vaccine fails mid-stage study in Africa
",-0.5
31/08/21,"Johnson & Johnson stock falls Tuesday, underperforms market
",0.0
31/08/21,"Outcry Continues to Grow for Johnson & Johnson to Resolve Talc-Cancer Claims After Latest Jury Verdict
",0.5
01/09/21,"Johnson & Johnson stock outperforms competitors on strong trading day
",0.4333333333333333
02/09/21,"Johnson & Johnson stock rises Thursday, outperforms market
",0.0
02/09/21,"Europe To Return Johnson & Johnson COVID-19 vaccines Shipped From South Africa: WSJ
",0.0
02/09/21,"Battle Against Johnson & Johnson ""Texas Two-Step"" Ploy Moves to New Jersey
",0.13636363636363635
03/09/21,"Johnson & Johnson stock rises Friday, outperforms market
",0.0
07/09/21,"Johnson & Johnson stock falls Tuesday, underperforms market
",0.0
07/09/21,"Johnson & Johnson: This Aging Star Is Starting To Dim
",0.05
08/09/21,"Johnson & Johnson Plans COVID-19 Booster Shot Trial In South Africa: Bloomberg
",0.0
08/09/21,"Johnson & Johnson's Prostate Cancer Drug Erleada Wins NICE Approval
",0.44999999999999996
08/09/21,"Johnson & Johnson stock outperforms competitors despite losses on the day
",0.0
09/09/21,"This Controversial Move Could Save Johnson & Johnson Billions
",0.55
09/09/21,"Dow's 100-point drop led by losses in Amgen Inc., Johnson & Johnson shares
",0.0
09/09/21,"Johnson & Johnson stock outperforms competitors despite losses on the day
",0.0
09/09/21,"Why Shares of Johnson & Johnson Are Down 2% Today
",-0.15555555555555559
10/09/21,"Why Johnson & Johnson Is a Retiree's Dream Stock
",0.0
10/09/21,"Could This Game-Changing FDA Approval Mean Profit for Johnson & Johnson Shareholders?
",-0.3125
10/09/21,"Johnson & Johnson (JNJ) Management Presents at Barclays Global Consumer Staples Conference (Transcript)
",0.0
10/09/21,"Johnson & Johnson stock falls Friday, still outperforms market
",0.0
10/09/21,"Johnson & Johnson (JNJ) Stock Moves -0.65%: What You Should Know
",0.0
13/09/21,"Johnson & Johnson stock falls Monday, underperforms market
",0.0
13/09/21,"Johnson & Johnson Ebola Vaccine Regimen Demonstrated Robust and Durable Immune Response in Adults and Children in Data Published in The Lancet Infectious Diseases
",0.0
15/09/21,"Is JNJ Stock A Sell After It's Left Out Of The Covid Booster Shot Conversation?
",0.0
15/09/21,"Johnson & Johnson (JNJ) Management Presents on Morgan Stanley 19th Annual Global Healthcare Conference (Transcript)
",0.0
15/09/21,"Why Johnson & Johnson (JNJ) is a Great Dividend Stock Right Now
",0.5428571428571429
15/09/21,"Johnson & Johnson stock rises Wednesday, still underperforms market
",0.0
16/09/21,"Johnson & Johnson stock falls Thursday, still outperforms market
",0.0
16/09/21,"Top Research Reports for NVIDIA, Johnson & Johnson & Toyota
",0.5
16/09/21,"Johnson & Johnson (JNJ) Stock Moves -0.12%: What You Should Know
",0.0
16/09/21,"Johnson & Johnson to Host Investor Conference Call on Third-Quarter Results
",0.0
17/09/21,"Johnson & Johnson stock falls Friday, still outperforms market
",0.0
18/09/21,"Is There An Opportunity With Johnson & Johnson's (NYSE:JNJ) 21% Undervaluation?
",0.0
20/09/21,"Johnson & Johnson stock falls Monday, still outperforms market
",0.0
21/09/21,"Johnson & Johnson says Phase 3 trial data confirms 'strong and long-lasting' protection from COVID-19 vaccine 
",0.4333333333333333
21/09/21,"Premarket Movers Tuesday: Uber, Johnson & Johnson, Apple
",0.0
21/09/21,"Johnson & Johnson Announces Real-World Evidence and Phase 3 Data Confirming Strong and Long-Lasting Protection of Single-Shot COVID-19 Vaccine in the U.S.
",0.4333333333333333
21/09/21,"Johnson & Johnson says Phase 3 trial data confirms 'strong and long-lasting' protection from COVID-19 vaccine
",0.4333333333333333
21/09/21,"Johnson & Johnson stock rises Tuesday, outperforms market
",0.0
21/09/21,"Johnson & Johnson Shows Off Covid Boosters, But Can It Catch Moderna, Pfizer?
",0.0
22/09/21,"Is Johnson & Johnson (JNJ) Going to Burn These Hedge Funds?
",0.0
22/09/21,"Johnson & Johnson stock underperforms Wednesday when compared to competitors
",0.0
22/09/21,"Johnson & Johnson (JNJ) Stock Sinks As Market Gains: What You Should Know
",-0.1
23/09/21,"Johnson & Johnson stock rises Thursday, still underperforms market
",0.0
24/09/21,"Johnson & Johnson: This Mega-Ship Is Slowing Down
",-0.15555555555555559
24/09/21,"Ignore Recent Jitters, Johnson & Johnson Is A Buy
",0.0
24/09/21,"Johnson & Johnson Can Still Deliver
",0.0
24/09/21,"Johnson & Johnson stock falls Friday, underperforms market
",0.0
27/09/21,"Johnson & Johnson stock falls Monday, underperforms market
",0.0
28/09/21,"Johnson & Johnson Celebrates COVID-19 Vaccine Science Superheroes
",0.0
28/09/21,"Johnson & Johnson (JNJ) Presents at Cantor Fitzgerald 2021 Virtual Global Healthcare Conference (Transcript)
",0.0
28/09/21,"Johnson & Johnson stock outperforms competitors despite losses on the day
",0.0
28/09/21,"Johnson & Johnson (JNJ) Stock Moves -0.22%: What You Should Know
",0.0
29/09/21,"Here's Why Johnson & Johnson Is a Stock You Can Buy and Hold Forever
",0.0
29/09/21,"Here's Why Investors Shouldn't Count Out Johnson & Johnson as a Coronavirus Vaccine Stock
",0.0
30/09/21,"Johnson & Johnson stock underperforms Thursday when compared to competitors
",0.0
01/10/21,"EMA's Risk Assessment Committee Finds Link Of Rare Cases Between JNJ COVID-19 Shot, Blood Clots
",0.3
01/10/21,"Why Johnson & Johnson (JNJ) is a Top Dividend Stock for Your Portfolio
",0.5
01/10/21,"Johnson & Johnson stock falls Friday, underperforms market
",0.0
03/10/21,"Johnson & Johnson Sell-Off: Is It a Buying Opportunity?
",0.0
04/10/21,"Johnson & Johnson To Seek FDA Approval For COVID-19 Booster Shot: Report
",0.0
04/10/21,"Johnson & Johnson Reportedly Set to Seek FDA OK for Covid Booster
",0.5
04/10/21,"A Look Into Johnson & Johnson's Price Over Earnings
",0.0
04/10/21,"Johnson & Johnson Data on RSV Vaccines Raises the Bar In industrywide Race
",0.0
04/10/21,"Johnson & Johnson stock underperforms Monday when compared to competitors
",0.0
04/10/21,"Top Analyst Reports for Johnson & Johnson, Alibaba & Netflix
",0.5
05/10/21,"Johnson & Johnson Seeks FDA Emergency Use Nod For COVID-19 Booster Dose
",0.0
05/10/21,"Johnson & Johnson Asks FDA to Authorize Covid-19 Booster 
",0.0
05/10/21,"Johnson & Johnson Announces Submission of Emergency Use Authorization Amendment to the U.S. FDA to Support Booster of its Single-Shot COVID-19 Vaccine
",0.0
05/10/21,"The Zacks Analyst Blog Highlights: Johnson & Johnson, Alibaba, Netflix, Qualcomm and Enbridge
",0.0
05/10/21,"Johnson & Johnson Sends Booster Data To FDA. Here’s What Comes Next.
",0.0
05/10/21,"Johnson & Johnson Asks FDA to Authorize Covid-19 Booster
",0.0
05/10/21,"Johnson & Johnson stock rises Tuesday, still underperforms market
",0.0
05/10/21,"Johnson & Johnson (JNJ) Gains But Lags Market: What You Should Know
",0.0
05/10/21,"3 Reasons To Own Johnson & Johnson But Buy These 2 Faster-Growing High-Yield Blue-Chips Today
",0.6
06/10/21,"Where can Investors Find Value in a Well-Rounded Company like Johnson & Johnson (NYSE:JNJ)
",0.0
08/10/21,"Johnson & Johson Asks FDA for Wider Use of Juvenile Arthritis Drug
",-0.25
11/10/21,"Johnson & Johnson to Participate in the Credit Suisse 30th Annual Healthcare Conference
",0.0
12/10/21,"Johnson & Johnson’s Top Scientist to Depart
",0.5
12/10/21,"Johnson & Johnson's Top Scientist, Stoffels, to Retire at Year-End
",0.5
12/10/21,"Dr. Paul Stoffels, Vice Chairman of the Executive Committee and Chief Scientific Officer of Johnson & Johnson To Retire,  Effective December 31, 2021
",0.6
12/10/21,"Johnson & Johnson (JNJ) Reports Next Week: Wall Street Expects Earnings Growth
",0.0
12/10/21,"Johnson & Johnson Announces Jessica Moore as Vice President of Investor Relations
",0.0
12/10/21,"Johnson & Johnson (JNJ) Dips More Than Broader Markets: What You Should Know
",0.5
13/10/21,"Johnson & Johnson to Host Business Review Highlighting Pharmaceuticals
",0.0
13/10/21,"How Johnson & Johnson Has Pioneered in the Battle Against HIV/AIDS
",0.0
13/10/21,"Johnson & Johnson Booster Shot May Bolster Immune Response, FDA Staff Says
",0.0
13/10/21,"Johnson & Johnson Covid-19 Booster Shot Bolsters Immune Defense, FDA Staff Say
",0.0
18/10/21,"Johnson & Johnson's COVID-19 Booster Dose Wins FDA Adcomm Backing
",0.3
18/10/21,"Netflix, Tesla, Snap, Johnson & Johnson and Procter & Gamble are part of Zacks Earnings Preview
",0.0
18/10/21,"Johnson & Johnson’s Booster Dose for COVID-19 Gets Green Light
",0.1
18/10/21,"Johnson & Johnson Named to the TIME100 Most Influential Companies List
",0.5
19/10/21,"Johnson & Johnson Stock Is Soaring Because Earnings Beat, Raised Guidance
",0.0
19/10/21,"Johnson & Johnson Shares Gain After Q3 Earnings Beat Wall Street; Raises FY21 Guidance
",0.0
19/10/21,"Dow's nearly 100-point climb led by gains in Johnson & Johnson, Travelers stocks
",0.1
19/10/21,"Higher Sales Across Divisions Lift Johnson & Johnson as Healthcare Sector Recovers 
",0.25
19/10/21,"Mid-Morning Market Update: Markets Open Higher; Johnson & Johnson Boosts FY21 Guidance
",0.125
19/10/21,"Travelers, Johnson & Johnson share gains lead Dow's 175-point climb
",0.0
19/10/21,"Johnson & Johnson (JNJ) Q3 2021 Results - Earnings Call Transcript
",0.0
19/10/21,"Johnson & Johnson’s Stock Deserves a Booster
",0.0
19/10/21,"Why Johnson & Johnson Shares Are Trading Higher Today
",0.25
19/10/21,"Johnson & Johnson CFO talks earnings, vaccines
",0.0
19/10/21,"Why Johnson & Johnson Stock Is Up By 3% Today
",0.0
19/10/21,"Johnson & Johnson stock outperforms market on strong trading day
",0.4333333333333333
19/10/21,"Johnson & Johnson’s Sales Climb Across Divisions
",0.0
19/10/21,"Johnson & Johnson (JNJ) Q3 2021 Earnings Call Transcript
",0.0
19/10/21,"3 Biopharma Stocks To Watch Following Johnson & Johnson's Earnings Beat
",0.0
19/10/21,"Why Johnson & Johnson Shares Trounced the Market Today
",0.0
20/10/21,"Johnson & Johnson Posts Mixed Q3 Results; Shares Rise 2.3%
",0.0
20/10/21,"3 Things You Might Have Missed in Johnson & Johnson's Q3 Results
",0.0
20/10/21,"Thinking About Buying Stock In Qualcomm, Microsoft, Micron, Johnson & Johnson Or BP?
",0.0
20/10/21,"JNJ Posts Mixed Q3 Bag, Ups View: ETFs in Focus
",0.0
20/10/21,"Johnson & Johnson stock falls Wednesday, underperforms market
",0.0
20/10/21,"People Who Got Johnson & Johnson’s Covid-19 Shot Can Get a Booster. Which One Should They Get?
",0.0
20/10/21,"Johnson & Johnson COVID-19 Vaccine Booster Shot Authorized for Emergency Use by U.S. FDA
",0.0
21/10/21,"FDA Approves Moderna, Johnson & Johnson Booster And 'Mix And Match' COVID-19 Shots
",0.0
21/10/21,"Johnson & Johnson’s COVID-19 Vaccine Booster Dose Cleared for Emergency Use in U.S.
",0.0
21/10/21,"FDA Approves JNJ & MRNA's COVID-19 Boosters & Mixing of Doses
",0.0
21/10/21,"5 Ways Johnson & Johnson Is Working to Improve the Well-Being of the World by 2025
",0.0
21/10/21,"Johnson & Johnson stock underperforms Thursday when compared to competitors
",0.0
21/10/21,"Johnson & Johnson Announces Quarterly Dividend for Fourth Quarter 2021
",0.0
22/10/21,"U.S. CDC Advisory Committee Unanimously Recommends Johnson & Johnson COVID-19 Vaccine as a Booster for All Eligible Individuals Who Receive Authorized COVID-19 Vaccines
",0.0
22/10/21,"Fastly, PagerDuty, Johnson & Johnson, Moderna and Pfizer highlighted as Zacks Bull and Bear of the Day
",0.2
22/10/21,"Pharma Stock Roundup: JNJ Mixed Q3 Results, FDA Nod to Mix & Match COVID Boosters
",0.0
22/10/21,"Johnson & Johnson's Shot Success Overshadowed by Baby Powder Cancer Suit
",0.3
22/10/21,"Johnson & Johnson stock outperforms competitors on strong trading day
",0.4333333333333333
22/10/21,"Top Analyst Reports for Tesla, Johnson & Johnson & PayPal
",0.5
25/10/21,"Johnson & Johnson's Billion Dollar Gambit: The Texas Two Step
",0.0
25/10/21,"Does This News Make Johnson & Johnson a Buy?
",0.0
25/10/21,"The Zacks Analyst Blog Highlights: Tesla, Johnson & Johnson, PayPal, Verizon, Square and GlaxoSmithKline
",0.0
25/10/21,"Johnson & Johnson stock rises Monday, still underperforms market
",0.0
25/10/21,"Bankruptcy Judge Declines to Pause Talc Litigation Against Johnson & Johnson 
",0.0
26/10/21,"Johnson & Johnson: Currently Trading At Fair To Overvalued Territory
",0.35
26/10/21,"Johnson & Johnson Settles Opioid Claims In Texas For $291.8M
",0.0
26/10/21,"Johnson & Johnson Executive Jennifer Taubert Named to 2021 Fortune Most Powerful Women in Business List
",0.4
26/10/21,"Johnson & Johnson stock outperforms market on strong trading day
",0.4333333333333333
26/10/21,"University Hospital to mandate boosters for those who received JNJ vaccine
",0.0
27/10/21,"Sentiment is Down, but Here is Why Johnson & Johnson (NYSE:JNJ) Seems to be Undervalued
",-0.15555555555555559
27/10/21,"Johnson & Johnson stock falls Wednesday, underperforms market
",0.0
28/10/21,"Do Johnson & Johnson's Ongoing Litigation Woes Spell Disaster for the Stock?
",0.0
28/10/21,"What Investors Liked About Johnson & Johnson's Q3 Results
",0.6
28/10/21,"Millions Of JNJ COVID-19 Shots Sit Idle At Emergent's Baltimore Plant: Reuters
",0.0
28/10/21,"Johnson & Johnson stock falls Thursday, underperforms market
",0.0
29/10/21,"Is Johnson & Johnson Stock A Buy, Sell, Or Hold?
",0.0
29/10/21,"Johnson & Johnson Earns a Spot on Fortune's 2021 Change the World List
",0.0
29/10/21,"Johnson & Johnson stock rises Friday, still underperforms market
",0.0
31/10/21,"Was The Smart Money Right About Johnson & Johnson (JNJ)?
",0.25
01/11/21,"Johnson & Johnson stock rises Monday, still underperforms market
",0.0
02/11/21,"Johnson & Johnson, Costco Settle Lawsuits Over Recalled Sunscreen Products: Reuters
",0.0
02/11/21,"Johnson & Johnson stock outperforms market on strong trading day
",0.4333333333333333
02/11/21,"Is Johnson & Johnson a Good COVID Stock to Buy?
",0.7
03/11/21,"Johnson & Johnson Launches a Health Equity Innovation Challenge in 6 U.S. Cities
",0.0
03/11/21,"Here's What Investors Need to Know About Johnson & Johnson's Q3 Earnings
",0.0
03/11/21,"Johnson & Johnson stock falls Wednesday, underperforms market
",0.0
04/11/21,"Johnson & Johnson stock underperforms Thursday when compared to competitors
",0.0
05/11/21,"Here's Why Johnson & Johnson (JNJ) is a Strong Value Stock
",0.4333333333333333
05/11/21,"Johnson & Johnson stock outperforms competitors despite losses on the day
",0.0
08/11/21,"Johnson & Johnson stock underperforms Monday when compared to competitors
",0.0
09/11/21,"Johnson & Johnson stock falls Tuesday, still outperforms market
",0.0
09/11/21,"Johnson & Johnson Endows Research!America Outstanding Achievement in Public Health Awards
",0.25
09/11/21,"Johnson & Johnson Opioid Verdict Overturned by Oklahoma Supreme Court
",0.0
09/11/21,"Oklahoma court overturns $465 million opioid ruling against Johnson & Johnson
",0.0
10/11/21,"Johnson & Johnson stock outperforms market on strong trading day
",0.4333333333333333
10/11/21,"Oklahoma Supreme Court Overturns Opioid Ruling Against Johnson & Johnson
",0.0
10/11/21,"UPDATE 3-U.S. judge temporarily halts Johnson & Johnson talc cases, moves them to New Jersey
",0.13636363636363635
10/11/21,"Johnson & Johnson Enters into Agreement to Provide its Single-Shot COVID-19 Vaccine for the World's Most Vulnerable People through Novel Humanitarian Buffer
",0.0
11/11/21,"Johnson & Johnson stock underperforms Thursday when compared to competitors
",0.0
12/11/21,"Johnson & Johnson Stock Is Gaining Because 2 Companies Make More Sense Than 1
",0.5
12/11/21,"Johnson & Johnson and Toshiba Just Followed GE’s Lead With Split Plans. Don’t Mourn the Conglomerate.
",0.0
12/11/21,"Johnson & Johnson to spin off consumer health unit from medical device and drug-making division
",0.0
12/11/21,"Wall Street Breakfast: Johnson & Johnson To Split In Two (Podcast by Pimm Fox)
",0.0
12/11/21,"Johnson & Johnson To Spin Off Consumer Health Business: What You Need To Know
",0.0
12/11/21,"Johnson & Johnson to Split Consumer From Pharmaceutical, Medical-Device Businesses, Creating Two Companies
",0.0
12/11/21,"Johnson & Johnson Breakup Is No Clean Sweep 
",-0.18333333333333335
12/11/21,"Johnson & Johnson’s Breakup: What to Know
",0.0
12/11/21,"Johnson & Johnson stock rises Friday, outperforms market
",0.0
12/11/21,"Why Johnson & Johnson is splitting its drugs from its deodorants
",0.0
12/11/21,"Johnson & Johnson (JNJ) Splitting Into Two Companies
",0.0
12/11/21,"Johnson & Johnson Is Becoming Two Companies. What Happens to My Stock?
",0.45
12/11/21,"Johnson & Johnson Plans to Split Into Two Companies
",0.0
12/11/21,"Johnson & Johnson Pops As It Announces The Biggest Split In Health Care
",0.0
12/11/21,"Why Johnson & Johnson Stock Rose Today
",0.6
13/11/21,"Will Johnson & Johnson’s Split Pay Off? History Says No.
",0.0
13/11/21,"GE and JNJ Aren't the Only Aging Companies That Could Benefit From a Breakup
",0.0
15/11/21,"Johnson & Johnson Spinoff Plans Point to Rise of Direct to Consumer Commerce
",0.1
15/11/21,"Johnson & Johnson's Breakup: An Excellent Decision
",1.0
15/11/21,"Should You Buy Johnson & Johnson Before It Splits?
",0.0
15/11/21,"Johnson & Johnson stock underperforms Monday when compared to competitors
",0.0
16/11/21,"Johnson & Johnson stock falls Tuesday, underperforms market
",0.0
17/11/21,"Will Investors Win With Johnson & Johnson's Planned Spinoff? Here's What History Shows
",0.8
17/11/21,"Johnson & Johnson stock outperforms market on strong trading day
",0.4333333333333333
18/11/21,"Johnson & Johnson Is A Stellar Company With Ample Upside
",0.25
18/11/21,"Pharma Stock Roundup: JNJ to Spin Off Consumer Unit, PFE Eyes EUA for COVID Pill
",0.0
18/11/21,"Johnson & Johnson (JNJ) Down 0.3% Since Last Earnings Report: Can It Rebound?
",-0.07777777777777779
18/11/21,"Johnson & Johnson stock underperforms Thursday when compared to competitors
",0.0
18/11/21,"Janssen head of R&D on Johnson & Johnson split
",0.0
22/11/21,"Promoting The Johnson & Johnson Brand Through Vaccine Diplomacy And Becoming More Agile
",0.48333333333333334
22/11/21,"Implied Volatility Surging for Johnson & Johnson (JNJ) Stock Options
",0.0
22/11/21,"Johnson & Johnson stock underperforms Monday when compared to competitors
",0.0
23/11/21,"J&J's Janssen Gets Europe OK for Twice-Yearly Schizophrenia Treatment > JNJ
",0.5
23/11/21,"Will Investors Benefit From Johnson & Johnson's Breakup?
",0.0
23/11/21,"Johnson & Johnson (JNJ) Investor Presentation - Slideshow
",0.0
23/11/21,"Johnson & Johnson stock outperforms competitors on strong trading day
",0.4333333333333333
23/11/21,"Top Analyst Reports for Johnson & Johnson, Netflix & Oracle
",0.5
24/11/21,"The Zacks Analyst Blog Highlights: Johnson & Johnson, Netflix, Oracle, PepsiCo and Verizon Communications
",0.0
24/11/21,"Johnson & Johnson COVID vaccine wins full approval in Canada in first major regulatory nod
",0.24062499999999998
24/11/21,"Johnson & Johnson stock falls Wednesday, underperforms market
",0.0
26/11/21,"Johnson & Johnson Covid-19 Vaccine Recipients Often Shift to Other Boosters 
",-0.125
26/11/21,"Here's Why We Think Johnson & Johnson (NYSE:JNJ) Is Well Worth Watching
",0.3
26/11/21,"Better Buy: Johnson & Johnson or All 30 Dow Jones Stocks?
",0.5
29/11/21,"Is Johnson & Johnson Split Into Two Companies Good For Stock Investors?
",0.7
29/11/21,"Johnson & Johnson stock rises Monday, still underperforms market
",0.0
30/11/21,"What Does Johnson & Johnson's Debt Look Like?
",0.0
30/11/21,"Johnson & Johnson stock underperforms Tuesday when compared to competitors
",0.0
01/12/21,"Johnson & Johnson stock outperforms market on strong trading day
",0.4333333333333333
01/12/21,"Johnson & Johnson (JNJ) Gains As Market Dips: What You Should Know
",0.0
02/12/21,"Johnson & Johnson stock falls Thursday, underperforms market
",0.0
03/12/21,"Pharma Stock Roundup: FDA Panel Vote for MRK COVID Pill, JNJ Omicron Jab Plan
",0.0
03/12/21,"Johnson & Johnson stock outperforms competitors on strong trading day
",0.4333333333333333
04/12/21,"Could Bristol Myers Squibb and Johnson & Johnson Have a Powerful New Blood Thinner on the Way?
",0.21818181818181817
05/12/21,"Johnson & Johnson COVID-19 Booster, Administered Six Months After Two-Dose Regimen of BNT162b2, Shows Substantial Increase in Antibody and T-cell Responses
",0.0
06/12/21,"Johnson & Johnson Prepares to Untangle Finances Ahead of Planned Split 
",0.0
06/12/21,"Johnson & Johnson Booster COVID-19 Shot Shows Encouraging Action After Pfizer/BioNTech Jab
",0.1
06/12/21,"Here's Why I Bought Shiba Inu Coin Instead of Johnson & Johnson Stock
",0.0
06/12/21,"Johnson & Johnson 2021 Q3 - Results - Earnings Call Presentation
",0.0
06/12/21,"Johnson & Johnson stock rises Monday, outperforms market
",0.0
06/12/21,"Where Do Hedge Funds Stand On Johnson & Johnson (JNJ)?
",0.0
07/12/21,"Funko, Bloomin' Brands, Johnson & Johnson, Pfizer and BioNTech highlighted as Zacks Bull and Bear of the Day
",0.0
07/12/21,"Johnson & Johnson (JNJ) Gains But Lags Market: What You Should Know
",0.0
08/12/21,"Inv Corp Composite Buys Johnson & Johnson, EOG Resources Inc, Cerner Corp, Sells Amgen Inc, ...
",0.0
09/12/21,"Johnson & Johnson Appoints Senior Leaders to Executive Committee
",0.0
09/12/21,"World Health Organization Strategic Advisory Group of Experts (SAGE) Interim Recommendation Supports Use of Johnson & Johnson COVID-19 Vaccine as a Booster
",0.0
10/12/21,"Is Johnson & Johnson's Upcoming Split Good or Bad News for Investors?
",5.551115123125783e-17
10/12/21,"Here's What Investors Need to Know About Johnson & Johnson's Split
",0.0
11/12/21,"With Johnson & Johnson, Toshiba, and GE Splitting, Could Other Big Companies Follow Suit?
",-0.0625
13/12/21,"UK Reports First Omicron Death, PM Johnson Encourages Boosters
",0.25
13/12/21,"Comparing Data: Sanofi Vs. Johnson & Johnson Multiple Myeloma Therapies In Newly Diagnosed Patients
",0.06818181818181818
17/12/21,"Johnson & Johnson's, Sputnik, Sinopharm COVID-19 Vaccines Show Weakness Against Omicron Variant: Study
",0.0
17/12/21,"CDC Backs mRNA COVID-19 Vaccines Over Johnson & Johnson's, Citing Higher Rates Of Clotting Cases: Report
",0.25
17/12/21,"Johnson & Johnson, McDonald’s, Toyota: Stocks That Defined the Week
",0.0
17/12/21,"The Funded: A court fight over Johnson & Johnson's $3.4B Auris Health acquisition is going forward
",0.0
17/12/21,"Johnson & Johnson Leads Dow Rout After CDC Favors Pfizer, Moderna Covid Shots
",0.0
17/12/21,"Why Pfizer and Johnson & Johnson Fell on Friday
",0.0
20/12/21,"Top Stock Reports for Johnson & Johnson, Home Depot & Toyota
",0.5
20/12/21,"Johnson & Johnson (JNJ) Stock Moves -0.29%: What You Should Know
",0.0
21/12/21,"The Zacks Analyst Blog Highlights: Johnson & Johnson, Home Depot, Toyota, Oracle and Intuit
",0.0
23/12/21,"Johnson & Johnson: Another 2022 Safety Bet
",0.0
26/12/21,"How Much Of Johnson & Johnson (NYSE:JNJ) Do Institutions Own?
",0.4
27/12/21,"Johnson & Johnson Stock: Bull vs. Bear
",0.0
28/12/21,"Advisors' Inner Circle Fund III Buys Devon Energy Corp, Johnson & Johnson, Exxon Mobil ...
",0.0
28/12/21,"Johnson & Johnson: Time To Load Up Before The Split
",0.0
29/12/21,"Johnson & Johnson (JNJ) Outpaces Stock Market Gains: What You Should Know
",0.0
30/12/21,"Micron, Tesla, Biogen Fall Premarket; Johnson & Johnson Rises
",0.0
30/12/21,"Two Doses of Johnson & Johnson Covid Vaccine Cuts Hospitalizations 85%
",0.0
30/12/21,"Price To Earnings Ratio Insights For Johnson & Johnson
",0.0
30/12/21,"Johnson & Johnson COVID-19 Vaccine Demonstrates 85 Percent Effectiveness against Hospitalization in South Africa when Omicron was Dominant
",0.0
30/12/21,"Johnson & Johnson Booster Dose Cuts Omicron Hospitalizations: Study
",0.0
01/01/22,"Johnson & Johnson, Shaking Off Its Stodgy Image, Is One of Our Stock Picks for 2022
",0.0
04/01/22,"Johnson & Johnson Announces Quarterly Dividend for First Quarter 2022
",0.25
04/01/22,"Johnson & Johnson (JNJ) Dips More Than Broader Markets: What You Should Know
",0.5
06/01/22,"Real World Evidence Shows Johnson & Johnson COVID-19 Vaccine Demonstrates Durable Protection Against Breakthrough Infection, Hospitalization, and Intensive Care Unit Admission in the United States
",0.2
10/01/22,"Johnson & Johnson (JNJ) CEO Joaquin Duato at JPMorgan 40th Annual Healthcare Conference (Transcript)
",0.0
11/01/22,"Johnson & Johnson stock falls Tuesday, underperforms market
",0.0
11/01/22,"Johnson & Johnson (JNJ) Stock Sinks As Market Gains: What You Should Know
",-0.1
12/01/22,"Dow's nearly 50-point drop led by losses in shares of Goldman Sachs, Johnson & Johnson
",0.1
12/01/22,"Johnson & Johnson stock underperforms Wednesday when compared to competitors
",0.0
12/01/22,"FDA Adds Rare Bleeding Risk To Johnson & Johnson's COVID-19 Vaccine Fact Sheet
",0.3
12/01/22,"Does Johnson & Johnson's Split Make Sense?
",0.0
13/01/22,"Johnson & Johnson stock falls Thursday, still outperforms market
",0.0
13/01/22,"How Johnson & Johnson's Innovative Supply Chain Technology is Helping Transform How We Work - and Live
",0.3181818181818182
13/01/22,"DivcoWest snags former Johnson & Johnson facility in South San Francisco
",0.0
14/01/22,"Johnson and Johnson' COVID-19 Booster Is 85% Effective Against Omicron Hospitalization, South African Study Shows
",0.3
14/01/22,"What To Expect When Johnson & Johnson Unveils Q4 Performance This Month
",0.0
14/01/22,"Johnson & Johnson stock falls Friday, underperforms market
",0.0
14/01/22,"Q4 Earnings Update and Analyst Reports for Apple, JNJ & McDonald's
",0.0
17/01/22,"The Zacks Analyst Blog Highlights: Apple Inc., Johnson & Johnson and McDonald's Corp
",0.0
18/01/22,"Johnson & Johnson stock outperforms market despite losses on the day
",0.0
18/01/22,"Family Legacy, Inc. Buys Coca-Cola Co, Johnson & Johnson, Duke Energy Corp, Sells Alibaba ...
",0.0
18/01/22,"QV Investors Inc. Buys CGI Inc, UnitedHealth Group Inc, Johnson & Johnson, Sells Points. ...
",0.0
19/01/22,"Guinness Asset Management LTD Buys Johnson & Johnson, Aflac Inc, VF Corp, Sells NVIDIA ...
",0.0
19/01/22,"Johnson & Johnson’s got a new CEO and a plan to split the company in two. Here’s what else to expect out of J&J’s earnings
",0.13636363636363635
19/01/22,"Johnson & Johnson (JNJ) Stock Moves -0.31%: What You Should Know
",0.0
20/01/22,"A Look Into Johnson & Johnson's Price Over Earnings
",0.0
20/01/22,"Will Johnson & Johnson Be a Better Buy After Spinning Off Its Consumer Business?
",0.5
21/01/22,"Retirement Systems of Alabama Buys Applied Materials Inc, Broadcom Inc, Johnson & Johnson, ...
",0.0
24/01/22,"Johnson & Johnson: It's Not A Matter Of If But When To Add This Stock
",0.0
24/01/22,"Johnson & Johnson Is The Low Beta Stock Your Portfolio Needs
",0.0
24/01/22,"Johnson & Johnson May Shed Some Tears in This Bear Market Decline
",0.0
24/01/22,"Johnson & Johnson Stock: Spinning Off Its Litigations And Bankruptcy
",0.0
24/01/22,"Johnson & Johnson stock falls Monday, underperforms market
",0.0
24/01/22,"S.E.E.D. Planning Group LLC Buys Honeywell International Inc, Medtronic PLC, Johnson & ...
",0.0
25/01/22,"Johnson & Johnson: Q4 Earnings Insights
",0.0
25/01/22,"Johnson & Johnson's FY21 COVID-19 Vaccine Sales Below Expectations
",0.0
25/01/22,"Mid-Morning Market Update: Markets Open Lower; Johnson & Johnson Sales Miss Views
",0.0
25/01/22,"Johnson & Johnson (JNJ) CEO Joaquin Duato on Q4 2021 Results - Earnings Call Transcript
",0.0
25/01/22,"Johnson & Johnson Posts Higher Quarterly Sales Despite Some Pandemic-Related Pains
",0.25
25/01/22,"Johnson & Johnson stock outperforms market on strong trading day
",0.4333333333333333
26/01/22,"Johnson & Johnson stock outperforms competitors on strong trading day
",0.4333333333333333
27/01/22,"Johnson & Johnson stock underperforms Thursday when compared to competitors despite daily gains
",0.0
27/01/22,"Starr International Co Inc Buys Celularity Inc, Sells Moderna Inc, AstraZeneca PLC, Johnson ...
",0.0
28/01/22,"Johnson & Johnson stock rises Friday, still underperforms market
",0.0
31/01/22,"Johnson & Johnson stock rises Monday, still underperforms market
",0.0
01/02/22,"Johnson & Johnson stock falls Tuesday, underperforms market
",0.0
02/02/22,"Was The Smart Money Right About Johnson & Johnson (JNJ)?
",0.25
02/02/22,"Johnson & Johnson stock outperforms market on strong trading day
",0.4333333333333333
02/02/22,"Johnson & Johnson, Distributors Reach $590M Opioid Settlement For Tribe Claims: Report
",0.0
03/02/22,"Here's What to Like About Johnson & Johnson's Q4 Update
",0.0
03/02/22,"Greenhouse Wealth Management, LLC Buys Eli Lilly and Co, Johnson & Johnson, Oracle Corp, ...
",0.0
03/02/22,"Johnson & Johnson's Q4: Looking Behind the Numbers
",-0.4
03/02/22,"Johnson & Johnson stock falls Thursday, still outperforms market
",0.0
03/02/22,"Miller Howard Investments Inc  Buys Johnson & Johnson, Snap-on Inc, iShares Select Dividend ...
",0.0
04/02/22,"Is Johnson & Johnson Stock A Buy Or Sell After Recent Earnings?
",0.0
04/02/22,"Johnson & Johnson stock falls Friday, underperforms market
",0.0
04/02/22,"Hendershot Investments Inc. Buys Visa Inc, Johnson & Johnson, Brookfield Asset Management ...
",0.0
05/02/22,"Synergy Asset Management, LLC Buys Johnson & Johnson, Global Payments Inc, Ross Stores Inc, ...
",0.0
07/02/22,"Private Wealth Partners, LLC Buys Johnson & Johnson, Morgan Stanley, AbbVie Inc, Sells ...
",0.0
07/02/22,"Johnson & Johnson stock falls Monday, still outperforms market
",0.0
08/02/22,"Johnson & Johnson stock rises Tuesday, still underperforms market
",0.0
08/02/22,"Johnson & Johnson Halts Production Of Its COVID-19 Vaccine: NYT
",0.0
09/02/22,"Johnson & Johnson stock underperforms Wednesday when compared to competitors
",0.0
09/02/22,"Give Your Portfolio A Blue-Chip Dividend Booster Shot With Johnson & Johnson
",0.0
