Date,Open,High,Low,Close,Adj Close,Volume
2021-04-05,76.540001,78.410004,75.949997,77.940002,76.413536,33084700
2021-04-12,77.779999,81.410004,77.209999,80.940002,79.354774,36986600
2021-04-19,81.000000,81.370003,77.690002,78.239998,76.707657,37712000
2021-04-26,78.389999,78.610001,76.629997,77.510002,75.991951,32402500
2021-05-03,77.830002,77.989998,73.309998,74.529999,73.070305,38644100
2021-05-10,74.339996,75.720001,71.500000,73.120003,71.687935,36734200
2021-05-17,73.000000,75.250000,71.199997,74.440002,72.982079,46538800
2021-05-24,74.769997,74.879997,72.800003,73.220001,71.785965,41729900
2021-05-31,73.400002,73.400002,71.820000,72.339996,70.923203,30934900
2021-06-07,72.570000,73.599998,71.709999,73.489998,72.431534,31203600
2021-06-14,73.610001,74.970001,73.019997,73.279999,72.224564,50501200
2021-06-21,73.690002,74.739998,72.589996,73.860001,72.796211,32694500
2021-06-28,74.769997,75.849998,73.070000,74.279999,73.210159,34299600
2021-07-05,74.510002,76.019997,74.040001,74.989998,73.909935,24093200
2021-07-12,75.199997,78.349998,74.379997,77.919998,76.797737,34591300
2021-07-19,77.430000,78.379997,75.809998,77.199997,76.088104,35874000
2021-07-26,76.790001,78.849998,76.110001,77.900002,76.778023,28414400
2021-08-02,78.470001,81.000000,78.129997,80.610001,79.448997,32738300
2021-08-09,80.959999,83.550003,80.120003,83.449997,82.248085,30310000
2021-08-16,83.449997,86.430000,83.120003,86.279999,85.037331,37906100
2021-08-23,85.809998,86.080002,83.339996,83.410004,82.208672,31821400
2021-08-30,83.260002,86.510002,83.010002,85.690002,84.842255,28543100
2021-09-06,85.440002,86.970001,84.470001,84.930000,84.089760,22637700
2021-09-13,85.889999,85.940002,81.550003,81.639999,80.832314,37635000
2021-09-20,81.540001,82.910004,80.489998,80.699997,79.901611,33635100
2021-09-27,80.010002,80.790001,77.010002,79.209999,78.426353,43502300
2021-10-04,79.050003,82.610001,78.510002,80.209999,79.416458,27684700
2021-10-11,79.199997,82.449997,77.570000,81.669998,80.862015,43970200
2021-10-18,81.339996,84.699997,80.760002,84.419998,83.584808,27279600
2021-10-25,84.400002,86.489998,83.930000,85.330002,84.485809,29674300
2021-11-01,85.440002,86.239998,83.169998,85.529999,84.683830,29604200
2021-11-08,85.529999,86.669998,84.040001,86.309998,85.456108,26338600
2021-11-15,86.910004,88.830002,86.410004,88.309998,87.436325,29545800
2021-11-22,88.150002,88.419998,85.860001,86.089996,85.238289,21517100
2021-11-29,87.220001,89.680000,86.019997,88.029999,87.545128,54598100
2021-12-06,88.070000,90.919998,87.879997,90.279999,89.782738,32940500
2021-12-13,90.260002,92.699997,89.449997,90.940002,90.439102,50017800
2021-12-20,89.800003,91.339996,88.510002,90.699997,90.200424,26444100
2021-12-27,90.849998,93.730003,90.629997,93.360001,92.845772,19980200
2022-01-03,93.419998,93.650002,84.510002,86.410004,85.934059,48983700
2022-01-10,85.800003,86.360001,82.669998,83.199997,82.741730,44546000
2022-01-17,82.000000,85.279999,80.699997,82.599998,82.145035,45360000
2022-01-24,81.650002,82.050003,69.790001,72.500000,72.100670,109124200
2022-01-31,72.910004,79.470001,72.750000,76.010002,75.591339,62361100
2022-02-07,76.000000,77.269997,74.669998,74.959999,74.547119,41006300