Date,Headline,Sentiment Score
01/04/21,"NextEra Energy Inc. stock rises Thursday, still underperforms market
",0.2732
05/04/21,"NextEra Energy Inc. stock rises Monday, still underperforms market
",0.2732
06/04/21,"NextEra Energy: The Green Energy Conglomerate With An Electric Valuation
",0.4939
06/04/21,"NextEra Energy: Massive Overvaluation Makes This Wonderful Company A Sell
",0.7003
06/04/21,"NextEra Energy Inc. stock rises Tuesday, outperforms market
",0.2732
07/04/21,"NextEra Energy Inc. stock outperforms competitors despite losses on the day
",0.52
08/04/21,"NextEra Energy Inc. stock rises Thursday, outperforms market
",0.2732
09/04/21,"NextEra Energy Inc. stock rises Friday, still underperforms market
",0.2732
12/04/21,"NextEra Energy Inc. stock underperforms Monday when compared to competitors
",0.2732
13/04/21,"NextEra Energy Partners: Strong Growth Expectations, Worth A Buy
",0.836
13/04/21,"NextEra Energy Inc. stock outperforms market on strong trading day
",0.6597
14/04/21,"NextEra Energy Inc. stock rises Wednesday, outperforms market
",0.2732
15/04/21,"NextEra Energy Inc. stock rises Thursday, outperforms market
",0.2732
16/04/21,"NextEra Energy Inc. stock outperforms market on strong trading day
",0.6597
19/04/21,"NextEra Energy Inc. stock underperforms Monday when compared to competitors
",0.2732
20/04/21,"NextEra Energy Partners (NEP) to Buy 4 Operating Wind Assets
",0.4215
20/04/21,"NextEra Energy Inc. stock rises Tuesday, outperforms market
",0.2732
21/04/21,"NextEra Energy: Q1 Earnings Insights
",0.2732
21/04/21,"NextEra Energy, Inc. 2021 Q1 - Results - Earnings Call Presentation
",0.2732
21/04/21,"NextEra Energy Partners, LP first-quarter 2021 financial results available on partnership's website
",0.2732
21/04/21,"NextEra Energy first-quarter 2021 financial results available on company's website
",0.2732
21/04/21,"NextEra Energy (NEE) Beats Q1 Earnings Estimates
",0.2732
21/04/21,"NextEra Energy Partners (NEP) Surpasses Q1 Earnings Estimates
",0.2732
21/04/21,"Verizon, NextEra Beat on Q1 Earnings; Markets Down a Third Day
",0.0
21/04/21,"NextEra (NEE) Beats Q1 Earnings Estimates, Adds New Customers
",0.0
21/04/21,"NextEra Aims to Buy More U.S. Power Lines to Fuel Renewable Push
",0.0
21/04/21,"NextEra Energy, Inc's (NEE) CEO Jim Robo on Q1 2021 Results - Earnings Call Transcript
",0.2732
21/04/21,"NextEra Energy Continues to Generate Strong Results Powered by Renewable Energy
",0.7579
21/04/21,"NextEra Energy Falls on Mixed Quarterly Results
",0.2732
21/04/21,"NextEra Energy Inc (NEE) Q1 2021 Earnings Call Transcript
",0.2732
22/04/21,"NextEra Energy Partners (NEP) Q1 2021 Earnings Call Transcript
",0.2732
22/04/21,"NextEra Energy's Debt Overview
",-0.3612
22/04/21,"NextEra Energy Partners' (NEP) Q1 Earnings Outpace Estimates
",0.2732
24/04/21,"Texas Storm Cost NextEra $180 Million in Uncollected Revenue
",0.0
26/04/21,"NextEra Energy Inc. stock falls Monday, underperforms market
",0.2732
27/04/21,"NextEra Energy Inc. stock underperforms Tuesday when compared to competitors
",0.2732
28/04/21,"OPAL and NextEra Energy Marketing Announce Plans to Build Minnesota's First Renewable Natural Gas Facility
",0.5574
28/04/21,"UPDATE 1-OPAL, NextEra Energy unit to build renewable gas facility in Minnesota
",0.2732
28/04/21,"NextEra Energy Inc. stock falls Wednesday, underperforms market
",0.2732
29/04/21,"NextEra Energy Partners: Solid Q1 Despite Texas Winter Storm
",0.4019
29/04/21,"NextEra Energy Inc. stock rises Thursday, still underperforms market
",0.2732
29/04/21,"NextEra Energy (NEE), OPAL Fuels to Build Landfill RNG Plant
",0.2732
30/04/21,"NextEra Energy Inc. stock rises Friday, outperforms market
",0.2732
03/05/21,"NextEra Energy Inc. stock underperforms Monday when compared to competitors
",0.2732
03/05/21,"Was The Smart Money Right About NextEra Energy (NEE)?
",0.5859
04/05/21,"NextEra Energy Inc. stock underperforms Tuesday when compared to competitors
",0.2732
05/05/21,"NextEra Energy Inc. stock underperforms Wednesday when compared to competitors
",0.2732
05/05/21,"Top Stock Reports for UnitedHealth, PayPal & NextEra
",0.2023
06/05/21,"The Zacks Analyst Blog Highlights: UnitedHealth, PayPal, NextEra Energy, Thermo Fisher Scientific and Anheuser-Busch InBev
",0.2732
06/05/21,"NextEra Energy Inc. stock rises Thursday, still underperforms market
",0.2732
07/05/21,"NextEra Energy Inc. stock rises Friday, still underperforms market
",0.2732
07/05/21,"NextEra Energy (NEE) Gains But Lags Market: What You Should Know
",-0.25
10/05/21,"Read This Before Judging NextEra Energy, Inc.'s (NYSE:NEE) ROE
",0.2732
10/05/21,"NextEra Energy Inc. stock outperforms market on strong trading day
",0.6597
11/05/21,"NextEra Energy Inc. stock outperforms competitors despite losses on the day
",0.52
12/05/21,"NextEra Energy Inc. stock falls Wednesday, underperforms market
",0.2732
14/05/21,"NextEra Energy - Waiting For The Next Buying Opportunity
",0.5994
14/05/21,"Top Analyst Reports for Amazon, Tesla & NextEra
",0.3612
17/05/21,"NextEra Energy: Nope, It's Not The Time Yet
",0.2732
18/05/21,"NextEra Energy (NEE) Investor Presentation - Slideshow
",0.2732
20/05/21,"NextEra Energy board declares quarterly dividend
",0.2732
21/05/21,"Why Is NextEra Energy Partners (NEP) Down 8.1% Since Last Earnings Report?
",0.2732
21/05/21,"Why Is NextEra (NEE) Down 5.2% Since Last Earnings Report?
",0.0
27/05/21,"Better Renewable Energy Buy: Brookfield Renewable vs. NextEra Energy
",0.7269
27/05/21,"NextEra Is Blocking a Major New Clean Power Transmission Project
",0.0258
29/05/21,"NextEra Energy Partners: The Best Way To Cash In On The Green Energy Gold Rush
",0.8126
02/06/21,"NextEra Energy (NEE) Outpaces Stock Market Gains: What You Should Know
",0.5423
07/06/21,"NextEra Energy Inc. stock outperforms competitors on strong trading day
",0.6597
08/06/21,"NextEra Energy Inc. stock falls Tuesday, underperforms market
",0.2732
08/06/21,"NextEra Energy (NEE) Stock Sinks As Market Gains: What You Should Know
",0.5423
09/06/21,"MIT Leaders for Global Operations announces new industry partnership with NextEra Energy
",0.2732
09/06/21,"Top Research Reports for Intel, NextEra Energy & PetroChina
",0.4404
09/06/21,"NextEra Energy Inc. stock outperforms market on strong trading day
",0.6597
10/06/21,"The Zacks Analyst Blog Highlights: Intel, NextEra Energy, PetroChina, Illumina and Biogen
",0.2732
10/06/21,"NextEra Energy Inc. stock rises Thursday, outperforms market
",0.2732
14/06/21,"NextEra Energy Inc. stock underperforms Monday when compared to competitors
",0.2732
14/06/21,"NextEra Energy Partners, LP announces offering of $500 million in aggregate principal amount of convertible senior notes due 2024
",0.2732
14/06/21,"NextEra Energy (NEE) Stock Sinks As Market Gains: What You Should Know
",0.5423
15/06/21,"NextEra Energy: Hold This Market-Crushing Utility
",0.2732
15/06/21,"NextEra Energy and NextEra Energy Partners to meet with investors throughout June
",0.4939
15/06/21,"NextEra Energy Partners, LP announces pricing of $500 million in aggregate principal amount of 0% convertible senior notes due 2024
",0.2732
15/06/21,"NextEra Energy Partners (NEP) Issues Notes to Fund Acquisition
",0.2732
15/06/21,"Hedge Funds Are Betting On NextEra Energy, Inc. (NEE)
",0.2732
15/06/21,"NextEra Energy Inc. stock outperforms competitors on strong trading day
",0.6597
16/06/21,"Abercrombie & Fitch, Cirrus Logic, DTE Energy, NextEra Energy and Xcel Energy highlighted as Zacks Bull and Bear of the Day
",0.6486
16/06/21,"NextEra Energy Inc. stock outperforms competitors despite losses on the day
",0.52
17/06/21,"Is NextEra Energy Stock a Buy?
",0.2732
17/06/21,"NextEra Energy Inc. stock rises Thursday, outperforms market
",0.2732
18/06/21,"NextEra Energy Inc. stock falls Friday, underperforms market
",0.2732
20/06/21,"NextEra Energy: 4 High-Yield Options Trades
",0.2732
21/06/21,"NextEra Energy: ESG Enthusiasm Has Led To Overvaluation
",0.6124
21/06/21,"NextEra Energy Inc. stock underperforms Monday when compared to competitors despite daily gains
",0.0165
22/06/21,"NextEra Energy Inc. stock outperforms competitors despite losses on the day
",0.52
23/06/21,"NextEra Energy Inc. stock falls Wednesday, underperforms market
",0.2732
23/06/21,"NextEra Energy (NEE) Dips More Than Broader Markets: What You Should Know
",0.2732
24/06/21,"What You Need To Know About NextEra Energy, Inc.'s (NYSE:NEE) Investor Composition
",0.2732
24/06/21,"NextEra Energy Inc. stock falls Thursday, underperforms market
",0.2732
25/06/21,"NextEra Energy Inc. stock rises Friday, outperforms market
",0.2732
26/06/21,"NextEra Is the Country’s Biggest Electric Utility—and a Leader in Renewables
",0.0
28/06/21,"NextEra Energy Inc. stock rises Monday, outperforms market
",0.2732
29/06/21,"NextEra Energy Inc. stock outperforms competitors despite losses on the day
",0.52
30/06/21,"NextEra Energy Inc. stock underperforms Wednesday when compared to competitors
",0.2732
30/06/21,"NextEra Energy (NEE) Stock Sinks As Market Gains: What You Should Know
",0.5423
01/07/21,"NextEra Energy Inc. stock outperforms competitors on strong trading day
",0.6597
02/07/21,"NextEra Energy Partners (NEP) to Gain From Organic Assets, Buyouts
",0.7351
02/07/21,"NextEra Energy Inc. stock rises Friday, still underperforms market
",0.2732
06/07/21,"NextEra Energy Inc. stock outperforms market on strong trading day
",0.6597
07/07/21,"NextEra Energy Inc. stock rises Wednesday, still underperforms market
",0.2732
09/07/21,"NextEra Energy announces date for release of second-quarter 2021 financial results
",0.2732
09/07/21,"NextEra Energy Partners, LP announces date for release of second-quarter 2021 financial results
",0.2732
09/07/21,"NextEra Energy Inc. stock outperforms competitors despite losses on the day
",0.52
09/07/21,"NextEra Energy (NEE) Stock Sinks As Market Gains: What You Should Know
",0.5423
12/07/21,"NextEra Energy Inc. stock rises Monday, still underperforms market
",0.2732
13/07/21,"NextEra Energy Inc. stock outperforms market despite losses on the day
",0.52
14/07/21,"NextEra Energy Inc. stock outperforms market on strong trading day
",0.6597
15/07/21,"NextEra Energy (NEE) Gains As Market Dips: What You Should Know
",0.5423
16/07/21,"NextEra Energy Inc. stock outperforms competitors on strong trading day
",0.6597
16/07/21,"NextEra Energy Partners (NEP) Expected to Beat Earnings Estimates: What to Know Ahead of Q2 Release
",0.2732
16/07/21,"NextEra Energy (NEE) Earnings Expected to Grow: What to Know Ahead of Next Week's Release
",0.2732
19/07/21,"If You Invested $1000 in NextEra Energy a Decade Ago, This is How Much It'd Be Worth Now
",0.4588
19/07/21,"NextEra Energy Inc. stock outperforms competitors despite losses on the day
",0.52
20/07/21,"Zacks Industry Outlook Highlights: NextEra Energy, The Southern Co, Xcel Energy, WEC Energy Group and Entergy Corp
",0.6486
20/07/21,"Can NextEra (NEE) Keep the Earnings Surprise Streak Alive?
",0.5719
20/07/21,"NextEra Energy Inc. stock rises Tuesday, still underperforms market
",0.2732
21/07/21,"NextEra Energy (NEE) to Report Q2 Earnings: What to Expect
",0.2732
21/07/21,"What Awaits NextEra Energy Partners (NEP) in Q2 Earnings?
",0.34
21/07/21,"NextEra Energy Inc. stock underperforms Wednesday when compared to competitors
",0.2732
22/07/21,"Why NextEra Energy (NEE) Might Surprise This Earnings Season
",0.4939
22/07/21,"Is a Surprise Coming for NextEra Energy Partners (NEP) This Earnings Season?
",0.4939
23/07/21,"NextEra Energy: Q2 Earnings Insights
",0.2732
23/07/21,"NextEra Energy 2Q Profit Declines on Lower Revenue
",0.4215
23/07/21,"NextEra Energy, Inc. 2021 Q2 - Results - Earnings Call Presentation
",0.2732
23/07/21,"NextEra Energy Partners, LP second-quarter 2021 financial results available on partnership's website
",0.2732
23/07/21,"NextEra Energy second-quarter 2021 financial results available on company's website
",0.2732
23/07/21,"NextEra Energy Partners (NEP) Reports Q2 Loss, Lags Revenue Estimates
",-0.4019
23/07/21,"NextEra Energy (NEE) Beats Q2 Earnings Estimates
",0.2732
23/07/21,"NextEra Energy Partners (NEP) Posts Q2 Loss, Misses on Revenues
",-0.2732
23/07/21,"NextEra (NEE) Q2 Earnings Beat, Revenues Miss Estimates
",-0.1531
23/07/21,"NextEra Energy, Inc. (NEE) CEO John Ketchum on Q2 2021 Results - Earnings Call Transcript
",0.2732
23/07/21,"NextEra Energy Inc. stock outperforms market on strong trading day
",0.6597
23/07/21,"NextEra Energy, inc (NEE) Q2 2021 Earnings Call Transcript
",0.2732
23/07/21,"NextEra Energy Partners (NEP) Q2 2021 Earnings Call Transcript
",0.2732
24/07/21,"Utility Series 7: NextEra Energy, Inc. And Utility Dashboard
",0.2732
24/07/21,"NextEra Energy Just Reported Its Second-Quarter Earnings. Do They Make It a Buy?
",0.2732
26/07/21,"NextEra Energy Inc. stock underperforms Monday when compared to competitors
",0.2732
27/07/21,"NextEra Energy Inc. stock underperforms Tuesday when compared to competitors despite daily gains
",0.0165
28/07/21,"NextEra Energy Inc. stock outperforms market despite losses on the day
",0.52
29/07/21,"NextEra Energy Inc. stock rises Thursday, still underperforms market
",0.2732
30/07/21,"NextEra Energy board declares quarterly dividend
",0.2732
30/07/21,"NextEra Energy Inc. stock falls Friday, still outperforms market
",0.2732
31/07/21,"NextEra Energy Is Set To Deliver Slow And Steady Growth
",0.5719
03/08/21,"NextEra Energy Inc. stock rises Tuesday, still underperforms market
",0.2732
04/08/21,"NextEra Energy Inc. stock outperforms competitors on strong trading day
",0.6597
05/08/21,"NextEra Energy Inc. stock rises Thursday, outperforms market
",0.2732
06/08/21,"NextEra Energy Inc. stock rises Friday, still underperforms market
",0.2732
09/08/21,"Here's How Much You'd Have If You Invested $1000 in NextEra Energy a Decade Ago
",0.2732
09/08/21,"NextEra Energy Inc. stock underperforms Monday when compared to competitors
",0.2732
10/08/21,"NextEra Energy Inc. stock underperforms Tuesday when compared to competitors
",0.2732
10/08/21,"NextEra Energy and NextEra Energy Partners to meet with investors throughout August
",0.4939
11/08/21,"NextEra Energy Inc. stock rises Wednesday, outperforms market
",0.2732
16/08/21,"NextEra Energy Inc. stock underperforms Monday when compared to competitors despite daily gains
",0.0165
17/08/21,"NextEra Energy Inc. stock rises Tuesday, outperforms market
",0.2732
18/08/21,"NextEra Energy Inc. stock outperforms competitors on strong trading day
",0.6597
19/08/21,"NextEra Energy Inc. stock outperforms market on strong trading day
",0.6597
20/08/21,"NextEra Energy Inc. stock rises Friday, outperforms market
",0.2732
23/08/21,"NextEra Energy Inc. stock underperforms Monday when compared to competitors
",0.2732
24/08/21,"NextEra Energy Inc. stock falls Tuesday, underperforms market
",0.2732
25/08/21,"NextEra Energy Inc. stock outperforms competitors on strong trading day
",0.6597
25/08/21,"NextEra Energy Partners, LP completes acquisition of previously announced approximately 400-megawatt portfolio of long-term contracted wind assets
",0.4215
26/08/21,"NextEra Energy Inc. stock falls Thursday, still outperforms market
",0.2732
26/08/21,"NextEra Energy (NEE) Dips More Than Broader Markets: What You Should Know
",0.2732
27/08/21,"NextEra Energy Inc. stock falls Friday, underperforms market
",0.2732
30/08/21,"Imagining a Cleaner Mobile Power Solution: PG&E and NextEra Energy Resources Pilot Mainspring Linear Generator at Napa County Microgrid
",0.6249
31/08/21,"NextEra Energy Inc. stock outperforms market on strong trading day
",0.6597
01/09/21,"NextEra Energy vs. Dominion Energy: Which Renewable Energy Stock to Choose?
",0.6486
01/09/21,"NextEra Energy Inc. stock outperforms competitors on strong trading day
",0.6597
01/09/21,"NextEra Energy (NEE) Outpaces Stock Market Gains: What You Should Know
",0.5423
02/09/21,"NextEra Energy Inc. stock outperforms market on strong trading day
",0.6597
03/09/21,"NextEra Energy: Tremendously Overvalued Based On All Fundamental Data
",0.2732
03/09/21,"NextEra Energy Inc. stock falls Friday, underperforms market
",0.2732
07/09/21,"NextEra Energy Inc. stock falls Tuesday, underperforms market
",0.2732
08/09/21,"NextEra Energy and NextEra Energy Partners to meet with investors throughout September and October
",0.4939
08/09/21,"NextEra Energy Inc. stock rises Wednesday, outperforms market
",0.2732
08/09/21,"NextEra Energy (NEE) Gains As Market Dips: What You Should Know
",0.5423
09/09/21,"NextEra Energy Inc. stock falls Thursday, underperforms market
",0.2732
10/09/21,"NextEra Energy Inc. stock falls Friday, underperforms market
",0.2732
13/09/21,"NextEra Energy Inc. stock outperforms competitors despite losses on the day
",0.52
14/09/21,"NextEra Energy Inc. stock rises Tuesday, outperforms market
",0.2732
14/09/21,"NextEra Energy (NEE) Gains As Market Dips: What You Should Know
",0.5423
15/09/21,"NextEra Energy Inc. stock falls Wednesday, underperforms market
",0.2732
16/09/21,"NextEra Energy Inc. stock falls Thursday, underperforms market
",0.2732
17/09/21,"NextEra Energy Inc. stock underperforms Friday when compared to competitors
",0.2732
20/09/21,"NextEra Energy Inc. stock outperforms market on strong trading day
",0.6597
20/09/21,"NextEra Energy (NEE) Gains As Market Dips: What You Should Know
",0.5423
21/09/21,"NextEra Energy Inc. stock outperforms competitors on strong trading day
",0.6597
22/09/21,"NextEra Energy Inc. stock underperforms Wednesday when compared to competitors
",0.2732
23/09/21,"NextEra Energy Inc. stock outperforms competitors despite losses on the day
",0.52
24/09/21,"NextEra Energy Inc. stock falls Friday, underperforms market
",0.2732
27/09/21,"NextEra Energy Inc. stock falls Monday, underperforms market
",0.2732
28/09/21,"NextEra Energy, Inc. (NEE): Hedge Funds Are Cashing Out
",0.2732
28/09/21,"NextEra Energy Inc. stock falls Tuesday, still outperforms market
",0.2732
28/09/21,"NextEra Energy (NEE) Stock Moves -1.89%: What You Should Know
",0.2732
29/09/21,"NextEra Seeks Approval to Run Another Nuclear Plant for 80 Years
",0.4767
29/09/21,"NextEra Energy Inc. stock outperforms market on strong trading day
",0.6597
29/09/21,"Top Research Reports for Microsoft, Amazon & NextEra Energy
",0.5574
29/09/21,"NextEra Energy and NextEra Energy Partners to present at the 2021 Wolfe Research Virtual Utilities, Midstream & Clean Energy Conference
",0.7906
30/09/21,"The Zacks Analyst Blog Highlights: Microsoft, Amazon and NextEra Energy
",0.4215
01/10/21,"NextEra Energy Inc. stock rises Friday, still underperforms market
",0.2732
02/10/21,"Improving Outlook For NextEra
",0.4215
04/10/21,"NextEra Energy (NYSE:NEE) - Promising for Green Investors, Not Good Enough for Dividend Investors
",0.3387
04/10/21,"NextEra Energy Inc. stock rises Monday, outperforms market
",0.2732
04/10/21,"NextEra Energy (NEE) Gains As Market Dips: What You Should Know
",0.5423
05/10/21,"NextEra Energy Inc. stock rises Tuesday, still underperforms market
",0.2732
06/10/21,"NextEra Energy Partners, LP announces date for release of third-quarter 2021 financial results
",0.2732
06/10/21,"NextEra Energy announces date for release of third-quarter 2021 financial results
",0.2732
06/10/21,"NextEra Energy Inc. stock outperforms competitors on strong trading day
",0.6597
07/10/21,"NextEra Energy Inc. stock falls Thursday, underperforms market
",0.2732
08/10/21,"NextEra Energy Inc. stock outperforms competitors despite losses on the day
",0.52
11/10/21,"NextEra Energy Inc. stock falls Monday, underperforms market
",0.2732
12/10/21,"NextEra Energy Partners Should Indirectly Benefit From Federal Clean Energy Spending
",0.836
12/10/21,"NextEra Energy: Leading The Green Revolution
",0.2732
12/10/21,"The Zacks Analyst Blog Highlights: NextEra Energy, Raytheon, Bristol-Myers Squibb, Williams Companies and Occidental Petroleum
",0.2732
12/10/21,"NextEra Energy Inc. stock rises Tuesday, outperforms market
",0.2732
12/10/21,"NextEra Energy recognized on Fortune's 2021 list of companies that 'Change the World'
",0.2732
13/10/21,"NextEra Energy Inc. stock rises Wednesday, outperforms market
",0.2732
13/10/21,"NextEra Energy (NEE) Earnings Expected to Grow: What to Know Ahead of Next Week's Release
",0.2732
13/10/21,"Analysts Estimate NextEra Energy Partners (NEP) to Report a Decline in Earnings: What to Look Out for
",0.2732
14/10/21,"NextEra Energy Inc. stock rises Thursday, still underperforms market
",0.2732
14/10/21,"NextEra Energy (NEE) Gains But Lags Market: What You Should Know
",-0.25
15/10/21,"NextEra Energy Partners' (NEP) Q3 Earnings: What's in Offer?
",0.2732
15/10/21,"NextEra Energy board declares quarterly dividend
",0.2732
15/10/21,"NextEra Energy Inc. stock rises Friday, still underperforms market
",0.2732
18/10/21,"Why NextEra (NEE) is Poised to Beat Earnings Estimates Again
",0.25
18/10/21,"NextEra Energy Inc. stock outperforms competitors despite losses on the day
",0.52
19/10/21,"The Zacks Analyst Blog Highlights: NextEra Energy, Tesla, Advanced Micro Devices, Alphabet and Texas Instruments
",0.4767
19/10/21,"Should You Buy NextEra Energy (NEE) Ahead of Earnings?
",0.2732
19/10/21,"NextEra Energy Inc. stock outperforms market on strong trading day
",0.6597
20/10/21,"NextEra Energy, Inc. 2021 Q3 - Results - Earnings Call Presentation
",0.2732
20/10/21,"NextEra Stock Higher After Adjusted Profit Beats Estimate
",0.4404
20/10/21,"NextEra Energy Partners, LP third-quarter 2021 financial results available on partnership's website
",0.2732
20/10/21,"NextEra Energy third-quarter 2021 financial results available on company's website
",0.2732
20/10/21,"NextEra Energy Partners (NEP) Lags Q3 Earnings and Revenue Estimates
",-0.1027
20/10/21,"NextEra Energy (NEE) Beats Q3 Earnings Estimates
",0.2732
20/10/21,"NextEra Energy, Inc. (NEE) CEO Jim Robo on Q3 2021 results - Earning Call Transcript
",0.2732
20/10/21,"NextEra (NEE) Q3 Earnings Outpace Estimates, Revenues Miss
",-0.1531
20/10/21,"NextEra Energy Continues to Shine
",0.2732
20/10/21,"NextEra Energy Inc. stock outperforms competitors on strong trading day
",0.6597
20/10/21,"NextEra Energy Partners (NEP) Q3 2021 Earnings Call Transcript
",0.2732
20/10/21,"NextEra Energy, inc (NEE) Q3 2021 Earnings Call Transcript
",0.2732
21/10/21,"NextEra Energy Partners (NEP) Q3 Earnings & Revenues Miss
",0.128
21/10/21,"NextEra Energy Inc. stock underperforms Thursday when compared to competitors
",0.2732
22/10/21,"NextEra Energy Partners to Acquire 50% Interest in Renewables Portfolio
",0.6249
22/10/21,"NextEra Energy Partners, LP announces agreement to acquire a 50% interest in an approximately 2,520-megawatt portfolio of long-term contracted renewables projects and enters into new convertible equity portfolio financing
",0.8074
22/10/21,"Apollo Funds to Invest $824 million Supporting NextEra Energy Partners’ Acquisition of 50% Interest in 2.5 GW Renewable Energy Portfolio
",0.8442
22/10/21,"NextEra Energy Partners agrees to $824M deal for solar, wind energy sites
",0.6124
22/10/21,"NextEra Energy Inc. stock rises Friday, outperforms market
",0.2732
23/10/21,"NextEra Energy Continues to Tap New Sources of Growth
",0.5719
26/10/21,"Here's How Much $1,000 Invested In NextEra Energy 15 Years Ago Would Be Worth Today
",0.4588
26/10/21,"NextEra Energy Inc. stock rises Tuesday, outperforms market
",0.2732
27/10/21,"NextEra Energy Transmission awarded Wolf Creek-Blackberry transmission line project by SPP
",0.5859
27/10/21,"NextEra Energy Inc. stock outperforms competitors despite losses on the day
",0.52
28/10/21,"NextEra Energy Inc. stock outperforms competitors on strong trading day
",0.6597
29/10/21,"NextEra Energy Inc. stock underperforms Friday when compared to competitors
",0.2732
01/11/21,"Was The Smart Money Right About NextEra Energy, Inc. (NEE)?
",0.5859
01/11/21,"NextEra Energy Inc. stock outperforms market on strong trading day
",0.6597
02/11/21,"NextEra Energy Inc. stock falls Tuesday, underperforms market
",0.2732
03/11/21,"NextEra Energy Inc. stock underperforms Wednesday when compared to competitors
",0.2732
04/11/21,"NextEra Energy Transmission submits offshore wind transmission proposals to support New Jersey's clean energy goals
",0.8225
04/11/21,"NextEra Eyes Offshore New Jersey Wind-Power Transmission Lines
",0.0
04/11/21,"NextEra Energy Inc. stock falls Thursday, underperforms market
",0.2732
05/11/21,"NextEra Energy: Renewable Energy Delivers
",0.4939
05/11/21,"NextEra Energy Inc. stock outperforms market on strong trading day
",0.6597
05/11/21,"NextEra Energy and NextEra Energy Partners to participate in EEI Financial Conference and meet with investors throughout November and December
",0.4939
08/11/21,"NextEra Energy Inc. stock outperforms competitors despite losses on the day
",0.52
09/11/21,"NextEra Energy (NYSE:NEE) Will Be Hoping To Turn Its Returns On Capital Around
",0.5994
09/11/21,"NextEra Energy Inc. stock rises Tuesday, outperforms market
",0.2732
10/11/21,"4 Reasons to Add NextEra Energy (NEE) to Your Portfolio Now
",0.2732
10/11/21,"NextEra Energy Inc. stock rises Wednesday, outperforms market
",0.2732
10/11/21,"NextEra Energy Partners, LP announces anticipated effective date of resale registration statement with respect to common units issuable upon conversion of 0% convertible senior notes due 2025
",0.8074
11/11/21,"NextEra Energy Inc. stock outperforms competitors on strong trading day
",0.6597
12/11/21,"New York Needs Wind-Power Lines and NextEra Wants to Build Them
",0.0
12/11/21,"NextEra Energy Inc. stock outperforms market on strong trading day
",0.6597
15/11/21,"NextEra Energy Inc. stock rises Monday, outperforms market
",0.2732
16/11/21,"NextEra Energy Inc. stock falls Tuesday, underperforms market
",0.2732
17/11/21,"NextEra Energy Inc. stock rises Wednesday, outperforms market
",0.2732
17/11/21,"NextEra Energy: The Future Of Renewable Energy Conglomerates
",0.4939
18/11/21,"NextEra Energy Inc. stock falls Thursday, underperforms market
",0.2732
19/11/21,"NextEra (NEE) Up 4.5% Since Last Earnings Report: Can It Continue?
",0.0
19/11/21,"Why Is NextEra Energy Partners (NEP) Up 6.2% Since Last Earnings Report?
",0.2732
19/11/21,"NextEra Energy Inc. stock outperforms competitors on strong trading day
",0.6597
22/11/21,"Price Over Earnings Overview: NextEra Energy
",0.2732
22/11/21,"It's Time To Sell NextEra Energy
",0.2732
22/11/21,"NextEra Energy Inc. stock underperforms Monday when compared to competitors
",0.2732
22/11/21,"NextEra Energy Capital Holdings, Inc. announces redemption of Series K Junior Subordinated Debentures due June 1, 2076
",0.2732
23/11/21,"NextEra Energy Inc. stock underperforms Tuesday when compared to competitors
",0.2732
24/11/21,"NextEra Energy Inc. stock outperforms market on strong trading day
",0.6597
29/11/21,"Zacks Industry Outlook Highlights: NextEra Energy, Duke Energy, Dominion Energy and Alliant Energy
",0.7506
29/11/21,"NextEra Energy Inc. stock rises Monday, outperforms market
",0.2732
30/11/21,"NextEra Energy announces agreement to sell a 50% interest in an approximately 2,520-megawatt portfolio renewables project to a third party, highlighting the value of its best-in-class development program
",0.9081
30/11/21,"NextEra subsidiary agrees to sell 50% ownership of renewable energy assets in $866M deal
",0.5574
30/11/21,"NextEra Energy Inc. stock outperforms competitors despite losses on the day
",0.52
01/12/21,"NextEra Energy Inc. stock rises Wednesday, outperforms market
",0.2732
01/12/21,"NextEra Energy (NEE) Gains As Market Dips: What You Should Know
",0.5423
02/12/21,"NextEra Energy's Promising Earnings Growth Outlook Underpins Dividend Growth Trajectory
",0.7845
02/12/21,"NextEra (NEE) to Sell 50% Share in 2,520 MW Renewable Assets
",0.4404
02/12/21,"NextEra Energy Inc. stock rises Thursday, still underperforms market
",0.2732
03/12/21,"NextEra Energy Inc. stock outperforms market despite losses on the day
",0.52
04/12/21,"Biden’s Build Back Better Plan Could Push NextEra Energy Stock Even Higher
",0.6124
06/12/21,"NextEra Energy Inc. stock rises Monday, outperforms market
",0.2732
07/12/21,"NextEra Energy (NEE) Gains But Lags Market: What You Should Know
",-0.25
08/12/21,"Here is What Hedge Funds Think About NextEra Energy, Inc. (NEE)
",0.2732
08/12/21,"Price Over Earnings Overview: NextEra Energy
",0.2732
10/12/21,"Virtus AllianzGI Convertible Fund Buys NextEra Energy Inc, RBC Bearings Inc, Broadcom Inc, ...
",0.2732
13/12/21,"NextEra Energy (NEE) Gains As Market Dips: What You Should Know
",0.5423
15/12/21,"Is NextEra Energy, Inc. (NYSE:NEE) Popular Amongst Institutions?
",0.5994
20/12/21,"NextEra Energy (NEE) Stock Moves -1.1%: What You Should Know
",0.2732
21/12/21,"NextEra Energy (NEE) Gains But Lags Market: What You Should Know
",-0.25
29/12/21,"NextEra Energy (NEE) Gains But Lags Market: What You Should Know
",-0.25
03/01/22,"Price Over Earnings Overview: NextEra Energy
",0.2732
04/01/22,"NextEra Energy (NEE) Dips More Than Broader Markets: What You Should Know
",0.2732
06/01/22,"NextEra Energy Inc. stock falls Thursday, underperforms market
",0.2732
07/01/22,"After Plunging 9.2% in 4 Weeks, Here's Why the Trend Might Reverse for NextEra Energy Partners (NEP)
",0.2732
07/01/22,"NextEra Energy Inc. stock outperforms market on strong trading day
",0.6597
09/01/22,"NextEra In Timely New Venture
",0.0
10/01/22,"NextEra Energy Inc. stock underperforms Monday when compared to competitors
",0.2732
11/01/22,"NextEra Energy Partners, LP announces date for release of fourth-quarter and full-year 2021 financial results
",0.2732
11/01/22,"NextEra Energy announces date for release of fourth-quarter and full-year 2021 financial results
",0.2732
11/01/22,"Is NextEra Energy Partners (NEP) a Great Growth Stock?
",0.8316
11/01/22,"NextEra Energy Inc. stock rises Tuesday, still underperforms market
",0.2732
11/01/22,"NextEra Energy (NEE) Gains But Lags Market: What You Should Know
",-0.25
12/01/22,"NextEra Energy Inc. stock outperforms competitors on strong trading day
",0.6597
13/01/22,"NextEra Energy Inc. stock underperforms Thursday when compared to competitors
",0.2732
14/01/22,"NextEra Energy Partners Is A Dividend Growth Investor's Dream Come True
",0.8176
14/01/22,"NextEra Energy Inc. stock falls Friday, underperforms market
",0.2732
18/01/22,"NextEra Energy Inc. stock falls Tuesday, underperforms market
",0.2732
19/01/22,"The Zacks Analyst Blog Highlights: Microsoft, NextEra Energy and Starbucks
",0.2732
19/01/22,"NextEra Energy Inc. stock outperforms competitors on strong trading day
",0.6597
19/01/22,"NextEra Energy (NEE) Gains As Market Dips: What You Should Know
",0.5423
20/01/22,"JPMorgan Chase to use NextEra Energy Resources' Optos software platform to optimize energy and sustainable operations
",0.7506
20/01/22,"NextEra Energy (NEE) to Report Q4 Earnings: What to Expect
",0.2732
20/01/22,"NextEra Energy Inc. stock rises Thursday, outperforms market
",0.2732
20/01/22,"NextEra Energy Partners (NEP) Q4 Earnings: What's in Offing?
",0.2732
21/01/22,"NextEra Energy Inc. stock falls Friday, still outperforms market
",0.2732
21/01/22,"NextEra Energy (NEE) Stock Moves -1.09%: What You Should Know
",0.2732
24/01/22,"NextEra Energy Inc. stock outperforms competitors despite losses on the day
",0.52
25/01/22,"NextEra Energy, NextEra Energy Partners Name Ketchum CEO >NEE NEP
",0.4939
25/01/22,"NextEra Energy: Q4 Earnings Insights
",0.2732
25/01/22,"Those who invested in NextEra Energy (NYSE:NEE) five years ago are up 198%
",0.2732
25/01/22,"NextEra Energy Partners names John Ketchum CEO; Jim Robo to remain board chairman as part of a planned leadership succession process
",0.4404
25/01/22,"NextEra Energy names John Ketchum president and CEO; Jim Robo to become executive chairman as part of a planned leadership succession process
",0.4404
25/01/22,"NextEra Energy fourth-quarter and full-year 2021 financial results available on company's website
",0.2732
25/01/22,"NextEra Energy Partners, LP fourth-quarter and full-year 2021 financial results available on partnership's website
",0.2732
25/01/22,"NextEra Energy's (NEE) CEO Jim Robo on Q4 2021 Results - Earnings Call Transcript
",0.0
25/01/22,"Here's How Much You Would Have Made Owning NextEra Energy Stock In The Last 5 Years
",0.2732
25/01/22,"NextEra Energy names 19-year veteran John Ketchum as CEO
",0.2732
25/01/22,"NextEra Energy Partners (NEP) Reports Q4 Loss, Lags Revenue Estimates
",-0.4019
25/01/22,"NextEra Energy names incoming CEO
",0.2732
25/01/22,"NextEra (NEE) Beats Q4 Earnings Estimates, Ups 2022 EPS View
",0.0
25/01/22,"NextEra Energy Inc. stock underperforms Tuesday when compared to competitors
",0.2732
25/01/22,"Allred Capital Management, LLC Buys Tractor Supply Co, Equifax Inc, NextEra Energy Inc, Sells ...
",0.2732
25/01/22,"The CEO Who Turned NextEra Into a Clean-Energy Giant Is Stepping Down
",0.0
25/01/22,"Why NextEra Energy Stock Tumbled Today
",0.2732
26/01/22,"NextEra Energy Partners (NEP) Posts Q4 Loss, Misses on Sales
",-0.2732
26/01/22,"NextEra Energy Inc. stock falls Wednesday, underperforms market
",0.2732
27/01/22,"NextEra Energy Sees More High-Powered Growth Ahead
",0.6096
27/01/22,"NextEra Energy Inc. stock underperforms Thursday when compared to competitors
",0.2732
28/01/22,"Insider Buying: The NextEra Energy, Inc. (NYSE:NEE) Independent Director Just Bought 5.9% More Shares
",0.5563
28/01/22,"NextEra Energy Inc. stock falls Friday, underperforms market
",0.2732
28/01/22,"Wedgewood Investors Inc  Buys NextEra Energy Inc, Tesla Inc, Southern Co, Sells PayPal Holdings ...
",0.2732
30/01/22,"NextEra Energy: Pay Up For The Best Utility Stock In The Market
",0.7096
31/01/22,"NextEra Energy: The Long-Awaited Dip Finally Came
",0.2732
31/01/22,"Daimler Truck North America, NextEra Energy Resources and BlackRock Renewable Power Announce Plans To Accelerate Public Charging Infrastructure For Commercial Vehicles Across The U.S.
",0.2732
31/01/22,"BlackRock, NextEra Pitch EV Charging Network for U.S. Truck Routes
",0.0
31/01/22,"NextEra Energy Inc. stock outperforms competitors on strong trading day
",0.6597
01/02/22,"NextEra Energy Inc. stock underperforms Tuesday when compared to competitors
",0.2732
01/02/22,"Gitterman Wealth Management, LLC Buys Independence Realty Trust Inc, NextEra Energy Inc, ...
",0.8225
02/02/22,"NextEra Energy is once again recognized as No. 1 in its industry on Fortune's list of 'World's Most Admired Companies'
",0.5413
02/02/22,"NextEra Energy Inc. stock rises Wednesday, still underperforms market
",0.2732
02/02/22,"Was The Smart Money Right About NextEra Energy, Inc. (NEE)?
",0.5859
03/02/22,"Why NextEra Energy Stock Tumbled 16% in January
",0.2732
03/02/22,"NextEra Energy Inc. stock falls Thursday, underperforms market
",0.2732
04/02/22,"NextEra Energy Inc. stock rises Friday, still underperforms market
",0.2732
07/02/22,"Notable Stock Buys: Boeing and NextEra Energy
",0.2732
07/02/22,"Insider Weekends: Cluster Of Insider Purchases At NextEra And Charter
",0.0
07/02/22,"NextEra Energy Inc. stock falls Monday, underperforms market
",0.2732
07/02/22,"Benjamin Edwards Inc Buys Apple Inc, NextEra Energy Inc, Microsoft Corp, Sells ISHARES TRUST, ...
",0.7297
07/02/22,"Brooktree Capital Management Buys Rimini Street Inc, Fiserv Inc, NextEra Energy Inc, Sells ...
",0.2732
08/02/22,"NextEra Energy Inc. stock falls Tuesday, underperforms market
",0.2732
09/02/22,"NextEra Energy And American Tower: 2 Growing Dividends To Beat Inflation
",0.4215
09/02/22,"NextEra Energy Inc. stock outperforms market on strong trading day
",0.6597
