...............
----------------------------------------------------------------------
Ran 15 tests in 0.054s

OK

Name             Stmts   Miss Branch BrPart  Cover
Collatz.py          32      0     14      1    98%
TestCollatz.py      69      0      0      0   100%
--------------------------------------------------
TOTAL              101      0     14      1    99%
