508320 506540 382
830554 916749 525
814102 943380 525
89129 172799 383
293917 267192 407
373163 946287 525
112192 336906 443
35779 440287 449
625993 431253 470
184595 739102 509
80774 975814 525
996793 930525 507
983939 504889 525
463272 998408 525
260102 980788 525
201924 463525 449
228786 964364 525
32057 761674 509
366533 615824 470
675888 443803 509
777241 540519 509
478321 731831 509
293075 643964 509
872326 851220 432
636798 439493 509
633957 15998 509
383204 182502 443
774978 57641 509
874048 645768 525
662770 381283 509
350181 371865 410
253752 209495 443
970621 220374 525
385075 373611 423
638692 829998 504
390677 201663 443
414475 377031 449
245453 355651 441
229204 149008 386
776432 398464 509
29159 763674 509
891518 990860 507
771400 266289 509
806841 539088 509
725768 453468 509
446921 650257 509
972933 59541 525
704123 650044 442
896288 99406 525
708924 10678 509
478634 3051 449
930490 533815 525
732914 177121 509
317822 752978 509
68379 903440 525
309641 572357 470
955686 881691 507
610748 676784 509
625978 922999 525
406466 433757 449
709847 857193 525
748149 129065 509
507302 416386 444
457294 3018 449
721903 539194 509
424541 706263 509
37104 565442 470
822141 733381 468
796571 194530 509
612151 402190 470
352875 645686 509
517863 11574 470
687100 883303 525
991771 107683 525
862615 782237 525
610338 236676 470
851733 14420 525
604031 386082 470
824484 93566 509
103812 229817 386
112754 851047 525
933326 980833 507
648575 207294 509
277753 968442 525
43081 187925 383
321913 510873 449
520451 946394 525
897037 424064 525
677445 142853 509
349976 666763 509
786249 977256 525
96732 110386 354
685556 136893 509
499054 458337 444
823604 632869 504
334500 455653 449
74526 965644 525
376746 947486 525
41017 7916 324
430860 398241 449
150196 516289 470
391316 935932 525
146683 389675 443
447443 593558 470
398763 646846 509
937905 788355 525
112926 809686 509
48776 600798 470
21343 170384 383
312209 739624 509
103593 519913 470
618886 702653 509
378425 490518 449
651278 876407 525
321651 242770 407
482145 521084 470
766218 14097 509
243275 175285 443
96658 444362 449
527353 849817 525
524615 51035 470
597325 376464 470
738966 270031 509
651545 686857 442
917049 711750 525
131717 996484 525
27586 611930 470
219651 184703 386
158936 373899 443
682990 177555 509
884787 532204 525
341819 410537 449
61835 166819 383
680598 48766 509
375238 580809 470
530177 899488 525
914576 345785 525
957293 544711 525
689386 418386 509
987492 448128 525
256812 567064 470
802328 916300 525
816527 511872 509
74031 586180 470
343131 951382 525
911277 305069 525
100202 12209 351
730132 814487 468
858362 664411 525
413348 933906 525
