1 10 20
100 200 125
201 210 89
900 1000 174
1 1 1
834 162 171
919 708 179
808 519 171
883 790 179
692 555 145
444 751 171
59 297 128
77 355 144
95 500 144
571 832 171
835 375 171
7 346 144
227 589 144
300 930 179
842 574 171
546 476 142
497 857 171
793 735 153
212 657 145
365 819 171
270 784 171
900 813 179
629 946 179
642 353 142
17 965 179
493 698 145
700 355 145
637 242 144
823 531 171
885 158 179
712 665 171
991 306 179
628 610 132
484 937 179
813 207 171
383 390 121
988 793 179
553 726 171
390 101 144
202 716 171
962 859 179
807 765 153
166 58 122
77 281 128
181 213 120
968 936 174
228 457 144
112 315 131
1000 825 179
79 581 144
1000 999 112
11998 51664 324
44222 99275 351
34308 8979 308
48082 79293 351
12384 49414 324
58994 30139 340
24206 67188 340
58128 39533 340
52500 9325 324
2252 10429 262
66781 88025 351
42731 70469 340
69817 39967 340
39340 95776 351
88243 22320 351
67652 99780 351
76264 8831 340
71864 32929 340
43065 69406 340
85816 2853 351
80957 26286 351
7195 28582 308
8099 63488 340
27888 73449 340
74970 42622 340
88457 74209 351
51705 93187 351
95153 90191 333
1334 35549 311
46531 83208 351
99210 74288 351
35249 55281 340
72541 48151 340
79055 41180 351
26662 58530 340
54125 60463 322
90866 85048 333
58923 8922 340
98061 62729 351
44136 13267 324
45233 88501 351
35481 21900 311
6156 89913 351
88290 99832 333
94083 49663 351
87158 49421 351
94116 11868 351
59715 2931 340
72502 48184 340
5039 81639 351
999999 999999 259
999999 999000 396
558082 979977 525
566077 101672 470
453458 711200 509
220877 489174 449
268073 965265 525
889753 486255 525
144291 248133 443
245712 433544 449
684840 297766 509
202376 893924 525
568021 962843 525
795415 103855 509
428237 352892 449
517589 972996 525
677411 180635 509
593278 294837 470
802261 196630 509
554583 800550 509
850450 278326 525
694359 189362 509
790791 786633 406
951983 523268 525
851016 575268 525
883405 494189 525
898053 678406 525
482018 834631 509
579698 448813 470
718261 379162 509
912482 291164 525
792492 302548 509
439298 724233 509
633021 468377 509
701613 143203 509
203161 672038 509
118976 732747 509
191249 115583 383
745180 865133 525
819897 730462 468
288393 867651 525
112143 263947 443
487711 495099 426
939193 205230 525
651285 898347 525
325801 867106 525
586955 712116 509
742061 377643 509
983358 862539 507
753641 478660 509
938481 391883 525
522662 557173 452
