{
    "jira": {
        "baseUrl": ""
    },
    "timeInStatus": {
        "jql": "",
        "fields": "key,summary,status,created"
    },
    "teamReport": {
        "teams": [
            {
                "name": "",
                "scrumBoardId": "",
                "project": ""
            }
        ],
        "jql": "",
        "fields": [],
        "epicLinkField": "",
        "statuses": []
    }
}