^C:\PROJECTS\HOMEWORK_18\PROJECTS\HOMEWORK\DEBUG\HOMEWORK.OBJ
C:\PROJECTS\HOMEWORK_18\PROJECTS\DEBUG\HOMEWORK.EXE
C:\PROJECTS\HOMEWORK_18\PROJECTS\DEBUG\HOMEWORK.ILK
C:\PROJECTS\HOMEWORK_18\PROJECTS\DEBUG\HOMEWORK.PDB
