^C:\PROJECTS\HOMEWORK_17\PROJECTS\HOMEWORK\HOMEWORK.CPP
C:\PROJECTS\HOMEWORK_17\PROJECTS\HOMEWORK\DEBUG\VC142.PDB
C:\PROJECTS\HOMEWORK_17\PROJECTS\HOMEWORK\DEBUG\VC142.IDB
C:\PROJECTS\HOMEWORK_17\PROJECTS\HOMEWORK\DEBUG\HOMEWORK.OBJ
