^C:\PROJECTS\HOMEWORK_13\PROJECTS\HOMEWORK\DEBUG\HOMEWORK.OBJ
C:\PROJECTS\HOMEWORK_13\PROJECTS\DEBUG\HOMEWORK.EXE
C:\PROJECTS\HOMEWORK_13\PROJECTS\DEBUG\HOMEWORK.ILK
C:\PROJECTS\HOMEWORK_13\PROJECTS\DEBUG\HOMEWORK.PDB
