%YAML 1.1
%TAG !u! tag:unity3d.com,2011:
--- !u!114 &11400000
MonoBehaviour:
  m_ObjectHideFlags: 0
  m_CorrespondingSourceObject: {fileID: 0}
  m_PrefabInstance: {fileID: 0}
  m_PrefabAsset: {fileID: 0}
  m_GameObject: {fileID: 0}
  m_Enabled: 1
  m_EditorHideFlags: 0
  m_Script: {fileID: 11500000, guid: 137406f127bd6f0449aba7b2efeee1a5, type: 3}
  m_Name: EnemyInfo_Enemy_0
  m_EditorClassIdentifier: 
  _type: 1
  _healthAmount: 2
  _movingSpeed: 2
  _damage: 1
  _reward: 10
  _sprite: {fileID: 21300000, guid: 1b1debadf4a7ae6449a8d87e04aa7458, type: 3}
