%YAML 1.1
%TAG !u! tag:unity3d.com,2011:
--- !u!114 &11400000
MonoBehaviour:
  m_ObjectHideFlags: 0
  m_CorrespondingSourceObject: {fileID: 0}
  m_PrefabInstance: {fileID: 0}
  m_PrefabAsset: {fileID: 0}
  m_GameObject: {fileID: 0}
  m_Enabled: 1
  m_EditorHideFlags: 0
  m_Script: {fileID: 11500000, guid: 75506f102735b0e4ab1e579918c09fb6, type: 3}
  m_Name: TowerBuildInfo_tower_2_0
  m_EditorClassIdentifier: 
  _towerType: 2
  _buildPrice: 130
  _range: 2.5
  _shootInterval: 1
  _damage: 3
  _shellSpeed: 6
  _sprite: {fileID: 21300000, guid: d512ec1710e3e8142a71173facf9816e, type: 3}
  _iconBuildSprite: {fileID: 21300000, guid: f9a9edd27795785449211d286990c6b5, type: 3}
  _shellSprite: {fileID: 21300000, guid: 605b7d63c9fcb4f488242a7ccbff9f79, type: 3}
