{
    "extraDate": 0,
    "addresses": [
      {
        "country": "US",
        "address3": "",
        "address2": "c/o Hayneedle, 2118 Water Ridge Parkway",
        "city": "Charlotte",
        "contactEmail": "",
        "address1": "Walmart Inc.",
        "postalCode": "28217",
        "contactFax": "",
        "type": "BT",
        "companyName1": "Hayneedle Inc",
        "companyName2": "Hayneedle.com",
        "dunsType": "12",
        "recordId": "BT",
        "consolidator": "",
        "contactOther": "",
        "address4": "",
        "state": "NC",
        "contactPhone": "",
        "locationCode": "",
        "locationNumber": "18888804884",
        "dunsNumber": "18888804884"
      },
      {
        "country": "CA",
        "address3": "",
        "address2": "",
        "city": "Montreal",
        "contactEmail": "",
        "address1": "280 - 5050 Rue Pare",
        "postalCode": "H4P 1P3",
        "contactFax": "",
        "type": "RE",
        "companyName1": "Nathan James",
        "companyName2": "",
        "dunsType": "",
        "recordId": "RE",
        "consolidator": "",
        "contactOther": "",
        "address4": "",
        "state": "QC",
        "contactPhone": "",
        "locationCode": "",
        "locationNumber": "",
        "dunsNumber": ""
      },
      {
        "country": "CA",
        "address3": "",
        "address2": "",
        "city": "Montreal",
        "contactEmail": "",
        "address1": "280 - 5050 Rue Pare",
        "postalCode": "H4P 1P3",
        "contactFax": "",
        "type": "SF",
        "companyName1": "Nathan James",
        "companyName2": "",
        "dunsType": "",
        "recordId": "SF",
        "consolidator": "",
        "contactOther": "",
        "address4": "",
        "state": "QC",
        "contactPhone": "",
        "locationCode": "",
        "locationNumber": "",
        "dunsNumber": ""
      },
      {
        "country": "US",
        "address3": "",
        "address2": "3G",
        "city": "NEW YORK",
        "contactEmail": "",
        "address1": "215 East 68th Street",
        "postalCode": "10065",
        "contactFax": "",
        "type": "ST",
        "companyName1": "Brian Donaghy",
        "companyName2": "",
        "dunsType": "12",
        "recordId": "ST",
        "consolidator": "",
        "contactOther": "",
        "address4": "",
        "state": "NY",
        "contactPhone": "",
        "locationCode": "",
        "locationNumber": "9179215296",
        "dunsNumber": "9179215296"
      },
      {
        "country": "",
        "address3": "",
        "address2": "",
        "city": "",
        "contactEmail": "",
        "address1": "",
        "postalCode": "",
        "contactFax": "",
        "type": "VN",
        "companyName1": "",
        "companyName2": "",
        "dunsType": "",
        "recordId": "VN",
        "consolidator": "",
        "contactOther": "",
        "address4": "",
        "state": "",
        "contactPhone": "",
        "locationCode": "",
        "locationNumber": "",
        "dunsNumber": ""
      }
    ],
    "notes": [
      {
        "recordId": "001",
        "note": "Original Transmission of Order",
        "type": "BEG01"
      },
      {
        "recordId": "002",
        "note": "Direct to Consumer Order",
        "type": "BEG02"
      },
      {
        "recordId": "003",
        "note": "Order Contact: customer_service@hayneedle.com Telephone Number: 1-888-880-4884 E-Mail Address: customer_service@hayneedle.com",
        "type": "PER"
      },
      {
        "recordId": "004",
        "note": "Carrier: FDXSO FDX-Air-Standard Overnight",
        "type": "TD5"
      },
      {
        "recordId": "005",
        "note": "Supplier Message",
        "type": "N9"
      },
      {
        "recordId": "006",
        "note": "SM:For alternative ship methods please refer to the Hayneedle routing guide.",
        "type": "MTX"
      }
    ],
    "buyerEmail": "",
    "documentNumber": "90994127",
    "parcelRef01": "",
    "taxes": [],
    "type": "850",
    "parcelCarrier": "",
    "salesChannel": "EDI",
    "recordIdStr": "40721314",
    "customerOrderNumber": "",
    "parcelRef03": "",
    "parcelRef02": "",
    "recordId": 40721314,
    "vendorNumberAp": "",
    "itemXrefPrice": 0,
    "customerOrderRef": "",
    "terms": [],
    "parcelSignature": "",
    "poDate": 20191222,
    "orderCases": 14,
    "remitToAddress": {
      "country": "CA",
      "address3": "",
      "address2": "",
      "city": "Montreal",
      "contactEmail": "",
      "address1": "280 - 5050 Rue Pare",
      "postalCode": "H4P 1P3",
      "contactFax": "",
      "type": "RE",
      "companyName1": "Nathan James",
      "companyName2": "",
      "dunsType": "",
      "recordId": "RE",
      "consolidator": "",
      "contactOther": "",
      "address4": "",
      "state": "QC",
      "contactPhone": "",
      "locationCode": "",
      "locationNumber": "",
      "dunsNumber": ""
    },
    "carrierService": "",
    "salesChannelDiscount": 0,
    "shipAccountZip": "",
    "contractNumber": "",
    "receiveDate": "2020-04-11 15:33:32.0",
    "salesChannelShipping": 0,
    "shipDate": 20191224,
    "totalRoutResp": 0,
    "salesChannelHandling": 0,
    "detailLineCount": 2,
    "parcelResidential": "",
    "itemXrefCount": 0,
    "fobText": "",
    "shipFromAddress": {
      "country": "CA",
      "address3": "",
      "address2": "",
      "city": "Montreal",
      "contactEmail": "",
      "address1": "280 - 5050 Rue Pare",
      "postalCode": "H4P 1P3",
      "contactFax": "",
      "type": "SF",
      "companyName1": "Nathan James",
      "companyName2": "",
      "dunsType": "",
      "recordId": "SF",
      "consolidator": "",
      "contactOther": "",
      "address4": "",
      "state": "QC",
      "contactPhone": "",
      "locationCode": "",
      "locationNumber": "",
      "dunsNumber": ""
    },
    "carrierCode": "FDXSO",
    "departmentNumber": "",
    "parcelService": "",
    "poCategory": "",
    "requestedDeliveryDate": 0,
    "poType": "SA",
    "salesChannelTax": 0,
    "releaseNumber": "",
    "customerAccount": "",
    "items": [
      {
        "itemNotes": [
          {
            "recordId": "007",
            "note": "NETSHOPS Item Description: Nathan James Viktor 3 Piece Counter Height Dining Table Set Light Gray Dark Br",
            "type": "DTL"
          },
          {
            "recordId": "008",
            "note": "GROSS Weight Per Pack: 66 LB",
            "type": "DTL"
          }
        ],
        "packSize": 1,
        "itemReferenceEachesNo": 0,
        "cartonUom": "",
        "itemChargesAndAllowances": [],
        "qtyAsn": 0,
        "caseGroupCode": "",
        "itemDimensionWidth": 0,
        "originalLineNo": "1",
        "recordId": "0001",
        "lineNo": "0001",
        "skuNumber": "",
        "commodityCode": "",
        "mfgCity": "",
        "itemWidth": "",
        "qtyAck": 0,
        "unitPrice": 174.99,
        "custFld03Nam": "",
        "itemDimensionHeight": 0,
        "vendorItem": "41202",
        "itemReferencePackSize": 0,
        "unitSize": "",
        "shipDate": 0,
        "gtinNumber": "",
        "inners": 1,
        "upcCaseCode": "",
        "customerItem": "BLUY024-2",
        "cartonHeight": 0,
        "mfgCountry": "",
        "custFld03Val": "",
        "prepackCode": "",
        "custFld02Nam": "",
        "itemSubColor": "",
        "itemColor": "",
        "itemDimensionLength": 0,
        "itemReferencePrice": 0,
        "cartonWidth": 0,
        "qtyChange": 0,
        "qtyMultiCarton": 1,
        "unitSizeBuyer": "",
        "cartonLength": 0,
        "sellingPrice": 0,
        "custFld02Val": "",
        "expireDate": 0,
        "nrfColor": "",
        "priceBasis": "",
        "itemWeight": 66,
        "upcCode": "628110580375",
        "nrfDesc": "",
        "custFld01Nam": "",
        "discountPercent": 0,
        "itemColorBuyer": "",
        "buyerStyleNo": "",
        "ticketType": "",
        "lotNumber": "",
        "itemDesc": "Nathan James Viktor 3 Piece Counter Height Dining Table Set Light Gray Dark Br",
        "extItemRef": "",
        "unitMeasure": "EA",
        "itemPackCode": "",
        "itemDimensionUom": "",
        "itemReferenceId": 0,
        "qtyOrder": 2,
        "rebatePrice": 0,
        "custFld01Val": "",
        "nrfSize": "",
        "itemComponents": [],
        "countryOfOrigin": "",
        "itemTaxes": [],
        "mfgName": "",
        "qtyInvoice": 0
      },
      {
        "itemNotes": [],
        "packSize": 1,
        "itemReferenceEachesNo": 0,
        "cartonUom": "",
        "itemChargesAndAllowances": [],
        "qtyAsn": 0,
        "caseGroupCode": "",
        "itemDimensionWidth": 0,
        "originalLineNo": "2",
        "recordId": "0002",
        "lineNo": "0002",
        "skuNumber": "",
        "commodityCode": "",
        "mfgCity": "",
        "itemWidth": "",
        "qtyAck": 0,
        "unitPrice": 90.83,
        "custFld03Nam": "",
        "itemDimensionHeight": 0,
        "vendorItem": "32703",
        "itemReferencePackSize": 0,
        "unitSize": "",
        "shipDate": 0,
        "gtinNumber": "",
        "inners": 1,
        "upcCaseCode": "",
        "customerItem": "",
        "cartonHeight": 0,
        "mfgCountry": "",
        "custFld03Val": "",
        "prepackCode": "",
        "custFld02Nam": "",
        "itemSubColor": "",
        "itemColor": "",
        "itemDimensionLength": 0,
        "itemReferencePrice": 0,
        "cartonWidth": 0,
        "qtyChange": 0,
        "qtyMultiCarton": 1,
        "unitSizeBuyer": "",
        "cartonLength": 0,
        "sellingPrice": 0,
        "custFld02Val": "",
        "expireDate": 0,
        "nrfColor": "",
        "priceBasis": "PE",
        "itemWeight": 0,
        "upcCode": "",
        "nrfDesc": "",
        "custFld01Nam": "",
        "discountPercent": 0,
        "itemColorBuyer": "",
        "buyerStyleNo": "",
        "ticketType": "",
        "lotNumber": "",
        "itemDesc": "",
        "extItemRef": "",
        "unitMeasure": "EA",
        "itemPackCode": "",
        "itemDimensionUom": "",
        "itemReferenceId": 0,
        "qtyOrder": 12,
        "rebatePrice": 0,
        "custFld01Val": "",
        "nrfSize": "",
        "itemComponents": [],
        "countryOfOrigin": "",
        "itemTaxes": [],
        "mfgName": "",
        "qtyInvoice": 0
      }
    ],
    "merchandiseCode": "",
    "poNumber": "90994127",
    "documentDate": 20191222,
    "shipToAddress": {
      "country": "US",
      "address3": "",
      "address2": "3G",
      "city": "NEW YORK",
      "contactEmail": "",
      "address1": "215 East 68th Street",
      "postalCode": "10065",
      "contactFax": "",
      "type": "ST",
      "companyName1": "Brian Donaghy",
      "companyName2": "",
      "dunsType": "12",
      "recordId": "ST",
      "consolidator": "",
      "contactOther": "",
      "address4": "",
      "state": "NY",
      "contactPhone": "",
      "locationCode": "",
      "locationNumber": "9179215296",
      "dunsNumber": "9179215296"
    },
    "cancelDate": 0,
    "routingInstructions": "FDX-Air-Standard Overnight",
    "serviceCode": "",
    "tagId": 0,
    "transportTermsCode": "",
    "extraDateType": "",
    "orderStatus": 0,
    "salesChannelStatus": "",
    "departmentDescription": "",
    "orderWeight": 132,
    "billToAddress": {
      "country": "US",
      "address3": "",
      "address2": "c/o Hayneedle, 2118 Water Ridge Parkway",
      "city": "Charlotte",
      "contactEmail": "",
      "address1": "Walmart Inc.",
      "postalCode": "28217",
      "contactFax": "",
      "type": "BT",
      "companyName1": "Hayneedle Inc",
      "companyName2": "Hayneedle.com",
      "dunsType": "12",
      "recordId": "BT",
      "consolidator": "",
      "contactOther": "",
      "address4": "",
      "state": "NC",
      "contactPhone": "",
      "locationCode": "",
      "locationNumber": "18888804884",
      "dunsNumber": "18888804884"
    },
    "salesChannelId": "",
    "totalRoutReq": 0,
    "shipMode": "",
    "vendor": "21416",
    "salesOrderNumber": "",
    "fobLocation": "",
    "isOpenShipment": 0,
    "transportCode": "",
    "transactionPurpose": "00",
    "externalId": "",
    "isValidateErrors": 0,
    "fobCode": "",
    "chargesAndAllowances": [],
    "documentAmount": 349.98,
    "isOpenAck": 0,
    "shipAccountNo": "",
    "ediBatchSize": "",
    "partner": "NETSHOPS",
    "salesChannelTotal": 0,
    "buyerAccount": "",
    "isOpenInvoice": 0,
    "fulfillAuthStatus": "NOT_USED",
    "documentId": 40721314,
    "location": "",
    "currencyCode": "",
    "dupSourceId": 0,
    "account": "NAT45DEMO",
    "totalChanges": 0,
    "transportTermsQual": ""
  }