<svg width="20" height="20" viewBox="0 0 20 20" fill="none" xmlns="http://www.w3.org/2000/svg">
<path d="M5.8618 16.2764C5.9465 16.107 6.11963 16 6.30902 16H13.691C13.8804 16 14.0535 16.107 14.1382 16.2764L14.6382 17.2764C14.8044 17.6088 14.5627 18 14.191 18H5.80902C5.43733 18 5.19558 17.6088 5.3618 17.2764L5.8618 16.2764Z" fill="#1753FF"/>
<path fill-rule="evenodd" clip-rule="evenodd" d="M10 16C10 16 16 11.3137 16 8C16 4.68629 13.3137 2 10 2C6.68629 2 4 4.68629 4 8C4 11.3137 10 16 10 16ZM10 9C11.1046 9 12 8.10457 12 7C12 5.89543 11.1046 5 10 5C8.89543 5 8 5.89543 8 7C8 8.10457 8.89543 9 10 9Z" fill="#1753FF"/>
</svg>
