<svg width="83" height="48" viewBox="0 0 83 48" fill="none" xmlns="http://www.w3.org/2000/svg">
<path fill-rule="evenodd" clip-rule="evenodd" d="M41.1017 36H69.3356C71.427 30.0569 73.5184 24.0455 75.6795 18.0342L79.5835 6.89943H72.1939L63.8282 30.4668H50.6524L59.3666 5.60152H61.7368L62.5734 8.81214L55.6021 28.9639H62.9917L70.7299 6.0797L68.4293 0H53.7198C51.6284 6.01139 49.537 12.0228 47.4456 18.0342C45.2845 23.9772 43.1931 29.9886 41.1017 36ZM16.8414 18.7173H20.8847L23.0459 12.2277L25.207 5.73814H23.1853H21.1636L19.0025 12.296L16.8414 18.7173ZM80.1412 5.25996L82.0235 0H74.6338L72.7516 5.25996H80.1412ZM3.03809 36H22.0002L23.9521 30.3302H12.5888L13.6345 27.8027L14.6802 25.0702C15.3774 25.0702 16.0048 25.0702 16.7019 25.0702C17.3991 25.0702 18.0265 25.0702 18.7236 25.0702C18.3751 25.9583 18.0265 26.9146 17.6779 27.8027L17.1899 29.1689C17.7476 29.1689 18.3053 29.1689 18.7933 29.1689L24.4401 29.1006L28.2047 18.1708C30.2961 12.1594 32.3178 6.14801 34.4092 0.0683112H18.9328L13.2163 6.0797L9.10316 18.1025C7.08147 24.0455 5.05978 30.0569 3.03809 36ZM23.5339 36H39.7074L41.6594 30.3302H32.1783L38.0343 14.0721L43.0536 0H35.8034C33.712 6.0797 31.6903 12.0911 29.5989 18.1025C27.5772 24.1139 25.5555 30.0569 23.5339 36ZM42.1473 28.8273L45.9119 18.1025C47.2364 14.3454 48.561 10.5199 49.8855 6.76281H42.3565L39.7771 14.1404L34.6183 28.8273H42.1473ZM50.3735 5.19165C51.001 3.48387 51.5587 1.70778 52.1861 0H44.7268C44.0993 1.70778 43.5416 3.41556 42.9142 5.19165H50.3735Z" fill="#1753FF"/>
<path d="M2.71387 45.7823C1.85022 45.7823 1.31248 45.5669 1.10065 45.1361C0.890983 44.6991 0.928254 44.0716 1.21246 43.2537L2.15619 40.5379C2.4469 39.7013 2.84343 39.0707 3.34579 38.6462C3.85701 38.2154 4.5478 38 5.41814 38C6.24831 38 6.76795 38.1904 6.97705 38.5713C7.19502 38.9459 7.18143 39.4859 6.93628 40.1914L6.71499 40.8282H5.1082L5.35227 40.1258C5.43037 39.9011 5.4799 39.72 5.50085 39.5827C5.52849 39.4453 5.50729 39.3329 5.43723 39.2455C5.37605 39.1519 5.24503 39.1051 5.04418 39.1051C4.74291 39.1051 4.5173 39.1956 4.36735 39.3766C4.2174 39.5577 4.08168 39.823 3.96019 40.1727L2.76263 43.619C2.63896 43.9748 2.59697 44.2402 2.63665 44.415C2.67633 44.5898 2.83342 44.6772 3.10791 44.6772C3.3891 44.6772 3.60023 44.5898 3.74132 44.415C3.88457 44.2339 4.01695 43.9686 4.13844 43.619L4.39552 42.8791H6.00231L5.78428 43.5066C5.53261 44.2308 5.16664 44.7927 4.68635 45.1923C4.20823 45.5856 3.55073 45.7823 2.71387 45.7823Z" fill="#333742"/>
<path d="M7.7457 45.7729C7.10968 45.7729 6.68071 45.6106 6.45877 45.2859C6.24354 44.9613 6.24222 44.493 6.45483 43.8812L7.08615 42.0644C7.29876 41.4525 7.62885 40.9843 8.07641 40.6596C8.52397 40.335 9.06241 40.1727 9.69174 40.1727C10.3411 40.1727 10.7601 40.335 10.9485 40.6596C11.137 40.9843 11.1206 41.465 10.8993 42.1018L10.5706 43.0477H8.25082L7.88635 44.0966C7.80608 44.3276 7.78432 44.4961 7.82108 44.6023C7.86454 44.7084 7.95992 44.7615 8.10721 44.7615C8.40848 44.7615 8.62962 44.5586 8.77064 44.1528L8.95288 43.6283H10.3588L10.1961 44.0966C10.0074 44.6397 9.70241 45.0549 9.28126 45.3421C8.8601 45.6293 8.34825 45.7729 7.7457 45.7729ZM9.38894 42.3734L9.57118 41.849C9.65362 41.6117 9.67538 41.4432 9.63644 41.3433C9.59968 41.2371 9.50096 41.1841 9.34028 41.1841C9.1863 41.1841 9.05296 41.2403 8.94026 41.3526C8.83426 41.465 8.73136 41.6648 8.63157 41.952L8.48513 42.3734H9.38894Z" fill="#333742"/>
<path d="M12.4408 40.2663H13.9472L13.8072 40.669C14.3105 40.3381 14.7797 40.1727 15.2149 40.1727C15.6479 40.1789 15.9084 40.3444 15.9965 40.669C16.0845 40.9937 16.0461 41.3932 15.8812 41.8677L15.1457 43.9842C14.9592 44.5211 14.6979 44.955 14.362 45.2859C14.0283 45.6106 13.6471 45.7729 13.2187 45.7729C12.8371 45.7729 12.5006 45.6043 12.2094 45.2672L11.4479 47.4586H9.94154L12.4408 40.2663ZM12.8745 44.827C13.1825 44.827 13.4276 44.5648 13.6098 44.0404L14.3973 41.7741C14.5622 41.2996 14.494 41.0623 14.1928 41.0623C14.0321 41.0623 13.8341 41.131 13.599 41.2684L12.4177 44.6678C12.5615 44.774 12.7138 44.827 12.8745 44.827Z" fill="#333742"/>
<path d="M17.3835 40.2663H19.3418C19.864 40.2663 20.2485 40.3256 20.4951 40.4443C20.744 40.5566 20.8839 40.7127 20.9149 40.9125C20.9547 41.106 20.9248 41.3464 20.825 41.6336C20.7143 41.952 20.555 42.1986 20.347 42.3734C20.1411 42.542 19.8845 42.6637 19.5773 42.7387C19.9286 42.8261 20.1354 42.9821 20.1979 43.2069C20.2671 43.4317 20.2355 43.7345 20.1032 44.1153C19.9166 44.6522 19.6182 45.0487 19.2079 45.3047C18.7997 45.5544 18.2007 45.6793 17.4107 45.6793H15.5026L17.3835 40.2663ZM18.5765 42.4109C18.7707 42.4109 18.9274 42.3547 19.0468 42.2423C19.1729 42.1299 19.2761 41.9582 19.3564 41.7272C19.4345 41.5025 19.4428 41.3339 19.3815 41.2215C19.3289 41.1029 19.1788 41.0436 18.9311 41.0436H18.6198L18.1447 42.4109H18.5765ZM17.5866 44.8551C17.7606 44.8551 17.9066 44.8395 18.0246 44.8083C18.1447 44.7709 18.2578 44.6959 18.3638 44.5836C18.4698 44.4712 18.563 44.2995 18.6432 44.0685C18.7343 43.8063 18.7704 43.6158 18.7514 43.4972C18.7345 43.3724 18.6813 43.2943 18.5917 43.2631C18.5021 43.2319 18.3636 43.2163 18.1761 43.2163H17.8648L17.2953 44.8551H17.5866Z" fill="#333742"/>
<path d="M22.2675 40.2663H23.4725L22.4117 43.3193L25.0392 40.2663H26.2242L24.3432 45.6793H23.118L24.1724 42.645L21.5816 45.6793H20.3865L22.2675 40.2663Z" fill="#333742"/>
<path d="M27.1634 45.7729C26.5274 45.7729 26.1029 45.6075 25.8898 45.2766C25.6767 44.9457 25.6743 44.4805 25.8826 43.8812L26.5172 42.055C26.7276 41.4494 27.0533 40.9843 27.4941 40.6596C27.935 40.335 28.4734 40.1727 29.1095 40.1727C29.7321 40.1727 30.153 40.31 30.3722 40.5847C30.5981 40.8594 30.6156 41.2715 30.4247 41.8209L30.2457 42.336H28.7896L28.9816 41.7834C29.064 41.5462 29.0869 41.3839 29.0504 41.2965C29.0159 41.2028 28.9251 41.156 28.7778 41.156C28.6171 41.156 28.4838 41.2122 28.3778 41.3246C28.2785 41.4369 28.18 41.6336 28.0824 41.9145L27.3404 44.0498C27.2428 44.3307 27.209 44.5242 27.2391 44.6304C27.2759 44.7365 27.3679 44.7896 27.5152 44.7896C27.6692 44.7896 27.7936 44.7396 27.8886 44.6397C27.9903 44.5399 28.0791 44.3806 28.155 44.1621L28.3828 43.5066H29.8389L29.6307 44.1059C29.4419 44.6491 29.137 45.0643 28.7158 45.3515C28.2968 45.6324 27.7794 45.7729 27.1634 45.7729Z" fill="#333742"/>
<path d="M31.8126 44.8083C32.3237 44.5898 32.77 44.2495 33.1515 43.7875C33.5418 43.3193 33.909 42.6575 34.2531 41.8022L34.9274 40.2663H38.0004L36.4286 44.7896H37.242L36.4285 47.1308H35.3338L35.7278 45.6793H32.705L32.1102 47.1308H31.0056L31.8126 44.8083ZM35.0327 44.7896L36.3019 41.1373H35.7495L35.3142 42.1299C35.016 42.8916 34.7172 43.4722 34.4177 43.8718C34.1181 44.2714 33.7909 44.5773 33.4359 44.7896H35.0327Z" fill="#333742"/>
<path d="M39.333 45.7729C38.7037 45.7729 38.2726 45.6168 38.0396 45.3047C37.8133 44.9925 37.8032 44.5398 38.0093 43.9467L38.6862 41.9988C38.8923 41.4057 39.217 40.9531 39.6602 40.6409C40.1101 40.3287 40.6497 40.1727 41.2791 40.1727C41.9084 40.1727 42.3362 40.3287 42.5625 40.6409C42.7954 40.9531 42.8089 41.4057 42.6028 41.9988L41.9259 43.9467C41.7198 44.5398 41.3918 44.9925 40.9419 45.3047C40.4986 45.6168 39.9624 45.7729 39.333 45.7729ZM39.675 44.8177C39.8491 44.8177 39.9879 44.7552 40.0916 44.6304C40.2041 44.4993 40.3048 44.3057 40.3938 44.0498L41.139 41.9052C41.2279 41.6492 41.2617 41.4557 41.2403 41.3246C41.2256 41.1934 41.1312 41.1279 40.9572 41.1279C40.7764 41.1279 40.6287 41.1966 40.514 41.3339C40.4015 41.465 40.3019 41.6554 40.2151 41.9052L39.4699 44.0498C39.3831 44.2995 39.3504 44.4899 39.3718 44.621C39.3932 44.7521 39.4942 44.8177 39.675 44.8177Z" fill="#333742"/>
<path d="M44.0399 45.7729C43.4039 45.7729 42.9794 45.6075 42.7663 45.2766C42.5532 44.9457 42.5508 44.4805 42.7591 43.8812L43.3937 42.055C43.6041 41.4494 43.9298 40.9843 44.3707 40.6596C44.8115 40.335 45.35 40.1727 45.986 40.1727C46.6086 40.1727 47.0295 40.31 47.2487 40.5847C47.4746 40.8594 47.4921 41.2715 47.3012 41.8209L47.1222 42.336H45.6661L45.8581 41.7834C45.9405 41.5462 45.9634 41.3839 45.9269 41.2965C45.8925 41.2028 45.8016 41.156 45.6543 41.156C45.4937 41.156 45.3603 41.2122 45.2543 41.3246C45.155 41.4369 45.0565 41.6336 44.9589 41.9145L44.2169 44.0498C44.1193 44.3307 44.0855 44.5242 44.1156 44.6304C44.1524 44.7365 44.2444 44.7896 44.3917 44.7896C44.5457 44.7896 44.6701 44.7396 44.7651 44.6397C44.8668 44.5399 44.9556 44.3806 45.0315 44.1621L45.2593 43.5066H46.7154L46.5072 44.1059C46.3184 44.6491 46.0135 45.0643 45.5923 45.3515C45.1733 45.6324 44.6559 45.7729 44.0399 45.7729Z" fill="#333742"/>
<path d="M49.0601 41.2403H48.0056L48.3441 40.2663H51.9794L51.641 41.2403H50.5765L49.034 45.6793H47.5176L49.0601 41.2403Z" fill="#333742"/>
<path d="M51.8997 45.7729C51.6319 45.7729 51.4193 45.7105 51.2618 45.5856C51.1044 45.4607 51.0068 45.2984 50.9691 45.0986C50.9403 44.8926 50.9638 44.6803 51.0397 44.4618C51.1851 44.0435 51.4149 43.7001 51.7291 43.4317C52.0433 43.1632 52.3805 42.9541 52.7405 42.8042C53.1072 42.6544 53.5787 42.4921 54.155 42.3172L54.3307 41.8115C54.398 41.618 54.4188 41.4713 54.3933 41.3714C54.3744 41.2715 54.2914 41.2215 54.1441 41.2215C53.9968 41.2215 53.8778 41.2652 53.7872 41.3526C53.6966 41.4401 53.6164 41.5649 53.5466 41.7272L53.3863 42.1018L51.9798 42.0457C52.23 41.4026 52.5712 40.9312 53.0034 40.6315C53.4378 40.3256 53.983 40.1727 54.6391 40.1727C55.2082 40.1727 55.5857 40.3194 55.7716 40.6128C55.9575 40.9063 55.9615 41.3089 55.7836 41.8209L54.9082 44.3401C54.7607 44.7646 54.639 45.211 54.5433 45.6793H53.1876C53.2237 45.4982 53.2702 45.2391 53.3271 44.902C53.16 45.1517 52.9501 45.3608 52.6973 45.5294C52.4535 45.6917 52.1876 45.7729 51.8997 45.7729ZM52.7902 44.7709C52.8906 44.7709 52.9952 44.7396 53.1039 44.6772C53.2194 44.6148 53.3213 44.543 53.4098 44.4618L53.9272 42.9728C53.5539 43.1414 53.2522 43.3162 53.0219 43.4972C52.7916 43.6783 52.6309 43.8999 52.5398 44.1621C52.4725 44.3557 52.4606 44.5055 52.5041 44.6116C52.5475 44.7178 52.6429 44.7709 52.7902 44.7709Z" fill="#333742"/>
<path d="M57.3262 40.2663H59.2845C59.8067 40.2663 60.1912 40.3256 60.4378 40.4442C60.6866 40.5566 60.8266 40.7127 60.8576 40.9125C60.8974 41.106 60.8675 41.3464 60.7677 41.6336C60.657 41.952 60.4977 42.1986 60.2897 42.3734C60.0838 42.542 59.8272 42.6637 59.52 42.7387C59.8713 42.8261 60.0781 42.9821 60.1406 43.2069C60.2098 43.4317 60.1782 43.7345 60.0459 44.1153C59.8593 44.6522 59.5609 45.0487 59.1506 45.3047C58.7424 45.5544 58.1434 45.6793 57.3534 45.6793H55.4453L57.3262 40.2663ZM58.5192 42.4109C58.7134 42.4109 58.8701 42.3547 58.9895 42.2423C59.1156 42.1299 59.2188 41.9582 59.2991 41.7272C59.3772 41.5025 59.3855 41.3339 59.3242 41.2215C59.2716 41.1029 59.1215 41.0436 58.8738 41.0436H58.5625L58.0874 42.4109H58.5192ZM57.5293 44.8551C57.7033 44.8551 57.8493 44.8395 57.9673 44.8083C58.0874 44.7709 58.2005 44.6959 58.3065 44.5836C58.4125 44.4712 58.5057 44.2995 58.5859 44.0685C58.677 43.8063 58.7131 43.6158 58.6941 43.4972C58.6772 43.3724 58.624 43.2943 58.5344 43.2631C58.4448 43.2319 58.3063 43.2163 58.1188 43.2163H57.8075L57.238 44.8551H57.5293Z" fill="#333742"/>
<path d="M62.2102 40.2663H63.7165L62.9648 42.4296H63.2259L64.9015 40.2663H66.5284L64.4686 42.8417L64.6776 45.6793H63.0708L62.9395 43.2537H62.6784L61.8356 45.6793H60.3292L62.2102 40.2663Z" fill="#333742"/>
<path d="M67.1529 40.2663H68.358L67.2971 43.3193L69.9246 40.2663H71.1096L69.2287 45.6793H68.0035L69.0579 42.645L66.467 45.6793H65.272L67.1529 40.2663Z" fill="#333742"/>
</svg>
