<svg width="186" height="125" viewBox="0 0 186 125" fill="none" xmlns="http://www.w3.org/2000/svg">
<path d="M40.3444 105.759C40.5986 105.764 40.8512 105.719 41.0875 105.626C41.3238 105.533 41.539 105.394 41.7205 105.218C41.9021 105.041 42.0463 104.831 42.1448 104.598C42.2432 104.366 42.294 104.116 42.294 103.864C42.294 103.612 42.2432 103.362 42.1448 103.13C42.0463 102.897 41.9021 102.687 41.7205 102.51C41.539 102.334 41.3238 102.195 41.0875 102.102C40.8512 102.009 40.5986 101.964 40.3444 101.969H35.0745C34.3657 101.969 33.6859 101.69 33.1846 101.192C32.6834 100.695 32.4018 100.021 32.4018 99.3177C32.4018 98.6146 32.6834 97.9403 33.1846 97.4431C33.6859 96.9459 34.3657 96.6666 35.0745 96.6666H56.9751C57.1951 96.6713 57.4138 96.6324 57.6184 96.5522C57.8231 96.472 58.0095 96.352 58.1668 96.1994C58.324 96.0467 58.449 95.8644 58.5343 95.6632C58.6196 95.462 58.6636 95.246 58.6636 95.0277C58.6636 94.8094 58.6196 94.5933 58.5343 94.3921C58.449 94.1909 58.324 94.0087 58.1668 93.856C58.0095 93.7034 57.8231 93.5834 57.6184 93.5032C57.4138 93.4229 57.1951 93.384 56.9751 93.3888H50.2011C49.5882 93.3888 49.0005 93.1473 48.5671 92.7174C48.1337 92.2875 47.8902 91.7045 47.8902 91.0965C47.8902 90.4886 48.1337 89.9055 48.5671 89.4756C49.0005 89.0458 49.5882 88.8043 50.2011 88.8043H63.5109C63.9395 88.8027 64.3507 88.6358 64.6575 88.339C64.9643 88.0421 65.1428 87.6386 65.1551 87.2136C65.1674 86.7887 65.0127 86.3756 64.7236 86.0617C64.4345 85.7479 64.0336 85.5579 63.6059 85.5318H62.655C62.3661 85.5373 62.0791 85.4855 61.8106 85.3796C61.5421 85.2737 61.2975 85.1157 61.0913 84.915C60.8851 84.7142 60.7212 84.4747 60.6094 84.2104C60.4976 83.9462 60.44 83.6624 60.44 83.3758C60.44 83.0892 60.4976 82.8054 60.6094 82.5412C60.7212 82.2769 60.8851 82.0374 61.0913 81.8366C61.2975 81.6359 61.5421 81.4779 61.8106 81.372C62.0791 81.2661 62.3661 81.2144 62.655 81.2198H98.9135C99.2024 81.2144 99.4895 81.2661 99.758 81.372C100.026 81.4779 100.271 81.6359 100.477 81.8366C100.683 82.0374 100.847 82.2769 100.959 82.5412C101.071 82.8054 101.129 83.0892 101.129 83.3758C101.129 83.6624 101.071 83.9462 100.959 84.2104C100.847 84.4747 100.683 84.7142 100.477 84.915C100.271 85.1157 100.026 85.2737 99.758 85.3796C99.4895 85.4855 99.2024 85.5373 98.9135 85.5318H94.3337C93.9059 85.5579 93.5051 85.7479 93.216 86.0617C92.9269 86.3756 92.7721 86.7887 92.7845 87.2136C92.7968 87.6386 92.9752 88.0421 93.2821 88.339C93.5889 88.6358 94.0001 88.8027 94.4287 88.8043H121.011C121.624 88.8043 122.212 89.0458 122.645 89.4756C123.078 89.9055 123.322 90.4886 123.322 91.0965C123.322 91.7045 123.078 92.2875 122.645 92.7174C122.212 93.1473 121.624 93.3888 121.011 93.3888H111.369C111.149 93.384 110.93 93.4229 110.726 93.5032C110.521 93.5834 110.335 93.7034 110.177 93.856C110.02 94.0087 109.895 94.1909 109.81 94.3921C109.724 94.5933 109.68 94.8094 109.68 95.0277C109.68 95.246 109.724 95.462 109.81 95.6632C109.895 95.8644 110.02 96.0467 110.177 96.1994C110.335 96.352 110.521 96.472 110.726 96.5522C110.93 96.6324 111.149 96.6713 111.369 96.6666H133.869C134.578 96.6666 135.258 96.9459 135.759 97.4431C136.261 97.9403 136.542 98.6146 136.542 99.3177C136.542 100.021 136.261 100.695 135.759 101.192C135.258 101.69 134.578 101.969 133.869 101.969H125.661C125.407 101.964 125.154 102.009 124.918 102.102C124.681 102.195 124.466 102.334 124.285 102.51C124.103 102.687 123.959 102.897 123.86 103.13C123.762 103.362 123.711 103.612 123.711 103.864C123.711 104.116 123.762 104.366 123.86 104.598C123.959 104.831 124.103 105.041 124.285 105.218C124.466 105.394 124.681 105.533 124.918 105.626C125.154 105.719 125.407 105.764 125.661 105.759H141.757V122.219H26.7568V105.759H40.3444ZM79.2375 88.7904H85.6527C86.0871 88.7904 86.5037 88.6192 86.8108 88.3145C87.118 88.0098 87.2906 87.5966 87.2906 87.1657C87.2906 86.7349 87.118 86.3216 86.8108 86.0169C86.5037 85.7123 86.0871 85.5411 85.6527 85.5411H79.2375C78.8031 85.5411 78.3865 85.7123 78.0793 86.0169C77.7722 86.3216 77.5996 86.7349 77.5996 87.1657C77.5996 87.5966 77.7722 88.0098 78.0793 88.3145C78.3865 88.6192 78.8031 88.7904 79.2375 88.7904ZM55.3505 105.778H62.8885C63.3924 105.768 63.8723 105.562 64.2251 105.205C64.5779 104.848 64.7755 104.368 64.7755 103.868C64.7755 103.368 64.5779 102.888 64.2251 102.531C63.8723 102.174 63.3924 101.968 62.8885 101.958H55.3481C54.8442 101.968 54.3643 102.174 54.0115 102.531C53.6587 102.888 53.4611 103.368 53.4611 103.868C53.4611 104.368 53.6587 104.848 54.0115 105.205C54.3643 105.562 54.8442 105.768 55.3481 105.778H55.3505Z" fill="#CFECFF"/>
<path d="M13.7871 31.1184C13.4906 31.1184 13.1941 31.0091 12.96 30.7748C12.5075 30.322 12.5075 29.5724 12.96 29.1195L17.7978 24.2939C18.2504 23.841 18.9995 23.841 19.452 24.2939C19.9046 24.7467 19.9046 25.4964 19.452 25.9492L14.6142 30.7748C14.3958 30.9935 14.0992 31.1184 13.7871 31.1184Z" fill="white"/>
<path d="M18.6249 31.1184C18.3284 31.1184 18.0319 31.0091 17.7978 30.7748L12.96 25.9492C12.5075 25.4964 12.5075 24.7467 12.96 24.2939C13.4126 23.841 14.1617 23.841 14.6142 24.2939L19.452 29.1195C19.9046 29.5724 19.9046 30.322 19.452 30.7748C19.2179 30.9935 18.9214 31.1184 18.6249 31.1184Z" fill="white"/>
<path d="M148.915 57.6403C148.619 57.6403 148.322 57.531 148.088 57.2967C147.635 56.8438 147.635 56.0942 148.088 55.6413L152.91 50.8001C153.363 50.3472 154.112 50.3472 154.564 50.8001C155.017 51.253 155.017 52.0026 154.564 52.4555L149.742 57.2967C149.508 57.531 149.212 57.6403 148.915 57.6403Z" fill="white"/>
<path d="M153.737 57.6403C153.441 57.6403 153.144 57.531 152.91 57.2967L148.088 52.4555C147.635 52.0026 147.635 51.253 148.088 50.8001C148.541 50.3472 149.29 50.3472 149.742 50.8001L154.564 55.6413C155.017 56.0942 155.017 56.8438 154.564 57.2967C154.33 57.531 154.034 57.6403 153.737 57.6403Z" fill="white"/>
<path d="M78.7541 26.3552H31.7808V28.6978H78.7541V26.3552Z" fill="white"/>
<path d="M29.3929 26.3552H24.5083V28.6978H29.3929V26.3552Z" fill="white"/>
<path d="M129.282 32.1223C129.282 33.1999 128.408 34.0744 127.332 34.0744C126.255 34.0744 125.381 33.1999 125.381 32.1223C125.381 31.0448 126.255 30.1702 127.332 30.1702C128.408 30.1702 129.282 31.0448 129.282 32.1223Z" fill="white"/>
<path d="M155.095 19.0511C155.095 20.6284 153.815 21.909 152.239 21.909C150.662 21.909 149.383 20.6284 149.383 19.0511C149.383 17.4738 150.662 16.1932 152.239 16.1932C153.815 16.1932 155.095 17.4738 155.095 19.0511Z" fill="white"/>
<path d="M74.8018 10.9521C74.8018 12.0297 73.9279 12.9042 72.8511 12.9042C71.7743 12.9042 70.9004 12.0297 70.9004 10.9521C70.9004 9.87454 71.7743 9 72.8511 9C73.9279 9 74.8018 9.87454 74.8018 10.9521Z" fill="white"/>
<path d="M186 124.027H0.0981445V121.888H183.824L186 124.027Z" fill="#1753FF"/>
<path d="M48.9241 20.4051H48.879C48.6729 19.7025 48.0288 19.1933 47.2623 19.1933C46.9273 19.1933 46.6182 19.29 46.3541 19.4576C46.1866 18.3554 45.2333 17.5045 44.0804 17.5045C43.0498 17.5045 42.1738 18.1878 41.8839 19.1224C41.7551 19.0902 41.6134 19.0644 41.4717 19.0644C40.6859 19.0644 40.0289 19.6445 39.9129 20.3986H39.6553C39.0047 20.3986 38.4766 20.9272 38.4766 21.5782V21.662C38.4766 22.313 39.0047 22.8416 39.6553 22.8416H48.9176C49.5682 22.8416 50.0964 22.313 50.0964 21.662V21.5911C50.1093 20.9401 49.5746 20.4051 48.9241 20.4051Z" fill="white"/>
<path d="M21.1858 56.1426H19.2638C18.5092 56.1426 17.8843 55.529 17.8843 54.7621V54.6677C17.8843 53.9125 18.4974 53.2871 19.2638 53.2871H19.5586C19.7001 52.4022 20.4547 51.7296 21.3744 51.7296C21.5395 51.7296 21.7046 51.7532 21.8579 51.7886C22.1998 50.6913 23.2138 49.9007 24.4165 49.9007C25.7607 49.9007 26.869 50.8918 27.0577 52.1662C27.3643 51.9656 27.7298 51.8594 28.1189 51.8594C29.015 51.8594 29.7578 52.4612 29.9937 53.2753H30.0526C30.8072 53.2753 31.4322 53.8889 31.4322 54.6559V54.7621C31.4322 55.5172 30.819 56.1426 30.0526 56.1426H27.9656H21.1858Z" fill="white"/>
<path d="M165.395 19.6052C165.395 19.4595 165.453 19.3198 165.556 19.2168C165.659 19.1138 165.799 19.056 165.945 19.056H159.995C160.14 19.056 160.28 19.1138 160.383 19.2168C160.486 19.3198 160.544 19.4595 160.544 19.6052C160.544 19.7509 160.486 19.8906 160.383 19.9936C160.28 20.0966 160.14 20.1544 159.995 20.1544H165.945C165.799 20.1544 165.659 20.0966 165.556 19.9936C165.453 19.8906 165.395 19.7509 165.395 19.6052Z" fill="#D2E9F7"/>
<path d="M166.925 17.0004H158.056C157.919 16.9966 157.782 17.0205 157.654 17.0704C157.526 17.1204 157.41 17.1955 157.311 17.2913C157.213 17.3871 157.134 17.5017 157.081 17.6283C157.028 17.7548 157 17.8908 157 18.0282C157 18.1656 157.028 18.3016 157.081 18.4281C157.134 18.5547 157.213 18.6693 157.311 18.7651C157.41 18.8609 157.526 18.936 157.654 18.986C157.782 19.0359 157.919 19.0597 158.056 19.056H166.925C167.193 19.0487 167.447 18.9372 167.634 18.7452C167.821 18.5533 167.925 18.296 167.925 18.0282C167.925 17.7603 167.821 17.5031 167.634 17.3111C167.447 17.1192 167.193 17.0077 166.925 17.0004Z" fill="#D2E9F7"/>
<path d="M168.104 20.1544H159.235C159.1 20.1544 158.966 20.181 158.842 20.2326C158.717 20.2843 158.604 20.3599 158.508 20.4553C158.413 20.5508 158.337 20.664 158.286 20.7887C158.234 20.9133 158.208 21.0469 158.208 21.1818C158.208 21.3168 158.234 21.4504 158.286 21.575C158.337 21.6997 158.413 21.8129 158.508 21.9083C158.604 22.0037 158.717 22.0794 158.842 22.1311C158.966 22.1827 159.1 22.2093 159.235 22.2093H168.104C168.239 22.2093 168.372 22.1827 168.497 22.1311C168.621 22.0794 168.735 22.0037 168.83 21.9083C168.926 21.8129 169.001 21.6997 169.053 21.575C169.104 21.4504 169.131 21.3168 169.131 21.1818C169.131 21.0469 169.104 20.9133 169.053 20.7887C169.001 20.664 168.926 20.5508 168.83 20.4553C168.735 20.3599 168.621 20.2843 168.497 20.2326C168.372 20.181 168.239 20.1544 168.104 20.1544Z" fill="#D2E9F7"/>
<path d="M49.6092 26.8138H50.8932C50.9951 26.8138 51.0928 26.8525 51.1648 26.9214C51.2369 26.9903 51.2773 27.0838 51.2773 27.1812C51.2773 27.2787 51.2369 27.3722 51.1648 27.4411C51.0928 27.51 50.9951 27.5487 50.8932 27.5487H50.3611C50.1996 27.5487 50.0446 27.6101 49.9303 27.7194C49.8161 27.8287 49.7519 27.9769 49.7519 28.1315C49.7519 28.2861 49.8161 28.4343 49.9303 28.5436C50.0446 28.6529 50.1996 28.7143 50.3611 28.7143H58.9979C59.1595 28.7143 59.3144 28.6529 59.4287 28.5436C59.543 28.4343 59.6071 28.2861 59.6071 28.1315C59.6071 27.9769 59.543 27.8287 59.4287 27.7194C59.3144 27.6101 59.1595 27.5487 58.9979 27.5487H58.1665C58.0647 27.5487 57.967 27.51 57.8949 27.4411C57.8229 27.3722 57.7824 27.2787 57.7824 27.1812C57.7824 27.0838 57.8229 26.9903 57.8949 26.9214C57.967 26.8525 58.0647 26.8138 58.1665 26.8138H58.2467C58.4082 26.8138 58.5632 26.7524 58.6775 26.6431C58.7917 26.5338 58.8559 26.3856 58.8559 26.231C58.8559 26.0764 58.7917 25.9282 58.6775 25.8189C58.5632 25.7096 58.4082 25.6482 58.2467 25.6482H53.8636C53.7636 25.6454 53.6688 25.6054 53.5991 25.5368C53.5294 25.4682 53.4905 25.3763 53.4905 25.2806C53.4905 25.1849 53.5294 25.0931 53.5991 25.0244C53.6688 24.9558 53.7636 24.9158 53.8636 24.913H54.4329C54.5595 24.913 54.6809 24.8649 54.7704 24.7793C54.8599 24.6937 54.9102 24.5776 54.9102 24.4565C54.9102 24.3354 54.8599 24.2193 54.7704 24.1337C54.6809 24.0481 54.5595 24 54.4329 24H50.2936C50.1671 24 50.0457 24.0481 49.9562 24.1337C49.8667 24.2193 49.8164 24.3354 49.8164 24.4565C49.8164 24.5776 49.8667 24.6937 49.9562 24.7793C50.0457 24.8649 50.1671 24.913 50.2936 24.913H50.6594C50.7594 24.9158 50.8543 24.9558 50.9239 25.0244C50.9936 25.0931 51.0326 25.1849 51.0326 25.2806C51.0326 25.3763 50.9936 25.4682 50.9239 25.5368C50.8543 25.6054 50.7594 25.6454 50.6594 25.6482H49.6092C49.4477 25.6482 49.2927 25.7096 49.1784 25.8189C49.0642 25.9282 49 26.0764 49 26.231C49 26.3856 49.0642 26.5338 49.1784 26.6431C49.2927 26.7524 49.4477 26.8138 49.6092 26.8138Z" fill="#D2E9F7"/>
<path d="M27.9078 25.0652H27.8507C27.5915 24.1734 26.7722 23.5252 25.8025 23.5252C25.3773 23.5252 24.9833 23.6497 24.6514 23.8623C24.4336 22.4622 23.2254 21.3889 21.7684 21.3889C20.4565 21.3889 19.3468 22.2548 18.9787 23.4422C18.8127 23.3956 18.6364 23.3696 18.4549 23.3696C17.4542 23.3696 16.6245 24.106 16.4742 25.0601H16.1475C15.323 25.0601 14.6489 25.7341 14.6489 26.5586V26.6675C14.6489 27.492 15.323 28.1661 16.1475 28.1661H27.913C28.7374 28.1661 29.4115 27.492 29.4115 26.6675V26.5638C29.4063 25.7393 28.7322 25.0652 27.9078 25.0652Z" fill="#D2E9F7"/>
<path d="M18.2422 28.1764H16.1421C15.3176 28.1764 14.6436 27.5023 14.6436 26.6779V26.5638C14.6436 25.7393 15.3176 25.0652 16.1421 25.0652H16.4688C16.6192 24.106 17.4488 23.3748 18.4496 23.3748C18.6311 23.3748 18.8022 23.4008 18.9733 23.4474C19.3415 22.2548 20.4511 21.394 21.763 21.394C23.2253 21.394 24.4334 22.4674 24.646 23.8674C24.9779 23.6548 25.372 23.5304 25.7972 23.5304C26.772 23.5304 27.5913 24.1786 27.8454 25.0704H27.9024C28.7269 25.0704 29.401 25.7445 29.401 26.569V26.6779C29.401 27.5023 28.7269 28.1764 27.9024 28.1764H25.6312H18.2422Z" fill="#D2E9F7"/>
<path d="M27.9076 28.5654H16.137C15.0947 28.5654 14.2495 27.7202 14.2495 26.6779V26.5638C14.2495 25.5216 15.0947 24.6764 16.137 24.6764H16.1577C16.4844 23.5927 17.5422 22.8615 18.7193 23.0015C19.2378 21.7934 20.42 21 21.763 21C23.2305 21 24.4853 21.9385 24.9157 23.2971C25.1957 23.1934 25.4965 23.1364 25.8024 23.1364C26.8239 23.1364 27.7417 23.7638 28.1306 24.6919C29.0691 24.8008 29.8003 25.5994 29.8003 26.569V26.6779C29.7951 27.7202 28.9447 28.5654 27.9076 28.5654ZM16.137 25.4542C15.5251 25.4542 15.0273 25.952 15.0273 26.5638V26.6727C15.0273 27.2846 15.5251 27.7824 16.137 27.7824H27.9024C28.5143 27.7824 29.0121 27.2846 29.0121 26.6727V26.5638C29.0121 25.952 28.5143 25.4542 27.9024 25.4542H27.5499L27.4669 25.1742C27.2491 24.4327 26.5595 23.9141 25.792 23.9141C25.4602 23.9141 25.1335 24.0075 24.8483 24.189L24.3453 24.5105L24.252 23.9193C24.0601 22.6749 23.0075 21.7726 21.7527 21.7726C20.6378 21.7726 19.663 22.4882 19.3311 23.5564L19.2222 23.9141L18.8593 23.8156C17.874 23.5512 16.9874 24.1993 16.8422 25.1223L16.7903 25.449H16.137V25.4542Z" fill="#1753FF"/>
<path d="M113.813 11.5999L113.887 11.8508H114.149H114.225C115.106 11.8508 115.831 12.5782 115.824 13.4562V13.4593V13.6019C115.824 14.4829 115.096 15.2104 114.215 15.2104H98.8135C97.9324 15.2104 97.205 14.4829 97.205 13.6019V13.4593C97.205 12.5783 97.9324 11.8508 98.8135 11.8508H99.2413H99.54L99.5869 11.5558C99.7601 10.4674 100.7 9.63562 101.837 9.63562C102.037 9.63562 102.235 9.66766 102.433 9.71936L102.756 9.80371L102.855 9.48463C103.296 8.06687 104.61 7.04016 106.172 7.04016C107.906 7.04016 109.341 8.31728 109.601 9.98587L109.684 10.5212L110.138 10.2253C110.519 9.97671 110.975 9.83527 111.458 9.83527C112.571 9.83527 113.513 10.5834 113.813 11.5999Z" fill="#D2E9F7" stroke="#1753FF" stroke-width="0.7"/>
<path d="M171.153 82.5798H166.855C166.443 82.5798 166.101 82.2378 166.101 81.8255C166.101 81.4132 166.443 81.0713 166.855 81.0713H171.153C171.565 81.0713 171.907 81.4132 171.907 81.8255C171.907 82.2479 171.575 82.5798 171.153 82.5798Z" fill="#1753FF"/>
<path d="M169.01 84.7319C168.597 84.7319 168.255 84.3899 168.255 83.9776V79.6834C168.255 79.271 168.597 78.9291 169.01 78.9291C169.422 78.9291 169.764 79.271 169.764 79.6834V83.9776C169.764 84.4 169.422 84.7319 169.01 84.7319Z" fill="#1753FF"/>
<path d="M40.0521 12.6507H35.7548C35.3422 12.6507 35 12.3088 35 11.8964C35 11.4841 35.3422 11.1422 35.7548 11.1422H40.0521C40.4647 11.1422 40.8069 11.4841 40.8069 11.8964C40.8069 12.3188 40.4748 12.6507 40.0521 12.6507Z" fill="#1753FF"/>
<path d="M37.9091 14.8028C37.4965 14.8028 37.1543 14.4609 37.1543 14.0485V9.75429C37.1543 9.34196 37.4965 9.00003 37.9091 9.00003C38.3217 9.00003 38.6639 9.34196 38.6639 9.75429V14.0485C38.6639 14.4709 38.3217 14.8028 37.9091 14.8028Z" fill="#1753FF"/>
<path d="M174.91 40.6833C174.719 40.6833 174.528 40.6129 174.377 40.462C174.085 40.1704 174.085 39.6877 174.377 39.396L177.416 36.3589C177.708 36.0672 178.191 36.0672 178.483 36.3589C178.775 36.6505 178.775 37.1332 178.483 37.4249L175.443 40.462C175.292 40.6129 175.101 40.6833 174.91 40.6833Z" fill="#1753FF"/>
<path d="M177.949 40.6833C177.758 40.6833 177.567 40.6129 177.416 40.462L174.377 37.4249C174.085 37.1332 174.085 36.6505 174.377 36.3589C174.668 36.0672 175.152 36.0672 175.443 36.3589L178.483 39.396C178.775 39.6877 178.775 40.1704 178.483 40.462C178.332 40.6129 178.141 40.6833 177.949 40.6833Z" fill="#1753FF"/>
<path d="M37.8733 78.527H61.3833V81.461H37.8733V78.527Z" fill="#9ECFEF"/>
<path d="M37.3324 82.0022H61.9185V78H37.3395V82.0022H37.3324ZM60.8495 80.934H38.4084V79.0682H60.8495V80.934Z" fill="#1753FF"/>
<path d="M35.3721 80.6849H63.6426V121.134H35.3721V80.6849Z" fill="white"/>
<path d="M63.1078 121.134H64.1768V80.1507H36.4408V81.2189H63.1078V121.134Z" fill="#1753FF"/>
<path d="M39.0429 84.3239H59.9731V121.134H39.0429V84.3239Z" fill="#84ACF9"/>
<path d="M38.5081 121.668H60.5073V83.7898H38.5081V121.668ZM59.4384 120.6H39.5771V84.858H59.4384V120.6Z" fill="#1753FF"/>
<path d="M42.4342 87.4358H56.5801V121.134H42.4342V87.4358Z" fill="white"/>
<path d="M43.6774 90.5611H55.3613V91.7611H43.6774V90.5611Z" fill="#1753FF"/>
<path d="M43.6774 94.2611H55.3613V95.4611H43.6774V94.2611Z" fill="#1753FF"/>
<path d="M43.6774 97.9611H55.3613V99.1611H43.6774V97.9611Z" fill="#1753FF"/>
<path d="M43.6774 101.661H55.3613V102.861H43.6774V101.661Z" fill="#1753FF"/>
<path d="M43.6774 105.361H55.3613V106.561H43.6774V105.361Z" fill="#1753FF"/>
<path d="M43.6774 109.061H55.3613V110.261H43.6774V109.061Z" fill="#1753FF"/>
<path d="M43.6774 112.761H55.3613V113.961H43.6774V112.761Z" fill="#1753FF"/>
<path d="M43.6774 116.461H55.3613V117.661H43.6774V116.461Z" fill="#1753FF"/>
<path d="M41.8999 121.668H57.1147V86.9018H41.8999V121.668ZM56.0458 120.6H42.9688V87.97H56.0458V120.6Z" fill="#1753FF"/>
<path d="M63.7523 10.5432C63.5611 10.5432 63.3698 10.4728 63.2189 10.3219C62.927 10.0303 62.927 9.54754 63.2189 9.25589L66.2582 6.21874C66.55 5.92709 67.0331 5.92709 67.325 6.21874C67.6168 6.51038 67.6168 6.99311 67.325 7.28476L64.2857 10.3219C64.1448 10.4728 63.9435 10.5432 63.7523 10.5432Z" fill="#1753FF"/>
<path d="M66.7916 10.5432C66.6004 10.5432 66.4091 10.4728 66.2582 10.3219L63.2189 7.28476C62.927 6.99311 62.927 6.51038 63.2189 6.21874C63.5107 5.92709 63.9938 5.92709 64.2857 6.21874L67.325 9.25589C67.6168 9.54754 67.6168 10.0303 67.325 10.3219C67.1841 10.4728 66.9929 10.5432 66.7916 10.5432Z" fill="#1753FF"/>
<path d="M73.4556 87.2269C73.4556 87.9108 72.9021 88.4539 72.2278 88.4539C71.5434 88.4539 71 87.9007 71 87.2269C71 86.5431 71.5535 86 72.2278 86C72.9021 86 73.4556 86.5531 73.4556 87.2269Z" fill="#1753FF"/>
<path d="M8.56615 62.0875C8.56615 62.9725 7.84155 63.6966 6.95593 63.6966C6.0703 63.6966 5.3457 62.9725 5.3457 62.0875C5.3457 61.2025 6.0703 60.4784 6.95593 60.4784C7.85161 60.4784 8.56615 61.2025 8.56615 62.0875Z" fill="#1753FF"/>
<path d="M8.64281 6.14156C8.64281 7.02656 7.91821 7.75065 7.03259 7.75065C6.14696 7.75065 5.42236 7.02656 5.42236 6.14156C5.42236 5.25656 6.14696 4.53247 7.03259 4.53247C7.91821 4.53247 8.64281 5.25656 8.64281 6.14156Z" fill="#1753FF"/>
<path d="M171.472 37.6562H155.646V39.1647H171.472V37.6562Z" fill="#1753FF"/>
<path d="M168.286 57.9608C168.286 58.4134 167.914 58.7855 167.461 58.7855C167.008 58.7855 166.636 58.4134 166.636 57.9608C166.636 57.5083 167.008 57.1362 167.461 57.1362C167.914 57.1362 168.286 57.5083 168.286 57.9608Z" fill="#1753FF"/>
<path d="M0.686035 121.062H17.9953V73.3241H2.73533C1.60089 73.3241 0.686035 74.2398 0.686035 75.3753V121.062Z" fill="#D2E9F7"/>
<path d="M1.37231 114.469H0V121.062H1.37231V114.469Z" fill="#1753FF"/>
<path d="M1.37231 102.106H0V108.297H1.37231V102.106Z" fill="#1753FF"/>
<path d="M1.3723 97.6373H0V76.1997C0 74.2308 1.60102 72.6374 3.55884 72.6374H9.3408V74.011H3.55884C2.35121 74.011 1.3723 74.9909 1.3723 76.1997V97.6373Z" fill="#1753FF"/>
<path d="M34.7649 58.727H18.6357V68.6171H34.7649V58.727Z" fill="white"/>
<path d="M35.4521 69.304H17.9507V58.0403H35.4521V69.304ZM19.323 67.9303H34.0798V59.4139H19.323V67.9303Z" fill="#1753FF"/>
<path d="M39.6414 121.062H14.0342V65.6043C14.0342 64.8992 14.6014 64.3315 15.3058 64.3315H38.3697C39.0741 64.3315 39.6414 64.8992 39.6414 65.6043V121.062Z" fill="white"/>
<path d="M40.3281 121.062H38.9558V66.1538C38.9558 65.5219 38.4434 65.0182 37.8213 65.0182H15.8554C15.2241 65.0182 14.7209 65.5311 14.7209 66.1538V121.062H13.3486V66.1538C13.3486 64.771 14.4739 63.6446 15.8554 63.6446H37.8213C39.2028 63.6446 40.3281 64.771 40.3281 66.1538V121.062Z" fill="#1753FF"/>
<path d="M27.5271 50H26.1548V58.0861H27.5271V50Z" fill="#1753FF"/>
<path d="M20.7029 70.934H19.3306V117.802H20.7029V70.934Z" fill="#1753FF"/>
<path d="M27.5271 70.934H26.1548V117.802H27.5271V70.934Z" fill="#1753FF"/>
<path d="M34.3532 70.934H32.981V117.802H34.3532V70.934Z" fill="#1753FF"/>
<path d="M10.512 80.6776H5.01367V82.0512H10.512V80.6776Z" fill="#1753FF"/>
<path d="M10.512 85.3936H5.01367V86.7673H10.512V85.3936Z" fill="#1753FF"/>
<path d="M10.512 90.1007H5.01367V91.4743H10.512V90.1007Z" fill="#1753FF"/>
<path d="M10.512 94.8075H5.01367V96.1811H10.512V94.8075Z" fill="#1753FF"/>
<path d="M10.512 99.5236H5.01367V100.897H10.512V99.5236Z" fill="#1753FF"/>
<path d="M10.512 104.231H5.01367V105.604H10.512V104.231Z" fill="#1753FF"/>
<path d="M10.512 108.938H5.01367V110.311H10.512V108.938Z" fill="#1753FF"/>
<path d="M10.512 113.654H5.01367V115.027H10.512V113.654Z" fill="#1753FF"/>
<path d="M108.857 107.397C108.723 107.003 108.286 106.692 107.875 106.692H101.664V116.47C103.485 116.47 104.971 117.948 104.971 119.777H110.821V113.239L108.857 107.397Z" fill="white"/>
<path d="M103.872 112.509H109.252C109.462 112.509 109.781 112.559 109.982 112.618L110.855 112.895L108.858 107.397C108.858 107.397 108.648 106.407 106.961 106.692H103.125V111.762C103.133 112.181 103.461 112.509 103.872 112.509Z" fill="#F99A4E"/>
<path d="M90.1656 120.289C90.1656 121.565 89.1333 122.598 87.8575 122.598C86.5817 122.598 85.5493 121.565 85.5493 120.289C85.5493 119.014 86.5817 117.981 87.8575 117.981C89.1249 117.981 90.1656 119.014 90.1656 120.289Z" fill="white"/>
<path d="M87.8581 123.235C86.2382 123.235 84.9204 121.918 84.9204 120.298C84.9204 118.678 86.2382 117.36 87.8581 117.36C89.478 117.36 90.7957 118.678 90.7957 120.298C90.7957 121.918 89.478 123.235 87.8581 123.235ZM87.8581 118.611C86.9348 118.611 86.1794 119.366 86.1794 120.289C86.1794 121.213 86.9348 121.968 87.8581 121.968C88.7813 121.968 89.5367 121.213 89.5367 120.289C89.5367 119.366 88.7813 118.611 87.8581 118.611Z" fill="#1753FF"/>
<path d="M88.7633 120.289C88.7633 120.793 88.3521 121.204 87.8485 121.204C87.3449 121.204 86.9336 120.793 86.9336 120.289C86.9336 119.786 87.3449 119.375 87.8485 119.375C88.3604 119.383 88.7633 119.786 88.7633 120.289Z" fill="#F99A4E"/>
<path d="M103.503 120.289C103.503 121.565 102.471 122.598 101.195 122.598C99.9191 122.598 98.8867 121.565 98.8867 120.289C98.8867 119.014 99.9191 117.981 101.195 117.981C102.471 117.981 103.503 119.014 103.503 120.289Z" fill="white"/>
<path d="M101.195 123.235C99.5746 123.235 98.2568 121.918 98.2568 120.298C98.2568 118.678 99.5746 117.36 101.195 117.36C102.814 117.36 104.132 118.678 104.132 120.298C104.132 121.918 102.814 123.235 101.195 123.235ZM101.195 118.611C100.271 118.611 99.5158 119.366 99.5158 120.289C99.5158 121.213 100.271 121.968 101.195 121.968C102.118 121.968 102.873 121.213 102.873 120.289C102.873 119.366 102.118 118.611 101.195 118.611Z" fill="#1753FF"/>
<path d="M102.101 120.289C102.101 120.793 101.689 121.204 101.186 121.204C100.682 121.204 100.271 120.793 100.271 120.289C100.271 119.786 100.682 119.375 101.186 119.375C101.698 119.383 102.101 119.786 102.101 120.289Z" fill="#F99A4E"/>
<path d="M84.0553 120.289C84.0553 121.565 83.0229 122.598 81.7471 122.598C80.4713 122.598 79.439 121.565 79.439 120.289C79.439 119.014 80.4713 117.981 81.7471 117.981C83.0145 117.981 84.0553 119.014 84.0553 120.289Z" fill="white"/>
<path d="M81.7384 123.235C80.1185 123.235 78.8008 121.918 78.8008 120.298C78.8008 118.678 80.1185 117.36 81.7384 117.36C83.3583 117.36 84.6761 118.678 84.6761 120.298C84.6845 121.918 83.3667 123.235 81.7384 123.235ZM81.7384 118.611C80.8152 118.611 80.0598 119.366 80.0598 120.289C80.0598 121.213 80.8152 121.968 81.7384 121.968C82.6617 121.968 83.4171 121.213 83.4171 120.289C83.4171 119.366 82.6701 118.611 81.7384 118.611Z" fill="#1753FF"/>
<path d="M82.6535 120.289C82.6535 120.793 82.2422 121.204 81.7386 121.204C81.235 121.204 80.8237 120.793 80.8237 120.289C80.8237 119.786 81.235 119.375 81.7386 119.375C82.2506 119.383 82.6535 119.786 82.6535 120.289Z" fill="#F99A4E"/>
<path d="M99.6839 117.755H91.4585V119.014H99.6839V117.755Z" fill="#1753FF"/>
<path d="M92.1298 119.996H90.8708V119.4C90.8708 118.191 89.8888 117.209 88.6802 117.209H80.9248C79.7161 117.209 78.7341 118.191 78.7341 119.4H77.4751C77.4751 117.494 79.0195 115.95 80.9248 115.95H88.6802C90.5855 115.95 92.1298 117.494 92.1298 119.4V119.996Z" fill="#1753FF"/>
<path d="M98.8202 115.253H78.2482C77.753 115.253 77.3501 114.851 77.3501 114.355V101.337C77.3501 100.842 77.753 100.439 78.2482 100.439H98.8202C99.3154 100.439 99.7183 100.842 99.7183 101.337V114.355C99.7183 114.851 99.3154 115.253 98.8202 115.253Z" fill="#F99A4E"/>
<path d="M98.8193 115.883H78.2473C77.408 115.883 76.7197 115.195 76.7197 114.355V107.07H77.9787V114.355C77.9787 114.506 78.0962 114.624 78.2473 114.624H98.8193C98.9704 114.624 99.0879 114.506 99.0879 114.355V101.337C99.0879 101.186 98.9704 101.069 98.8193 101.069H92.944V99.8013H98.8193C99.6587 99.8013 100.347 100.49 100.347 101.329V114.347C100.347 115.195 99.6587 115.883 98.8193 115.883Z" fill="#1753FF"/>
<path d="M97.5515 104.099H79.5059V110.897H97.5515V104.099Z" fill="white"/>
<path d="M102.801 101.719L101.988 102.681L107.207 107.09L108.019 106.129L102.801 101.719Z" fill="#1753FF"/>
<path d="M104.736 103.763H103.477V106.155H104.736V103.763Z" fill="#1753FF"/>
<path d="M111.452 120.407H104.343V119.777C104.343 118.3 103.142 117.1 101.673 117.1H101.044V106.063H107.884C108.564 106.063 109.244 106.55 109.462 107.196L111.46 113.231V120.407H111.452ZM105.551 119.148H110.193V113.34L108.262 107.607C108.22 107.473 108.019 107.33 107.876 107.33H102.295V115.9C103.965 116.16 105.283 117.478 105.551 119.148Z" fill="#1753FF"/>
<path d="M111.442 119.719C111.442 119.87 111.316 119.996 111.165 119.996H108.547C108.395 119.996 108.27 119.87 108.27 119.719V118.225C108.27 118.074 108.395 117.948 108.547 117.948H111.165C111.316 117.948 111.442 118.074 111.442 118.225V119.719Z" fill="#9ECFEF"/>
<path d="M111.166 120.625H108.548C108.044 120.625 107.641 120.222 107.641 119.719V118.225C107.641 117.721 108.052 117.318 108.548 117.318H111.166C111.661 117.318 112.073 117.721 112.073 118.225V119.719C112.073 120.222 111.67 120.625 111.166 120.625ZM108.9 119.366H110.814V118.577H108.9V119.366Z" fill="#1753FF"/>
<path d="M96.251 105.526H90.2666V106.785H96.251V105.526Z" fill="#1753FF"/>
<path d="M96.2513 108.119H80.8076V109.378H96.2513V108.119Z" fill="#1753FF"/>
<path d="M83.2076 107.07C87.9312 107.07 91.7604 103.241 91.7604 98.5172C91.7604 93.7936 87.9312 89.9644 83.2076 89.9644C78.484 89.9644 74.6548 93.7936 74.6548 98.5172C74.6548 103.241 78.484 107.07 83.2076 107.07Z" fill="white"/>
<path d="M83.2082 107.699C78.147 107.699 74.0259 103.578 74.0259 98.5171C74.0259 93.456 78.147 89.3348 83.2082 89.3348C84.0643 89.3348 84.9036 89.4523 85.7094 89.679L85.3652 90.8876C84.6686 90.6862 83.9384 90.5938 83.2082 90.5938C78.8352 90.5938 75.2849 94.1526 75.2849 98.5171C75.2849 102.89 78.8436 106.44 83.2082 106.44C87.5811 106.44 91.1315 102.882 91.1315 98.5171C91.1315 96.36 90.2837 94.354 88.7394 92.8432L89.6207 91.9452C91.4084 93.691 92.3905 96.0243 92.3905 98.5171C92.3905 103.578 88.2693 107.699 83.2082 107.699Z" fill="#1753FF"/>
<path d="M88.0509 92.2474C87.4886 91.8109 86.8759 91.4584 86.2212 91.1898L86.6996 90.0232C87.455 90.3337 88.1684 90.745 88.8147 91.2486L88.0509 92.2474Z" fill="#1753FF"/>
<path d="M87.6732 98.5171C87.6732 100.985 85.6756 102.982 83.2079 102.982C80.7403 102.982 78.7427 100.985 78.7427 98.5171C78.7427 96.0495 80.7403 94.0519 83.2079 94.0519C85.6756 94.0519 87.6732 96.0495 87.6732 98.5171Z" fill="#9ECFEF"/>
<path d="M83.2079 99.5663C82.6287 99.5663 82.1587 99.0963 82.1587 98.5172C82.1587 97.938 82.6287 97.468 83.2079 97.468C83.787 97.468 84.257 97.938 84.257 98.5172C84.257 99.0963 83.787 99.5663 83.2079 99.5663ZM83.2079 98.3073C83.0904 98.3073 82.998 98.3996 82.998 98.5172C82.998 98.7522 83.4177 98.7522 83.4177 98.5172C83.4177 98.3996 83.3254 98.3073 83.2079 98.3073Z" fill="#1753FF"/>
<path d="M83.8371 90.6946H82.5781V92.1802H83.8371V90.6946Z" fill="#1753FF"/>
<path d="M86.5758 91.436L85.8315 92.7216L86.9211 93.3524L87.6654 92.0668L86.5758 91.436Z" fill="#1753FF"/>
<path d="M89.6795 94.0809L88.3916 94.8214L89.0193 95.9128L90.3072 95.1723L89.6795 94.0809Z" fill="#1753FF"/>
<path d="M89.5451 97.9074L89.541 99.1664L91.0266 99.1713L91.0308 97.9123L89.5451 97.9074Z" fill="#1753FF"/>
<path d="M89.0053 101.16L88.3711 102.248L89.6545 102.996L90.2887 101.909L89.0053 101.16Z" fill="#1753FF"/>
<path d="M86.9028 103.713L85.8086 104.336L86.5435 105.627L87.6377 105.004L86.9028 103.713Z" fill="#1753FF"/>
<path d="M82.5447 104.849L82.5312 106.335L83.7902 106.346L83.8037 104.861L82.5447 104.849Z" fill="#1753FF"/>
<path d="M79.46 103.663L78.7036 104.942L79.7873 105.583L80.5436 104.304L79.46 103.663Z" fill="#1753FF"/>
<path d="M77.3911 101.096L76.0947 101.822L76.7096 102.921L78.006 102.195L77.3911 101.096Z" fill="#1753FF"/>
<path d="M75.4029 97.8113L75.3911 99.0703L76.8767 99.0842L76.8885 97.8252L75.4029 97.8113Z" fill="#1753FF"/>
<path d="M76.7966 93.995L76.1558 95.0787L77.4346 95.8349L78.0754 94.7512L76.7966 93.995Z" fill="#1753FF"/>
<path d="M79.922 91.382L78.8247 91.9991L79.5529 93.294L80.6502 92.6768L79.922 91.382Z" fill="#1753FF"/>
<path d="M82.5781 98.5424L82.8383 93.2798H83.5769L83.8371 98.5424H82.5781Z" fill="#1753FF"/>
<path d="M83.1914 97.9128L87.8329 98.0555L87.8497 98.7941L83.225 99.1718L83.1914 97.9128Z" fill="#1753FF"/>
<path d="M130.531 69.1017H149.674V122.427H130.531V69.1017Z" fill="#C5E2F5"/>
<path d="M130.531 69.1017H149.674V79.5402H130.531V69.1017Z" fill="white"/>
<path d="M130 122.958H149.674V121.896H131.062V69.6324H148.047V68.5709H130V122.958Z" fill="#1753FF"/>
<path d="M130.531 79.0095H148.046V80.071H130.531V79.0095Z" fill="#1753FF"/>
<path d="M132.378 82.2579H148.046V83.3195H132.378V82.2579Z" fill="#1753FF"/>
<path d="M132.378 85.2656H148.046V86.3271H132.378V85.2656Z" fill="#1753FF"/>
<path d="M132.378 88.2733H148.046V89.3348H132.378V88.2733Z" fill="#1753FF"/>
<path d="M132.378 91.281H148.046V92.3425H132.378V91.281Z" fill="#1753FF"/>
<path d="M132.378 94.2888H148.046V95.3503H132.378V94.2888Z" fill="#1753FF"/>
<path d="M132.378 97.2965H148.046V98.358H132.378V97.2965Z" fill="#1753FF"/>
<path d="M132.378 100.304H148.046V101.366H132.378V100.304Z" fill="#1753FF"/>
<path d="M132.378 103.312H148.046V104.374H132.378V103.312Z" fill="#1753FF"/>
<path d="M132.378 106.32H148.046V107.381H132.378V106.32Z" fill="#1753FF"/>
<path d="M132.378 109.327H148.046V110.389H132.378V109.327Z" fill="#1753FF"/>
<path d="M132.378 112.335H148.046V113.397H132.378V112.335Z" fill="#1753FF"/>
<path d="M132.378 115.343H148.046V116.404H132.378V115.343Z" fill="#1753FF"/>
<path d="M132.378 118.351H148.046V119.412H132.378V118.351Z" fill="#1753FF"/>
<path d="M146.575 70.5525H147.636V77.8559H146.575V70.5525Z" fill="#1753FF"/>
<path d="M144.473 70.5525H145.534V77.8559H144.473V70.5525Z" fill="#1753FF"/>
<path d="M142.378 70.5525H143.439V77.8559H142.378V70.5525Z" fill="#1753FF"/>
<path d="M140.283 70.5525H141.345V77.8559H140.283V70.5525Z" fill="#1753FF"/>
<path d="M138.181 70.5525H139.243V77.8559H138.181V70.5525Z" fill="#1753FF"/>
<path d="M136.086 70.5525H137.148V77.8559H136.086V70.5525Z" fill="#1753FF"/>
<path d="M133.992 70.5525H135.053V77.8559H133.992V70.5525Z" fill="#1753FF"/>
<path d="M131.89 70.5525H132.951V77.8559H131.89V70.5525Z" fill="#1753FF"/>
<path d="M175.464 83.1075H143.752V121.847H175.464V83.1075Z" fill="white"/>
<path d="M176.019 121.847H174.909V83.6711H144.307V106.907H143.196V82.5439H176.019V121.847Z" fill="#1753FF"/>
<path d="M163.366 110.341H155.851V121.621H163.366V110.341Z" fill="#FFD43B"/>
<path d="M163.921 122.185H155.295V109.778H163.921V122.185ZM156.406 121.058H162.81V110.905H156.406V121.058Z" fill="#1753FF"/>
<path d="M160.167 111.153H159.057V120.817H160.167V111.153Z" fill="#1753FF"/>
<path d="M150.816 88.5558H147.129V92.2983H150.816V88.5558Z" fill="#FFD43B"/>
<path d="M157.776 88.5558H154.088V92.2982H157.776V88.5558Z" fill="#FFD43B"/>
<path d="M164.736 88.5558H161.048V92.2983H164.736V88.5558Z" fill="#FFD43B"/>
<path d="M171.696 88.5558H168.008V92.2983H171.696V88.5558Z" fill="#FFD43B"/>
<path d="M150.816 95.0261H147.129V98.7685H150.816V95.0261Z" fill="#FFD43B"/>
<path d="M157.776 95.0261H154.088V98.7685H157.776V95.0261Z" fill="#FFD43B"/>
<path d="M164.736 95.0261H161.048V98.7685H164.736V95.0261Z" fill="#FFD43B"/>
<path d="M171.696 95.0261H168.008V98.7685H171.696V95.0261Z" fill="#FFD43B"/>
<path d="M150.816 101.496H147.129V105.239H150.816V101.496Z" fill="#FFD43B"/>
<path d="M157.776 101.496H154.088V105.239H157.776V101.496Z" fill="#FFD43B"/>
<path d="M164.736 101.496H161.048V105.239H164.736V101.496Z" fill="#FFD43B"/>
<path d="M171.696 101.496H168.008V105.239H171.696V101.496Z" fill="#FFD43B"/>
<path d="M151.371 92.8619H146.573V87.9922H151.371V92.8619ZM147.684 91.7346H150.261V89.1194H147.684V91.7346Z" fill="#1753FF"/>
<path d="M158.331 92.8619H153.533V87.9922H158.331V92.8619ZM154.643 91.7346H157.22V89.1194H154.643V91.7346Z" fill="#1753FF"/>
<path d="M165.292 92.8619H160.494V87.9922H165.292V92.8619ZM161.604 91.7346H164.181V89.1194H161.604V91.7346Z" fill="#1753FF"/>
<path d="M172.251 92.8619H167.453V87.9922H172.251V92.8619ZM168.564 91.7346H171.14V89.1194H168.564V91.7346Z" fill="#1753FF"/>
<path d="M151.371 99.3321H146.573V94.4625H151.371V99.3321ZM147.684 98.2049H150.261V95.5897H147.684V98.2049Z" fill="#1753FF"/>
<path d="M158.331 99.3321H153.533V94.4625H158.331V99.3321ZM154.643 98.2049H157.22V95.5897H154.643V98.2049Z" fill="#1753FF"/>
<path d="M165.292 99.3321H160.494V94.4625H165.292V99.3321ZM161.604 98.2049H164.181V95.5897H161.604V98.2049Z" fill="#1753FF"/>
<path d="M172.251 99.3321H167.453V94.4625H172.251V99.3321ZM168.564 98.2049H171.14V95.5897H168.564V98.2049Z" fill="#1753FF"/>
<path d="M151.371 105.802H146.573V100.933H151.371V105.802ZM147.684 104.675H150.261V102.06H147.684V104.675Z" fill="#1753FF"/>
<path d="M150.816 110.311H147.129V118.623H150.816V110.311Z" fill="#FFD43B"/>
<path d="M171.696 110.311H168.008V118.623H171.696V110.311Z" fill="#FFD43B"/>
<path d="M151.371 119.186H146.573V109.748H151.371V119.186ZM147.684 118.059H150.261V110.875H147.684V118.059Z" fill="#1753FF"/>
<path d="M172.251 119.186H167.453V109.748H172.251V119.186ZM168.564 118.059H171.14V110.875H168.564V118.059Z" fill="#1753FF"/>
<path d="M158.331 105.802H153.533V100.933H158.331V105.802ZM154.643 104.675H157.22V102.06H154.643V104.675Z" fill="#1753FF"/>
<path d="M165.292 105.802H160.494V100.933H165.292V105.802ZM161.604 104.675H164.181V102.06H161.604V104.675Z" fill="#1753FF"/>
<path d="M172.251 105.802H167.453V100.933H172.251V105.802ZM168.564 104.675H171.14V102.06H168.564V104.675Z" fill="#1753FF"/>
<path d="M176.753 79.7484H142.471V84.3701H176.753V79.7484Z" fill="#C5E2F5"/>
<path d="M176.383 84.9337H142.842C142.331 84.9337 141.916 84.5129 141.916 83.9943V80.1242C141.916 79.6056 142.331 79.1848 142.842 79.1848H176.383C176.894 79.1848 177.308 79.6056 177.308 80.1242V83.9943C177.308 84.5129 176.894 84.9337 176.383 84.9337ZM143.027 83.8065H176.198V80.312H143.027V83.8065Z" fill="#1753FF"/>
<path d="M184.424 113.31C184.424 114.88 183.172 116.15 181.625 116.15C180.077 116.15 178.826 114.88 178.826 113.31C178.826 111.739 180.077 110.469 181.625 110.469C183.172 110.469 184.424 111.739 184.424 113.31Z" fill="#FFD43B"/>
<path d="M181.625 116.714C179.774 116.714 178.271 115.189 178.271 113.31C178.271 111.431 179.774 109.906 181.625 109.906C183.476 109.906 184.979 111.431 184.979 113.31C184.979 115.181 183.476 116.714 181.625 116.714ZM181.625 111.033C180.388 111.033 179.381 112.055 179.381 113.31C179.381 114.565 180.388 115.587 181.625 115.587C182.861 115.587 183.868 114.565 183.868 113.31C183.868 112.055 182.861 111.033 181.625 111.033Z" fill="#1753FF"/>
<path d="M182.18 116.271H181.07V121.501H182.18V116.271Z" fill="#1753FF"/>
<path d="M109.538 29.2451H101.677L97.9894 22.0441C97.705 21.4938 98.1086 20.8425 98.7232 20.8425H101.438C101.668 20.8425 101.888 20.9342 102.044 21.1085L109.538 29.2451Z" fill="white"/>
<path d="M109.538 29.2451H101.677L97.9894 22.0441C97.705 21.4938 98.1086 20.8425 98.7232 20.8425H101.438C101.668 20.8425 101.888 20.9342 102.044 21.1085L109.538 29.2451Z" fill="white"/>
<path d="M99.5852 20.8516H98.7229C98.1083 20.8516 97.7139 21.5029 97.9891 22.0533L101.677 29.2542H104.741L99.677 21.2002C99.6219 21.081 99.5944 20.9617 99.5852 20.8516Z" fill="#5FB0E5"/>
<path d="M111.107 29.933H101.255L97.3839 22.356C97.1454 21.8881 97.1637 21.3286 97.4389 20.8791C97.7141 20.4296 98.2003 20.1544 98.7323 20.1544H101.448C101.87 20.1544 102.273 20.3287 102.558 20.6406L111.107 29.933ZM102.099 28.557H107.97L101.548 21.5763C101.521 21.5487 101.484 21.5304 101.448 21.5304H98.7323C98.6865 21.5304 98.6406 21.5487 98.6131 21.5946C98.5855 21.6405 98.5855 21.6772 98.6131 21.723L102.099 28.557Z" fill="#1753FF"/>
<path d="M136.911 32.0521H136.149C135.471 30.2174 133.728 28.9057 131.664 28.9057H99.5762C99.5762 33.3363 103.163 36.923 107.593 36.923H127.793H136.461H136.911C138.131 36.923 139.122 35.9323 139.122 34.7123V34.2628C139.122 33.0336 138.131 32.0521 136.911 32.0521Z" fill="white"/>
<path d="M136.911 35.0332H136.461H127.793H107.593C103.814 35.0332 100.659 32.4189 99.8055 28.8964H99.5762C99.5762 33.327 103.163 36.9137 107.593 36.9137H127.793H136.461H136.911C138.131 36.9137 139.122 35.923 139.122 34.703V34.2535C139.122 34.0058 139.066 33.7673 138.993 33.538C138.69 34.4094 137.874 35.0332 136.911 35.0332Z" fill="#9ECFEF"/>
<path d="M136.911 37.6017H107.594C102.796 37.6017 98.8887 33.694 98.8887 28.8965V28.2085H131.664C133.783 28.2085 135.71 29.456 136.609 31.3548H136.911C138.507 31.3548 139.81 32.6574 139.81 34.2536V34.703C139.81 36.3083 138.507 37.6017 136.911 37.6017ZM100.301 29.5844C100.65 33.2996 103.787 36.2258 107.594 36.2258H136.911C137.755 36.2258 138.434 35.547 138.434 34.703V34.2536C138.434 33.4188 137.746 32.7308 136.911 32.7308H135.673L135.508 32.2813C134.912 30.6669 133.37 29.5844 131.664 29.5844H100.301Z" fill="#1753FF"/>
<path d="M108.777 31.4466H99.4756C98.8794 31.4466 98.4023 30.9696 98.4023 30.3734V29.9789C98.4023 29.3827 98.8794 28.9057 99.4756 28.9057H108.777C109.373 28.9057 109.85 29.3827 109.85 29.9789V30.3734C109.85 30.9696 109.373 31.4466 108.777 31.4466Z" fill="#D2E9F7"/>
<path d="M126.83 37.8586H115.418C114.822 37.8586 114.345 37.3816 114.345 36.7854V35.9139C114.345 35.3177 114.822 34.8407 115.418 34.8407H126.83C127.426 34.8407 127.903 35.3177 127.903 35.9139V36.7854C127.912 37.3725 127.426 37.8586 126.83 37.8586Z" fill="#D2E9F7"/>
<path d="M108.777 32.1346H99.4756C98.5032 32.1346 97.7144 31.3457 97.7144 30.3733V29.9697C97.7144 28.9974 98.5032 28.2085 99.4756 28.2085H108.777C109.749 28.2085 110.538 28.9974 110.538 29.9697V30.3642C110.538 31.3457 109.749 32.1346 108.777 32.1346ZM99.4756 29.5844C99.2646 29.5844 99.0903 29.7587 99.0903 29.9697V30.3642C99.0903 30.5751 99.2646 30.7494 99.4756 30.7494H108.777C108.988 30.7494 109.162 30.5751 109.162 30.3642V29.9697C109.162 29.7587 108.988 29.5844 108.777 29.5844H99.4756Z" fill="#1753FF"/>
<path d="M126.83 38.5465H115.418C114.446 38.5465 113.657 37.7577 113.657 36.7853V35.9139C113.657 34.9415 114.446 34.1526 115.418 34.1526H126.83C127.802 34.1526 128.591 34.9415 128.591 35.9139V36.7853C128.591 37.7485 127.802 38.5465 126.83 38.5465ZM115.418 35.5286C115.207 35.5286 115.033 35.7029 115.033 35.9139V36.7853C115.033 36.9963 115.207 37.1706 115.418 37.1706H126.83C127.041 37.1706 127.215 36.9963 127.215 36.7853V35.9139C127.215 35.7029 127.041 35.5286 126.83 35.5286H115.418Z" fill="#1753FF"/>
<path d="M133.691 30.7585H129.673V32.1345H133.691V30.7585Z" fill="#1753FF"/>
<path d="M126.985 30.7585H124.977V32.1345H126.985V30.7585Z" fill="#1753FF"/>
<path d="M123.747 30.7585H121.738V32.1345H123.747V30.7585Z" fill="#1753FF"/>
<path d="M120.51 30.7585H118.501V32.1345H120.51V30.7585Z" fill="#1753FF"/>
<path d="M117.272 30.7585H115.263V32.1345H117.272V30.7585Z" fill="#1753FF"/>
<path d="M114.042 30.7585H112.033V32.1345H114.042V30.7585Z" fill="#1753FF"/>
<path d="M57.3646 54.043C57.1734 54.043 56.9822 53.9726 56.8312 53.8218C56.5393 53.5301 56.5393 53.0474 56.8312 52.7558L59.8705 49.7186C60.1623 49.427 60.6454 49.427 60.9373 49.7186C61.2291 50.0103 61.2291 50.493 60.9373 50.7846L57.898 53.8218C57.747 53.9726 57.5558 54.043 57.3646 54.043Z" fill="#1753FF"/>
<path d="M60.4039 54.043C60.2127 54.043 60.0215 53.9726 59.8705 53.8218L56.8312 50.7846C56.5393 50.493 56.5393 50.0103 56.8312 49.7186C57.123 49.427 57.6061 49.427 57.898 49.7186L60.9373 52.7558C61.2291 53.0474 61.2291 53.5301 60.9373 53.8218C60.7863 53.9726 60.5951 54.043 60.4039 54.043Z" fill="#1753FF"/>
<path d="M53.9267 51.0159H38.1006V52.5244H53.9267V51.0159Z" fill="#1753FF"/>
<path d="M109.415 61.2149H104.566C104.101 61.2149 103.715 60.8288 103.715 60.3633C103.715 59.8978 104.101 59.5118 104.566 59.5118H109.415C109.88 59.5118 110.266 59.8978 110.266 60.3633C110.266 60.8288 109.88 61.2149 109.415 61.2149Z" fill="#1753FF"/>
<path d="M106.984 63.6446C106.519 63.6446 106.133 63.2586 106.133 62.7931V57.945C106.133 57.4794 106.519 57.0934 106.984 57.0934C107.45 57.0934 107.836 57.4794 107.836 57.945V62.7931C107.836 63.2586 107.461 63.6446 106.984 63.6446Z" fill="#1753FF"/>
<path d="M117.797 72.6374H84.5811V74.3327H117.797V72.6374Z" fill="#1753FF"/>
<path d="M82.886 72.6374H79.439V74.3327H82.886V72.6374Z" fill="#1753FF"/>
</svg>
