<svg width="16" height="17" viewBox="0 0 16 17" fill="none" xmlns="http://www.w3.org/2000/svg">
<path d="M15.8125 6.79688V9.51562H0.21875V6.79688H15.8125ZM9.46875 0.15625V16.7188H6.57812V0.15625H9.46875Z" fill="#1753FF"/>
</svg>
