<?xml version="1.0" encoding="utf-8"?>
<!-- This URDF was automatically created by SolidWorks to URDF Exporter! Originally created by Stephen Brawner (brawner@gmail.com) 
     Commit Version: 1.6.0-1-g15f4949  Build Version: 1.6.7594.29634
     For more information, please see http://wiki.ros.org/sw_urdf_exporter -->
<robot
  name="Assemnew4">
  <link
    name="base_link">
    <inertial>
      <origin
        xyz="-1.13693520281677E-06 2.34737880530633E-06 0.0814574499452834"
        rpy="0 0 0" />
      <mass
        value="0.435536774368536" />
      <inertia
        ixx="0.00107709426963133"
        ixy="-2.84941031534188E-09"
        ixz="3.84947925594846E-08"
        iyy="0.00107709643653489"
        iyz="-7.46358186489365E-08"
        izz="0.000188069775614573" />
    </inertial>
    <visual>
      <origin
        xyz="0 0 0"
        rpy="0 0 0" />
      <geometry>
        <mesh
          filename="package://Assemnew4/meshes/base_link.STL" />
      </geometry>
      <material
        name="">
        <color
          rgba="0.792156862745098 0.819607843137255 0.933333333333333 1" />
      </material>
    </visual>
    <collision>
      <origin
        xyz="0 0 0"
        rpy="0 0 0" />
      <geometry>
        <mesh
          filename="package://Assemnew4/meshes/base_link.STL" />
      </geometry>
    </collision>
  </link>
  <link
    name="Link1">
    <inertial>
      <origin
        xyz="-0.0100883663517928 -0.00025129931298061 0.00958076936145592"
        rpy="0 0 0" />
      <mass
        value="0.367815956101895" />
      <inertia
        ixx="0.000279013411298132"
        ixy="4.95825637032243E-06"
        ixz="2.0860903000943E-06"
        iyy="0.000423421855669335"
        iyz="2.89980541844511E-06"
        izz="0.000591828427459942" />
    </inertial>
    <visual>
      <origin
        xyz="0 0 0"
        rpy="0 0 0" />
      <geometry>
        <mesh
          filename="package://Assemnew4/meshes/Link1.STL" />
      </geometry>
      <material
        name="">
        <color
          rgba="0.792156862745098 0.819607843137255 0.933333333333333 1" />
      </material>
    </visual>
    <collision>
      <origin
        xyz="0 0 0"
        rpy="0 0 0" />
      <geometry>
        <mesh
          filename="package://Assemnew4/meshes/Link1.STL" />
      </geometry>
    </collision>
  </link>
  <joint
    name="joint1"
    type="revolute">
    <origin
      xyz="0 0 0.173500000000154"
      rpy="0 0 0" />
    <parent
      link="base_link" />
    <child
      link="Link1" />
    <axis
      xyz="0 0 1" />
    <limit
      lower="-3.14"
      upper="3.14"
      effort="400"
      velocity="1.74" />
  </joint>
  <link
    name="link2">
    <inertial>
      <origin
        xyz="-0.121777945697358 -0.00307562361687855 -0.0123569916164885"
        rpy="0 0 0" />
      <mass
        value="0.74446077867236" />
      <inertia
        ixx="0.00057020534054047"
        ixy="-0.000267105831726659"
        ixz="-0.000229266766973683"
        iyy="0.0121354142576393"
        iyz="-3.75285534706411E-06"
        izz="0.0124638157383193" />
    </inertial>
    <visual>
      <origin
        xyz="0 0 0"
        rpy="0 0 0" />
      <geometry>
        <mesh
          filename="package://Assemnew4/meshes/link2.STL" />
      </geometry>
      <material
        name="">
        <color
          rgba="0.792156862745098 0.819607843137255 0.933333333333333 1" />
      </material>
    </visual>
    <collision>
      <origin
        xyz="0 0 0"
        rpy="0 0 0" />
      <geometry>
        <mesh
          filename="package://Assemnew4/meshes/link2.STL" />
      </geometry>
    </collision>
  </link>
  <joint
    name="joint2"
    type="revolute">
    <origin
      xyz="-0.080177 -0.0096 0.0095394"
      rpy="1.5708 0 1.5708" />
    <parent
      link="Link1" />
    <child
      link="link2" />
    <axis
      xyz="0.022035 0 -0.99976" />
    <limit
      lower="-0.34907"
      upper="3.4907"
      effort="300"
      velocity="1.74" />
  </joint>
  <link
    name="link3">
    <inertial>
      <origin
        xyz="-0.192874569331543 -0.00421573070571428 0.0377615540450953"
        rpy="0 0 0" />
      <mass
        value="0.516876023252553" />
      <inertia
        ixx="0.000398347768892501"
        ixy="-0.00013312226726547"
        ixz="0.000227015441311559"
        iyy="0.00613535511166362"
        iyz="7.710627748622E-06"
        izz="0.00632502454552635" />
    </inertial>
    <visual>
      <origin
        xyz="0 0 0"
        rpy="0 0 0" />
      <geometry>
        <mesh
          filename="package://Assemnew4/meshes/link3.STL" />
      </geometry>
      <material
        name="">
        <color
          rgba="0.792156862745098 0.819607843137255 0.933333333333333 1" />
      </material>
    </visual>
    <collision>
      <origin
        xyz="0 0 0"
        rpy="0 0 0" />
      <geometry>
        <mesh
          filename="package://Assemnew4/meshes/link3.STL" />
      </geometry>
    </collision>
  </link>
  <joint
    name="joint3"
    type="revolute">
    <origin
      xyz="-0.257569719124836 -0.00612256206561468 -0.00517461082125387"
      rpy="0 0 0" />
    <parent
      link="link2" />
    <child
      link="link3" />
    <axis
      xyz="-0.0222273031611167 0.00835323710108786 0.999718045462878" />
    <limit
      lower="-2.7925"
      upper="2.7925"
      effort="300"
      velocity="1.74" />
  </joint>
  <link
    name="link4">
    <inertial>
      <origin
        xyz="0.00134607259858111 -0.000886633023266137 -0.0701003849927886"
        rpy="0 0 0" />
      <mass
        value="0.365333548228916" />
      <inertia
        ixx="0.000583944755080796"
        ixy="3.69949868243798E-06"
        ixz="9.94468777411605E-07"
        iyy="0.000421455180930314"
        iyz="-1.89024097405765E-06"
        izz="0.000270415622298549" />
    </inertial>
    <visual>
      <origin
        xyz="0 0 0"
        rpy="0 0 0" />
      <geometry>
        <mesh
          filename="package://Assemnew4/meshes/link4.STL" />
      </geometry>
      <material
        name="">
        <color
          rgba="0.792156862745098 0.819607843137255 0.933333333333333 1" />
      </material>
    </visual>
    <collision>
      <origin
        xyz="0 0 0"
        rpy="0 0 0" />
      <geometry>
        <mesh
          filename="package://Assemnew4/meshes/link4.STL" />
      </geometry>
    </collision>
  </link>
  <joint
    name="joint4"
    type="revolute">
    <origin
      xyz="-0.26915 -0.00612 0.029871"
      rpy="0 0 0" />
    <parent
      link="link3" />
    <child
      link="link4" />
    <axis
      xyz="-0.022325 0.012537 0.99967" />
    <limit
      lower="-3.14"
      upper="3.14"
      effort="200"
      velocity="1.74" />
  </joint>
  <link
    name="link5">
    <inertial>
      <origin
        xyz="-0.00156686435250616 0.00278970943595263 0.0684821193358641"
        rpy="0 0 0" />
      <mass
        value="0.318228510445993" />
      <inertia
        ixx="0.000402714491545937"
        ixy="1.76165208655768E-06"
        ixz="3.26760525522366E-06"
        iyy="0.000566813973374799"
        iyz="-1.68464840976722E-05"
        izz="0.000258664039589146" />
    </inertial>
    <visual>
      <origin
        xyz="0 0 0"
        rpy="0 0 0" />
      <geometry>
        <mesh
          filename="package://Assemnew4/meshes/link5.STL" />
      </geometry>
      <material
        name="">
        <color
          rgba="0.792156862745098 0.819607843137255 0.933333333333333 1" />
      </material>
    </visual>
    <collision>
      <origin
        xyz="0 0 0"
        rpy="0 0 0" />
      <geometry>
        <mesh
          filename="package://Assemnew4/meshes/link5.STL" />
      </geometry>
    </collision>
  </link>
  <joint
    name="joint5"
    type="revolute">
    <origin
      xyz="-0.0082484 -0.0012443 -0.080945"
      rpy="-1.5708 0 1.5708" />
    <parent
      link="link4" />
    <child
      link="link5" />
    <axis
      xyz="0.023068 -0.022031 -0.99949" />
    <limit
      lower="-3.14"
      upper="3.14"
      effort="200"
      velocity="1.74" />
  </joint>
  <link
    name="link6">
    <inertial>
      <origin
        xyz="-0.000203508127956262 -0.000496655083885078 -0.0227436676499541"
        rpy="0 0 0" />
      <mass
        value="0.0630376273907316" />
      <inertia
        ixx="1.7824888316152E-05"
        ixy="-7.66581579428174E-10"
        ixz="-3.51045972043019E-08"
        iyy="1.78233316108254E-05"
        iyz="-8.56716478320924E-08"
        izz="1.39019817700317E-05" />
    </inertial>
    <visual>
      <origin
        xyz="0 0 0"
        rpy="0 0 0" />
      <geometry>
        <mesh
          filename="package://Assemnew4/meshes/link6.STL" />
      </geometry>
      <material
        name="">
        <color
          rgba="0.56078431372549 0.56078431372549 0.686274509803922 1" />
      </material>
    </visual>
    <collision>
      <origin
        xyz="0 0 0"
        rpy="0 0 0" />
      <geometry>
        <mesh
          filename="package://Assemnew4/meshes/link6.STL" />
      </geometry>
    </collision>
  </link>
  <joint
    name="joint6"
    type="revolute">
    <origin
      xyz="-0.0016699 0.023329 0.080238"
      rpy="-1.5708 0 0" />
    <parent
      link="link5" />
    <child
      link="link6" />
    <axis
      xyz="-0.0089454 -0.021831 -0.99972" />
    <limit
      lower="-3.14"
      upper="3.14"
      effort="200"
      velocity="1.74" />
  </joint>
  <link
    name="link7">
    <inertial>
      <origin
        xyz="-0.00155527573895012 0.000755274461630484 0.0334978978524536"
        rpy="0 0 0" />
      <mass
        value="0.096837309623472" />
      <inertia
        ixx="7.92126732673515E-05"
        ixy="-2.46385312530132E-08"
        ixz="5.03273866972113E-06"
        iyy="6.83597693295843E-05"
        iyz="-2.04029388579778E-07"
        izz="6.19370491916778E-05" />
    </inertial>
    <visual>
      <origin
        xyz="0 0 0"
        rpy="0 0 0" />
      <geometry>
        <mesh
          filename="package://Assemnew4/meshes/link7.STL" />
      </geometry>
      <material
        name="">
        <color
          rgba="0.56078431372549 0.56078431372549 0.686274509803922 1" />
      </material>
    </visual>
    <collision>
      <origin
        xyz="0 0 0"
        rpy="0 0 0" />
      <geometry>
        <mesh
          filename="package://Assemnew4/meshes/link7.STL" />
      </geometry>
    </collision>
  </link>
  <joint
    name="joint7"
    type="fixed">
    <origin
      xyz="0 0 0"
      rpy="0 0 0" />
    <parent
      link="link6" />
    <child
      link="link7" />
    <axis
      xyz="0 0 0" />
  </joint>
  <link
    name="right_flink">
    <inertial>
      <origin
        xyz="5.28382526789051E-05 0.00625389779430441 -0.00301657965019643"
        rpy="0 0 0" />
      <mass
        value="0.0116708855549675" />
      <inertia
        ixx="2.42774478735166E-06"
        ixy="5.35266191224241E-09"
        ixz="-1.36221669265962E-08"
        iyy="2.74564263031472E-06"
        iyz="1.54256317251926E-07"
        izz="6.32273998570701E-07" />
    </inertial>
    <visual>
      <origin
        xyz="0 0 0"
        rpy="0 0 0" />
      <geometry>
        <mesh
          filename="package://Assemnew4/meshes/right_flink.STL" />
      </geometry>
      <material
        name="">
        <color
          rgba="0.792156862745098 0.819607843137255 0.933333333333333 1" />
      </material>
    </visual>
    <collision>
      <origin
        xyz="0 0 0"
        rpy="0 0 0" />
      <geometry>
        <mesh
          filename="package://Assemnew4/meshes/right_flink.STL" />
      </geometry>
    </collision>
  </link>
  <joint
    name="right_fjoint"
    type="prismatic">
    <origin
      xyz="-0.011217 0.0024579 0.10018"
      rpy="0 0 0" />
    <parent
      link="link7" />
    <child
      link="right_flink" />
    <axis
      xyz="0.012437 0.99968 -0.021941" />
    <limit
      lower="0"
      upper="0.03"
      effort="100"
      velocity="1.74" />
  </joint>
  <link
    name="left_flink">
    <inertial>
      <origin
        xyz="-0.00010435827108507 -0.00637954785520201 -0.0027400728301641"
        rpy="0 0 0" />
      <mass
        value="0.0116708328609782" />
      <inertia
        ixx="2.4276666057613E-06"
        ixy="1.66161922663575E-09"
        ixz="-1.85247291333939E-08"
        iyy="2.72816982430099E-06"
        iyz="-2.4590193339466E-07"
        izz="6.49845998316079E-07" />
    </inertial>
    <visual>
      <origin
        xyz="0 0 0"
        rpy="0 0 0" />
      <geometry>
        <mesh
          filename="package://Assemnew4/meshes/left_flink.STL" />
      </geometry>
      <material
        name="">
        <color
          rgba="0.792156862745098 0.819607843137255 0.933333333333333 1" />
      </material>
    </visual>
    <collision>
      <origin
        xyz="0 0 0"
        rpy="0 0 0" />
      <geometry>
        <mesh
          filename="package://Assemnew4/meshes/left_flink.STL" />
      </geometry>
    </collision>
  </link>
  <joint
    name="left_fjoint"
    type="prismatic">
    <origin
      xyz="-0.011217 0.0024579 0.10018"
      rpy="0 0 0" />
    <parent
      link="link7" />
    <child
      link="left_flink" />
    <axis
      xyz="0.012437 0.99968 -0.021941" />
    <limit
      lower="-0.03"
      upper="0"
      effort="100"
      velocity="1.74" />
  </joint>
</robot>