<svg xmlns="http://www.w3.org/2000/svg" xmlns:xlink="http://www.w3.org/1999/xlink" width="100" height="109" viewBox="0 0 100 109">
    <defs>
        <circle id="a" cx="50" cy="40" r="15"/>
    </defs>
    <g fill="none" fill-rule="evenodd">
        <path fill="#FF8104" fill-rule="nonzero" d="M32.9 74.1L8.2 52.8c-.8-.7-.9-2-.2-2.8.7-.8 2-.9 2.8-.2l25.1 21.7-3 2.6zM66 74.1l-3-2.7 24.8-21.7c.8-.7 2.1-.6 2.8.2.7.8.6 2.1-.2 2.8L66 74.1zM90 99.5c-.7.8-2 .9-2.8.2l-37.7-33-38.2 33c-.8.7-2.1.6-2.8-.2-.7-.8-.6-2.1.2-2.8l39.5-34.1c.4-.3.8-.5 1.3-.5s.9.2 1.3.5l39 34.1c.9.7.9 2 .2 2.8z"/>
        <path fill="#FF8104" fill-rule="nonzero" d="M97.5 41.4c-.1-.1-.1-.2-.3-.3-.4-.4-.9-.8-1.4-1.2l-6.9-6v5.3l4.2 3.7.1.1.1.1c.3.2.6.5.8.7l.1.1.1.1c1 1.1 1.5 2.5 1.5 3.9v51c0 3.3-2.7 6-6 6H10c-3.3 0-6-2.7-6-6V48c0-1.5.6-3 1.7-4.1l.1-.1.1-.1.4-.4.1-.1.1-.1 4.6-4v-5.3l-7.2 6.3c-.2.2-.5.4-.7.6l-.2.1c0 .1-.1.2-.1.2l-.1.1C1 43 0 45.4 0 48v51c0 5.5 4.5 10 10 10h80c5.5 0 10-4.5 10-10V48c0-2.5-.9-4.8-2.5-6.6zM42.2 12L50 5.2l7.8 6.8h6.1L51.5 1.1c-.4-.4-.9-.6-1.5-.6-.5 0-1.1.2-1.5.6L36.1 12h6.1z"/>
        <path fill="#FAA634" fill-rule="nonzero" d="M17 52.5v-29c0-3.3 3.2-5.5 6.5-5.5h54c3.3 0 5.5 2.2 5.5 5.5v27.7l3.4-2.9c.2-.2.6-.3.6-.5V23.5c0-5.5-4-9.5-9.5-9.5h-54C18 14 13 18 13 23.5V49l4 3.5z"/>
        <g>
            <use fill="#FAA634" xlink:href="#a"/>
            <circle cx="50" cy="40" r="10.5" stroke="#2A2D33" stroke-width="9"/>
            <circle cx="50" cy="40" r="13" stroke="#FAA634" stroke-width="4"/>
        </g>
    </g>
</svg>
