
<svg width="64px" height="64px" viewBox="0 0 64 64" version="1.1" xmlns="http://www.w3.org/2000/svg" xmlns:xlink="http://www.w3.org/1999/xlink">
    <!-- Generator: Sketch 43.1 (39012) - http://www.bohemiancoding.com/sketch -->
    <desc>Created with Sketch.</desc>
    <defs></defs>
    <g id="Page-1" stroke="none" stroke-width="1" fill="none" fill-rule="evenodd">
        <g id="icon_sprite" transform="translate(-801.000000, -34.000000)" fill-rule="nonzero" fill="#FF8104">
            <g id="Group" transform="translate(801.000000, 34.000000)">
                <path d="M5.33333333,5.33333333 L32,5.33333333 L32,11 L32,11 C32,13.209139 33.790861,15 36,15 L42.6666667,15 L42.6666667,18.6666667 L42.6666667,18.6666667 C42.6666667,20.139426 43.860574,21.3333333 45.3333333,21.3333333 L45.3333333,21.3333333 L45.3333333,21.3333333 C46.8060927,21.3333333 48,20.139426 48,18.6666667 L48,11.2293333 L35.7706667,0 L5.33333333,0 C2.392,0 0,2.39466667 0,5.33333333 L0,53.3333333 C0,56.2746667 2.392,58.6666667 5.33333333,58.6666667 L18.6666667,58.6666667 L18.6666667,58.6666667 C20.139426,58.6666667 21.3333333,57.4727593 21.3333333,56 L21.3333333,56 L21.3333333,56 C21.3333333,54.5272407 20.139426,53.3333333 18.6666667,53.3333333 L5.33333333,53.3333333 L5.33333333,5.33333333 Z" id="Fill-1947"></path>
                <path d="M13.3333333,40 L17,40 L17,40 C18.4727593,40 19.6666667,38.8060927 19.6666667,37.3333333 L19.6666667,37.3333333 L19.6666667,37.3333333 C19.6666667,35.860574 18.4727593,34.6666667 17,34.6666667 L13.3333333,34.6666667 L13.3333333,34.6666667 C11.860574,34.6666667 10.6666667,35.860574 10.6666667,37.3333333 L10.6666667,37.3333333 L10.6666667,37.3333333 C10.6666667,38.8060927 11.860574,40 13.3333333,40 Z" id="Fill-1948"></path>
                <path d="M13.3333333,29.3333333 L22.3333333,29.3333333 L22.3333333,29.3333333 C23.8060927,29.3333333 25,28.139426 25,26.6666667 L25,26.6666667 L25,26.6666667 C25,25.1939073 23.8060927,24 22.3333333,24 L13.3333333,24 L13.3333333,24 C11.860574,24 10.6666667,25.1939073 10.6666667,26.6666667 L10.6666667,26.6666667 L10.6666667,26.6666667 C10.6666667,28.139426 11.860574,29.3333333 13.3333333,29.3333333 Z" id="Fill-1949"></path>
                <path d="M45.3333333,58.6666667 C37.9813333,58.6666667 32,52.6853333 32,45.3333333 C32,37.9813333 37.9813333,32 45.3333333,32 C52.6853333,32 58.6666667,37.9813333 58.6666667,45.3333333 C58.6666667,52.6853333 52.6853333,58.6666667 45.3333333,58.6666667 M45.3333333,26.6666667 C35.0426667,26.6666667 26.6666667,35.04 26.6666667,45.3333333 C26.6666667,55.6266667 35.0426667,64 45.3333333,64 C55.624,64 64,55.6266667 64,45.3333333 C64,35.04 55.624,26.6666667 45.3333333,26.6666667" id="Fill-1950"></path>
                <path d="M45.3333333,54 L45.3333333,54 L45.3333333,54 C46.8060927,54 48,52.8060927 48,51.3333333 L48,47 L48,47 C48,45.5272407 46.8060927,44.3333333 45.3333333,44.3333333 L45.3333333,44.3333333 L45.3333333,44.3333333 C43.860574,44.3333333 42.6666667,45.5272407 42.6666667,47 L42.6666667,51.3333333 L42.6666667,51.3333333 C42.6666667,52.8060927 43.860574,54 45.3333333,54 Z" id="Fill-1951"></path>
                <path d="M45.3333333,36.3333333 C43.8586667,36.3333333 42.6666667,37.528 42.6666667,39 C42.6666667,40.4746667 43.8586667,41.6666667 45.3333333,41.6666667 C46.808,41.6666667 48,40.4746667 48,39 C48,37.528 46.808,36.3333333 45.3333333,36.3333333" id="Fill-1952"></path>
            </g>
        </g>
    </g>
</svg>
