{
  "dns_record_type": "a",
  "dns_record_action": "add",
  "dns_record_source": "rocketman.ops.contoso.com.",
  "dns_record_value": "192.168.192.168,172.16.172.16,10.10.10.10",
  "dns_record_include_ptr": false,
  "dns_record_ttl": "300000",
  "dns_record_force_update": true,
  "dns_record_dns_server": "sjc06-c01-dc04.ops.contoso.com."
}
