Sender: LSF System <lsfadmin@polus-c4-ib.bmc.hpc.cs.msu.ru>
Subject: Job 179406: <# this file was automaticly created by mpisubmit.pl script for edu-cmc-skpod18-320-19 #;source /polusfs/setenv/setup.SMPI;#BSUB -n 46;#BSUB -W 00:15;#BSUB -o logs-C/open_mp.46.1.out;#BSUB -e logs-C/open_mp.46.1.dat;OMP_NUM_THREADS=46 mpiexec -np 1 bin/open_mp C 1073741824 4> in cluster <MSUCluster> Done

Job <# this file was automaticly created by mpisubmit.pl script for edu-cmc-skpod18-320-19 #;source /polusfs/setenv/setup.SMPI;#BSUB -n 46;#BSUB -W 00:15;#BSUB -o logs-C/open_mp.46.1.out;#BSUB -e logs-C/open_mp.46.1.dat;OMP_NUM_THREADS=46 mpiexec -np 1 bin/open_mp C 1073741824 4> was submitted from host <polus-ib.bmc.hpc.cs.msu.ru> by user <edu-cmc-skpod18-320-19> in cluster <MSUCluster> at Sat Dec 15 21:13:48 2018
Job was executed on host(s) <18*polus-c4-ib.bmc.hpc.cs.msu.ru>, in queue <short>, as user <edu-cmc-skpod18-320-19> in cluster <MSUCluster> at Sat Dec 15 21:59:48 2018
                            <9*polus-c2-ib.bmc.hpc.cs.msu.ru>
                            <19*polus-c1-ib.bmc.hpc.cs.msu.ru>
</home_edu/edu-cmc-skpod18-320/edu-cmc-skpod18-320-19> was used as the home directory.
</home_edu/edu-cmc-skpod18-320/edu-cmc-skpod18-320-19/sc_pdp> was used as the working directory.
Started at Sat Dec 15 21:59:48 2018
Terminated at Sat Dec 15 21:59:54 2018
Results reported at Sat Dec 15 21:59:54 2018

Your job looked like:

------------------------------------------------------------
# LSBATCH: User input
# this file was automaticly created by mpisubmit.pl script for edu-cmc-skpod18-320-19 #
source /polusfs/setenv/setup.SMPI
#BSUB -n 46
#BSUB -W 00:15
#BSUB -o logs-C/open_mp.46.1.out
#BSUB -e logs-C/open_mp.46.1.dat
OMP_NUM_THREADS=46 mpiexec -np 1 bin/open_mp C 1073741824 4

------------------------------------------------------------

Successfully completed.

Resource usage summary:

    CPU time :                                   140.11 sec.
    Max Memory :                                 76 MB
    Average Memory :                             1.00 MB
    Total Requested Memory :                     -
    Delta Memory :                               -
    Max Swap :                                   2 MB
    Max Processes :                              5
    Max Threads :                                57
    Run time :                                   6 sec.
    Turnaround time :                            2766 sec.

The output (if any) follows:

Evaluating method of middle rectangles with OpenMP implementation.
Integrating 2sqrt(1-x^2) from -1.000000 to 1.000000, sampling at 1073741824 points.
================================
Computed Value: 3.14159265358981
  Target Value: 3.14159265358979
Absolute Error: 1.19904086659517e-14
         WTime: 0.943979035131633 sec
================================
Computed Value: 3.14159265358981
  Target Value: 3.14159265358979
Absolute Error: 1.19904086659517e-14
         WTime: 0.866662930231541 sec
================================
Computed Value: 3.14159265358981
  Target Value: 3.14159265358979
Absolute Error: 1.19904086659517e-14
         WTime: 0.867225721944124 sec
================================
Computed Value: 3.14159265358981
  Target Value: 3.14159265358979
Absolute Error: 1.19904086659517e-14
         WTime: 0.866756781935692 sec


PS:

Read file <logs-C/open_mp.46.1.dat> for stderr output of this job.

Sender: LSF System <lsfadmin@polus-c1-ib.bmc.hpc.cs.msu.ru>
Subject: Job 180905: <# this file was automaticly created by mpisubmit.pl script for edu-cmc-skpod18-320-19 #;source /polusfs/setenv/setup.SMPI;#BSUB -n 46;#BSUB -W 00:15;#BSUB -o logs-C/open_mp.46.1.out;#BSUB -e logs-C/open_mp.46.1.dat;OMP_NUM_THREADS=46 mpiexec -np 1 bin/open_mp C 1073741824 4> in cluster <MSUCluster> Done

Job <# this file was automaticly created by mpisubmit.pl script for edu-cmc-skpod18-320-19 #;source /polusfs/setenv/setup.SMPI;#BSUB -n 46;#BSUB -W 00:15;#BSUB -o logs-C/open_mp.46.1.out;#BSUB -e logs-C/open_mp.46.1.dat;OMP_NUM_THREADS=46 mpiexec -np 1 bin/open_mp C 1073741824 4> was submitted from host <polus-ib.bmc.hpc.cs.msu.ru> by user <edu-cmc-skpod18-320-19> in cluster <MSUCluster> at Mon Dec 17 00:00:08 2018
Job was executed on host(s) <19*polus-c1-ib.bmc.hpc.cs.msu.ru>, in queue <short>, as user <edu-cmc-skpod18-320-19> in cluster <MSUCluster> at Mon Dec 17 01:38:35 2018
                            <10*polus-c3-ib.bmc.hpc.cs.msu.ru>
                            <17*polus-c4-ib.bmc.hpc.cs.msu.ru>
</home_edu/edu-cmc-skpod18-320/edu-cmc-skpod18-320-19> was used as the home directory.
</home_edu/edu-cmc-skpod18-320/edu-cmc-skpod18-320-19/sc_pdp> was used as the working directory.
Started at Mon Dec 17 01:38:35 2018
Terminated at Mon Dec 17 01:38:42 2018
Results reported at Mon Dec 17 01:38:42 2018

Your job looked like:

------------------------------------------------------------
# LSBATCH: User input
# this file was automaticly created by mpisubmit.pl script for edu-cmc-skpod18-320-19 #
source /polusfs/setenv/setup.SMPI
#BSUB -n 46
#BSUB -W 00:15
#BSUB -o logs-C/open_mp.46.1.out
#BSUB -e logs-C/open_mp.46.1.dat
OMP_NUM_THREADS=46 mpiexec -np 1 bin/open_mp C 1073741824 4

------------------------------------------------------------

Successfully completed.

Resource usage summary:

    CPU time :                                   202.73 sec.
    Max Memory :                                 76 MB
    Average Memory :                             1.00 MB
    Total Requested Memory :                     -
    Delta Memory :                               -
    Max Swap :                                   -
    Max Processes :                              5
    Max Threads :                                57
    Run time :                                   7 sec.
    Turnaround time :                            5914 sec.

The output (if any) follows:

Evaluating method of middle rectangles with OpenMP implementation.
Integrating 2sqrt(1-x^2) from -1.000000 to 1.000000, sampling at 1073741824 points.
================================
Computed Value: 3.14159265358981
  Target Value: 3.14159265358979
Absolute Error: 1.19904086659517e-14
         WTime: 1.29082457203185 sec
================================
Computed Value: 3.14159265358981
  Target Value: 3.14159265358979
Absolute Error: 1.19904086659517e-14
         WTime: 1.15397072199266 sec
================================
Computed Value: 3.14159265358981
  Target Value: 3.14159265358979
Absolute Error: 1.19904086659517e-14
         WTime: 1.14830485795392 sec
================================
Computed Value: 3.14159265358981
  Target Value: 3.14159265358979
Absolute Error: 1.19904086659517e-14
         WTime: 1.59078657598002 sec


PS:

Read file <logs-C/open_mp.46.1.dat> for stderr output of this job.

