Evaluating method of middle rectangles with MPI implementation.
Integrating 2sqrt(1-x^2) from -1.000000 to 1.000000, sampling at 67108864 points.
================================
Computed Value: 3.14159265359143
  Target Value: 3.14159265358979
Absolute Error: 1.64135371960583e-12
         WTime: 2.52702792 sec
================================
Computed Value: 3.14159265359143
  Target Value: 3.14159265358979
Absolute Error: 1.64135371960583e-12
         WTime: 2.52653532117647 sec
================================
Computed Value: 3.14159265359143
  Target Value: 3.14159265358979
Absolute Error: 1.64135371960583e-12
         WTime: 2.52653416588235 sec
================================
Computed Value: 3.14159265359143
  Target Value: 3.14159265358979
Absolute Error: 1.64135371960583e-12
         WTime: 2.52653405529412 sec
