Sender: LSF System <lsfadmin@polus-c4-ib.bmc.hpc.cs.msu.ru>
Subject: Job 176736: <# this file was automaticly created by mpisubmit.pl script for edu-cmc-skpod18-320-19 #;source /polusfs/setenv/setup.SMPI;#BSUB -n 26;#BSUB -W 00:15;#BSUB -o logs-C/mpi.1.26.out;#BSUB -e logs-C/mpi.1.26.dat;OMP_NUM_THREADS=1 mpiexec bin/mpi C 1073741824 4> in cluster <MSUCluster> Done

Job <# this file was automaticly created by mpisubmit.pl script for edu-cmc-skpod18-320-19 #;source /polusfs/setenv/setup.SMPI;#BSUB -n 26;#BSUB -W 00:15;#BSUB -o logs-C/mpi.1.26.out;#BSUB -e logs-C/mpi.1.26.dat;OMP_NUM_THREADS=1 mpiexec bin/mpi C 1073741824 4> was submitted from host <polus-ib.bmc.hpc.cs.msu.ru> by user <edu-cmc-skpod18-320-19> in cluster <MSUCluster> at Sat Dec 15 13:47:02 2018
Job was executed on host(s) <14*polus-c4-ib.bmc.hpc.cs.msu.ru>, in queue <short>, as user <edu-cmc-skpod18-320-19> in cluster <MSUCluster> at Sat Dec 15 13:47:27 2018
                            <12*polus-c1-ib.bmc.hpc.cs.msu.ru>
</home_edu/edu-cmc-skpod18-320/edu-cmc-skpod18-320-19> was used as the home directory.
</home_edu/edu-cmc-skpod18-320/edu-cmc-skpod18-320-19/sc_pdp> was used as the working directory.
Started at Sat Dec 15 13:47:27 2018
Terminated at Sat Dec 15 13:47:30 2018
Results reported at Sat Dec 15 13:47:30 2018

Your job looked like:

------------------------------------------------------------
# LSBATCH: User input
# this file was automaticly created by mpisubmit.pl script for edu-cmc-skpod18-320-19 #
source /polusfs/setenv/setup.SMPI
#BSUB -n 26
#BSUB -W 00:15
#BSUB -o logs-C/mpi.1.26.out
#BSUB -e logs-C/mpi.1.26.dat
OMP_NUM_THREADS=1 mpiexec bin/mpi C 1073741824 4

------------------------------------------------------------

Successfully completed.

Resource usage summary:

    CPU time :                                   38.88 sec.
    Max Memory :                                 758 MB
    Average Memory :                             1.00 MB
    Total Requested Memory :                     -
    Delta Memory :                               -
    Max Swap :                                   -
    Max Processes :                              18
    Max Threads :                                51
    Run time :                                   4 sec.
    Turnaround time :                            28 sec.

The output (if any) follows:

Evaluating method of middle rectangles with MPI implementation.
Integrating 2sqrt(1-x^2) from -1.000000 to 1.000000, sampling at 1073741824 points.
================================
Computed Value: 3.14159269455169
  Target Value: 3.14159265358979
Absolute Error: 4.09619009822393e-08
         WTime: 0.370965387206525 sec
================================
Computed Value: 3.14159269455169
  Target Value: 3.14159265358979
Absolute Error: 4.09619009822393e-08
         WTime: 0.332816259004176 sec
================================
Computed Value: 3.14159269455169
  Target Value: 3.14159265358979
Absolute Error: 4.09619009822393e-08
         WTime: 0.369140918832272 sec
================================
Computed Value: 3.14159269455169
  Target Value: 3.14159265358979
Absolute Error: 4.09619009822393e-08
         WTime: 0.333955076988786 sec


PS:

Read file <logs-C/mpi.1.26.dat> for stderr output of this job.

Sender: LSF System <lsfadmin@polus-c4-ib.bmc.hpc.cs.msu.ru>
Subject: Job 180861: <# this file was automaticly created by mpisubmit.pl script for edu-cmc-skpod18-320-19 #;source /polusfs/setenv/setup.SMPI;#BSUB -n 26;#BSUB -W 00:15;#BSUB -o logs-C/mpi.1.26.out;#BSUB -e logs-C/mpi.1.26.dat;OMP_NUM_THREADS=1 mpiexec -np 26 bin/mpi C 1073741824 4> in cluster <MSUCluster> Done

Job <# this file was automaticly created by mpisubmit.pl script for edu-cmc-skpod18-320-19 #;source /polusfs/setenv/setup.SMPI;#BSUB -n 26;#BSUB -W 00:15;#BSUB -o logs-C/mpi.1.26.out;#BSUB -e logs-C/mpi.1.26.dat;OMP_NUM_THREADS=1 mpiexec -np 26 bin/mpi C 1073741824 4> was submitted from host <polus-ib.bmc.hpc.cs.msu.ru> by user <edu-cmc-skpod18-320-19> in cluster <MSUCluster> at Sun Dec 16 23:59:45 2018
Job was executed on host(s) <18*polus-c4-ib.bmc.hpc.cs.msu.ru>, in queue <short>, as user <edu-cmc-skpod18-320-19> in cluster <MSUCluster> at Mon Dec 17 00:14:16 2018
                            <8*polus-c3-ib.bmc.hpc.cs.msu.ru>
</home_edu/edu-cmc-skpod18-320/edu-cmc-skpod18-320-19> was used as the home directory.
</home_edu/edu-cmc-skpod18-320/edu-cmc-skpod18-320-19/sc_pdp> was used as the working directory.
Started at Mon Dec 17 00:14:16 2018
Terminated at Mon Dec 17 00:14:32 2018
Results reported at Mon Dec 17 00:14:32 2018

Your job looked like:

------------------------------------------------------------
# LSBATCH: User input
# this file was automaticly created by mpisubmit.pl script for edu-cmc-skpod18-320-19 #
source /polusfs/setenv/setup.SMPI
#BSUB -n 26
#BSUB -W 00:15
#BSUB -o logs-C/mpi.1.26.out
#BSUB -e logs-C/mpi.1.26.dat
OMP_NUM_THREADS=1 mpiexec -np 26 bin/mpi C 1073741824 4

------------------------------------------------------------

Successfully completed.

Resource usage summary:

    CPU time :                                   119.40 sec.
    Max Memory :                                 934 MB
    Average Memory :                             467.50 MB
    Total Requested Memory :                     -
    Delta Memory :                               -
    Max Swap :                                   -
    Max Processes :                              22
    Max Threads :                                63
    Run time :                                   17 sec.
    Turnaround time :                            887 sec.

The output (if any) follows:

Evaluating method of middle rectangles with MPI implementation.
Integrating 2sqrt(1-x^2) from -1.000000 to 1.000000, sampling at 1073741824 points.
================================
Computed Value: 3.14159269455169
  Target Value: 3.14159265358979
Absolute Error: 4.09619014263285e-08
         WTime: 0.933388590347022 sec
================================
Computed Value: 3.14159269455169
  Target Value: 3.14159265358979
Absolute Error: 4.09619014263285e-08
         WTime: 0.98034240771085 sec
================================
Computed Value: 3.14159269455169
  Target Value: 3.14159265358979
Absolute Error: 4.09619014263285e-08
         WTime: 0.654282682109624 sec
================================
Computed Value: 3.14159269455169
  Target Value: 3.14159265358979
Absolute Error: 4.09619014263285e-08
         WTime: 1.3054599063471 sec


PS:

Read file <logs-C/mpi.1.26.dat> for stderr output of this job.

