Sender: LSF System <lsfadmin@polus-c1-ib.bmc.hpc.cs.msu.ru>
Subject: Job 179410: <# this file was automaticly created by mpisubmit.pl script for edu-cmc-skpod18-320-19 #;source /polusfs/setenv/setup.SMPI;#BSUB -n 54;#BSUB -W 00:15;#BSUB -o logs-C/open_mp.54.1.out;#BSUB -e logs-C/open_mp.54.1.dat;OMP_NUM_THREADS=54 mpiexec -np 1 bin/open_mp C 1073741824 4> in cluster <MSUCluster> Done

Job <# this file was automaticly created by mpisubmit.pl script for edu-cmc-skpod18-320-19 #;source /polusfs/setenv/setup.SMPI;#BSUB -n 54;#BSUB -W 00:15;#BSUB -o logs-C/open_mp.54.1.out;#BSUB -e logs-C/open_mp.54.1.dat;OMP_NUM_THREADS=54 mpiexec -np 1 bin/open_mp C 1073741824 4> was submitted from host <polus-ib.bmc.hpc.cs.msu.ru> by user <edu-cmc-skpod18-320-19> in cluster <MSUCluster> at Sat Dec 15 21:13:49 2018
Job was executed on host(s) <20*polus-c1-ib.bmc.hpc.cs.msu.ru>, in queue <short>, as user <edu-cmc-skpod18-320-19> in cluster <MSUCluster> at Sat Dec 15 22:10:50 2018
                            <20*polus-c2-ib.bmc.hpc.cs.msu.ru>
                            <14*polus-c3-ib.bmc.hpc.cs.msu.ru>
</home_edu/edu-cmc-skpod18-320/edu-cmc-skpod18-320-19> was used as the home directory.
</home_edu/edu-cmc-skpod18-320/edu-cmc-skpod18-320-19/sc_pdp> was used as the working directory.
Started at Sat Dec 15 22:10:50 2018
Terminated at Sat Dec 15 22:10:55 2018
Results reported at Sat Dec 15 22:10:55 2018

Your job looked like:

------------------------------------------------------------
# LSBATCH: User input
# this file was automaticly created by mpisubmit.pl script for edu-cmc-skpod18-320-19 #
source /polusfs/setenv/setup.SMPI
#BSUB -n 54
#BSUB -W 00:15
#BSUB -o logs-C/open_mp.54.1.out
#BSUB -e logs-C/open_mp.54.1.dat
OMP_NUM_THREADS=54 mpiexec -np 1 bin/open_mp C 1073741824 4

------------------------------------------------------------

Successfully completed.

Resource usage summary:

    CPU time :                                   120.29 sec.
    Max Memory :                                 77 MB
    Average Memory :                             1.00 MB
    Total Requested Memory :                     -
    Delta Memory :                               -
    Max Swap :                                   -
    Max Processes :                              5
    Max Threads :                                65
    Run time :                                   4 sec.
    Turnaround time :                            3426 sec.

The output (if any) follows:

Evaluating method of middle rectangles with OpenMP implementation.
Integrating 2sqrt(1-x^2) from -1.000000 to 1.000000, sampling at 1073741824 points.
================================
Computed Value: 3.14159265358977
  Target Value: 3.14159265358979
Absolute Error: 2.22044604925031e-14
         WTime: 0.756762566044927 sec
================================
Computed Value: 3.14159265358977
  Target Value: 3.14159265358979
Absolute Error: 2.22044604925031e-14
         WTime: 0.747850372979883 sec
================================
Computed Value: 3.14159265358977
  Target Value: 3.14159265358979
Absolute Error: 2.22044604925031e-14
         WTime: 0.747485102969222 sec
================================
Computed Value: 3.14159265358977
  Target Value: 3.14159265358979
Absolute Error: 2.22044604925031e-14
         WTime: 0.748394351045135 sec


PS:

Read file <logs-C/open_mp.54.1.dat> for stderr output of this job.

Sender: LSF System <lsfadmin@polus-c4-ib.bmc.hpc.cs.msu.ru>
Subject: Job 180909: <# this file was automaticly created by mpisubmit.pl script for edu-cmc-skpod18-320-19 #;source /polusfs/setenv/setup.SMPI;#BSUB -n 54;#BSUB -W 00:15;#BSUB -o logs-C/open_mp.54.1.out;#BSUB -e logs-C/open_mp.54.1.dat;OMP_NUM_THREADS=54 mpiexec -np 1 bin/open_mp C 1073741824 4> in cluster <MSUCluster> Done

Job <# this file was automaticly created by mpisubmit.pl script for edu-cmc-skpod18-320-19 #;source /polusfs/setenv/setup.SMPI;#BSUB -n 54;#BSUB -W 00:15;#BSUB -o logs-C/open_mp.54.1.out;#BSUB -e logs-C/open_mp.54.1.dat;OMP_NUM_THREADS=54 mpiexec -np 1 bin/open_mp C 1073741824 4> was submitted from host <polus-ib.bmc.hpc.cs.msu.ru> by user <edu-cmc-skpod18-320-19> in cluster <MSUCluster> at Mon Dec 17 00:00:08 2018
Job was executed on host(s) <18*polus-c4-ib.bmc.hpc.cs.msu.ru>, in queue <short>, as user <edu-cmc-skpod18-320-19> in cluster <MSUCluster> at Mon Dec 17 02:05:16 2018
                            <20*polus-c1-ib.bmc.hpc.cs.msu.ru>
                            <16*polus-c3-ib.bmc.hpc.cs.msu.ru>
</home_edu/edu-cmc-skpod18-320/edu-cmc-skpod18-320-19> was used as the home directory.
</home_edu/edu-cmc-skpod18-320/edu-cmc-skpod18-320-19/sc_pdp> was used as the working directory.
Started at Mon Dec 17 02:05:16 2018
Terminated at Mon Dec 17 02:05:20 2018
Results reported at Mon Dec 17 02:05:20 2018

Your job looked like:

------------------------------------------------------------
# LSBATCH: User input
# this file was automaticly created by mpisubmit.pl script for edu-cmc-skpod18-320-19 #
source /polusfs/setenv/setup.SMPI
#BSUB -n 54
#BSUB -W 00:15
#BSUB -o logs-C/open_mp.54.1.out
#BSUB -e logs-C/open_mp.54.1.dat
OMP_NUM_THREADS=54 mpiexec -np 1 bin/open_mp C 1073741824 4

------------------------------------------------------------

Successfully completed.

Resource usage summary:

    CPU time :                                   120.07 sec.
    Max Memory :                                 77 MB
    Average Memory :                             1.00 MB
    Total Requested Memory :                     -
    Delta Memory :                               -
    Max Swap :                                   -
    Max Processes :                              5
    Max Threads :                                65
    Run time :                                   4 sec.
    Turnaround time :                            7512 sec.

The output (if any) follows:

Evaluating method of middle rectangles with OpenMP implementation.
Integrating 2sqrt(1-x^2) from -1.000000 to 1.000000, sampling at 1073741824 points.
================================
Computed Value: 3.14159265358977
  Target Value: 3.14159265358979
Absolute Error: 2.22044604925031e-14
         WTime: 0.755291210021824 sec
================================
Computed Value: 3.14159265358977
  Target Value: 3.14159265358979
Absolute Error: 2.22044604925031e-14
         WTime: 0.746841410174966 sec
================================
Computed Value: 3.14159265358977
  Target Value: 3.14159265358979
Absolute Error: 2.22044604925031e-14
         WTime: 0.745872243773192 sec
================================
Computed Value: 3.14159265358977
  Target Value: 3.14159265358979
Absolute Error: 2.22044604925031e-14
         WTime: 0.74692100379616 sec


PS:

Read file <logs-C/open_mp.54.1.dat> for stderr output of this job.

