Evaluating method of middle rectangles with MPI implementation.
Integrating exp(sin(pi*cos(2pi*x))) * sin(pi*cos(pi*x)) from 0.000000 to 1.000000, sampling at 67108864 points.
================================
Computed Value: 5.151857673108e-16
  Target Value: 0
Absolute Error: 5.151857673108e-16
         WTime: 0.315149027058823 sec
================================
Computed Value: 5.151857673108e-16
  Target Value: 0
Absolute Error: 5.151857673108e-16
         WTime: 0.318342142352941 sec
================================
Computed Value: 5.151857673108e-16
  Target Value: 0
Absolute Error: 5.151857673108e-16
         WTime: 0.312250262352941 sec
================================
Computed Value: 5.151857673108e-16
  Target Value: 0
Absolute Error: 5.151857673108e-16
         WTime: 0.310956504705882 sec
