Evaluating method of middle rectangles with MPI implementation.
Integrating exp(sin(pi*cos(2pi*x))) * sin(pi*cos(pi*x)) from 0.000000 to 1.000000, sampling at 67108864 points.
================================
Computed Value: -1.52169943312686e-14
  Target Value: 0
Absolute Error: 1.52169943312686e-14
         WTime: 4.74061372823529 sec
================================
Computed Value: -1.52169943312686e-14
  Target Value: 0
Absolute Error: 1.52169943312686e-14
         WTime: 4.74059314705882 sec
================================
Computed Value: -1.52169943312686e-14
  Target Value: 0
Absolute Error: 1.52169943312686e-14
         WTime: 4.74029514705882 sec
================================
Computed Value: -1.52169943312686e-14
  Target Value: 0
Absolute Error: 1.52169943312686e-14
         WTime: 4.74030202470588 sec
