Sender: LSF System <lsfadmin@polus-c2-ib.bmc.hpc.cs.msu.ru>
Subject: Job 179404: <# this file was automaticly created by mpisubmit.pl script for edu-cmc-skpod18-320-19 #;source /polusfs/setenv/setup.SMPI;#BSUB -n 42;#BSUB -W 00:15;#BSUB -o logs-C/open_mp.42.1.out;#BSUB -e logs-C/open_mp.42.1.dat;OMP_NUM_THREADS=42 mpiexec -np 1 bin/open_mp C 1073741824 4> in cluster <MSUCluster> Done

Job <# this file was automaticly created by mpisubmit.pl script for edu-cmc-skpod18-320-19 #;source /polusfs/setenv/setup.SMPI;#BSUB -n 42;#BSUB -W 00:15;#BSUB -o logs-C/open_mp.42.1.out;#BSUB -e logs-C/open_mp.42.1.dat;OMP_NUM_THREADS=42 mpiexec -np 1 bin/open_mp C 1073741824 4> was submitted from host <polus-ib.bmc.hpc.cs.msu.ru> by user <edu-cmc-skpod18-320-19> in cluster <MSUCluster> at Sat Dec 15 21:13:47 2018
Job was executed on host(s) <7*polus-c2-ib.bmc.hpc.cs.msu.ru>, in queue <short>, as user <edu-cmc-skpod18-320-19> in cluster <MSUCluster> at Sat Dec 15 21:59:33 2018
                            <18*polus-c4-ib.bmc.hpc.cs.msu.ru>
                            <17*polus-c1-ib.bmc.hpc.cs.msu.ru>
</home_edu/edu-cmc-skpod18-320/edu-cmc-skpod18-320-19> was used as the home directory.
</home_edu/edu-cmc-skpod18-320/edu-cmc-skpod18-320-19/sc_pdp> was used as the working directory.
Started at Sat Dec 15 21:59:33 2018
Terminated at Sat Dec 15 21:59:41 2018
Results reported at Sat Dec 15 21:59:41 2018

Your job looked like:

------------------------------------------------------------
# LSBATCH: User input
# this file was automaticly created by mpisubmit.pl script for edu-cmc-skpod18-320-19 #
source /polusfs/setenv/setup.SMPI
#BSUB -n 42
#BSUB -W 00:15
#BSUB -o logs-C/open_mp.42.1.out
#BSUB -e logs-C/open_mp.42.1.dat
OMP_NUM_THREADS=42 mpiexec -np 1 bin/open_mp C 1073741824 4

------------------------------------------------------------

Successfully completed.

Resource usage summary:

    CPU time :                                   238.33 sec.
    Max Memory :                                 76 MB
    Average Memory :                             1.00 MB
    Total Requested Memory :                     -
    Delta Memory :                               -
    Max Swap :                                   -
    Max Processes :                              5
    Max Threads :                                53
    Run time :                                   9 sec.
    Turnaround time :                            2754 sec.

The output (if any) follows:

Evaluating method of middle rectangles with OpenMP implementation.
Integrating 2sqrt(1-x^2) from -1.000000 to 1.000000, sampling at 1073741824 points.
================================
Computed Value: 3.14159265358976
  Target Value: 3.14159265358979
Absolute Error: 2.93098878501041e-14
         WTime: 1.62814067211002 sec
================================
Computed Value: 3.14159265358976
  Target Value: 3.14159265358979
Absolute Error: 2.93098878501041e-14
         WTime: 1.51615223195404 sec
================================
Computed Value: 3.14159265358976
  Target Value: 3.14159265358979
Absolute Error: 2.93098878501041e-14
         WTime: 1.29174419213086 sec
================================
Computed Value: 3.14159265358976
  Target Value: 3.14159265358979
Absolute Error: 2.93098878501041e-14
         WTime: 2.14227115688846 sec


PS:

Read file <logs-C/open_mp.42.1.dat> for stderr output of this job.

Sender: LSF System <lsfadmin@polus-c1-ib.bmc.hpc.cs.msu.ru>
Subject: Job 180903: <# this file was automaticly created by mpisubmit.pl script for edu-cmc-skpod18-320-19 #;source /polusfs/setenv/setup.SMPI;#BSUB -n 42;#BSUB -W 00:15;#BSUB -o logs-C/open_mp.42.1.out;#BSUB -e logs-C/open_mp.42.1.dat;OMP_NUM_THREADS=42 mpiexec -np 1 bin/open_mp C 1073741824 4> in cluster <MSUCluster> Done

Job <# this file was automaticly created by mpisubmit.pl script for edu-cmc-skpod18-320-19 #;source /polusfs/setenv/setup.SMPI;#BSUB -n 42;#BSUB -W 00:15;#BSUB -o logs-C/open_mp.42.1.out;#BSUB -e logs-C/open_mp.42.1.dat;OMP_NUM_THREADS=42 mpiexec -np 1 bin/open_mp C 1073741824 4> was submitted from host <polus-ib.bmc.hpc.cs.msu.ru> by user <edu-cmc-skpod18-320-19> in cluster <MSUCluster> at Mon Dec 17 00:00:07 2018
Job was executed on host(s) <19*polus-c1-ib.bmc.hpc.cs.msu.ru>, in queue <short>, as user <edu-cmc-skpod18-320-19> in cluster <MSUCluster> at Mon Dec 17 01:38:22 2018
                            <10*polus-c3-ib.bmc.hpc.cs.msu.ru>
                            <13*polus-c4-ib.bmc.hpc.cs.msu.ru>
</home_edu/edu-cmc-skpod18-320/edu-cmc-skpod18-320-19> was used as the home directory.
</home_edu/edu-cmc-skpod18-320/edu-cmc-skpod18-320-19/sc_pdp> was used as the working directory.
Started at Mon Dec 17 01:38:22 2018
Terminated at Mon Dec 17 01:38:27 2018
Results reported at Mon Dec 17 01:38:27 2018

Your job looked like:

------------------------------------------------------------
# LSBATCH: User input
# this file was automaticly created by mpisubmit.pl script for edu-cmc-skpod18-320-19 #
source /polusfs/setenv/setup.SMPI
#BSUB -n 42
#BSUB -W 00:15
#BSUB -o logs-C/open_mp.42.1.out
#BSUB -e logs-C/open_mp.42.1.dat
OMP_NUM_THREADS=42 mpiexec -np 1 bin/open_mp C 1073741824 4

------------------------------------------------------------

Successfully completed.

Resource usage summary:

    CPU time :                                   149.27 sec.
    Max Memory :                                 76 MB
    Average Memory :                             1.00 MB
    Total Requested Memory :                     -
    Delta Memory :                               -
    Max Swap :                                   -
    Max Processes :                              5
    Max Threads :                                53
    Run time :                                   5 sec.
    Turnaround time :                            5900 sec.

The output (if any) follows:

Evaluating method of middle rectangles with OpenMP implementation.
Integrating 2sqrt(1-x^2) from -1.000000 to 1.000000, sampling at 1073741824 points.
================================
Computed Value: 3.14159265358976
  Target Value: 3.14159265358979
Absolute Error: 2.93098878501041e-14
         WTime: 0.962214227009099 sec
================================
Computed Value: 3.14159265358976
  Target Value: 3.14159265358979
Absolute Error: 2.93098878501041e-14
         WTime: 0.950664124975447 sec
================================
Computed Value: 3.14159265358976
  Target Value: 3.14159265358979
Absolute Error: 2.93098878501041e-14
         WTime: 0.951980714045931 sec
================================
Computed Value: 3.14159265358976
  Target Value: 3.14159265358979
Absolute Error: 2.93098878501041e-14
         WTime: 0.951039416017011 sec


PS:

Read file <logs-C/open_mp.42.1.dat> for stderr output of this job.

