Evaluating method of middle rectangles with MPI implementation.
Integrating exp(sin(pi*cos(2pi*x))) * sin(pi*cos(pi*x)) from 0.000000 to 1.000000, sampling at 67108864 points.
================================
Computed Value: 1.08679341567774e-14
  Target Value: 0
Absolute Error: 1.08679341567774e-14
         WTime: 1.92971213529412 sec
================================
Computed Value: 1.08679341567774e-14
  Target Value: 0
Absolute Error: 1.08679341567774e-14
         WTime: 1.92968182235294 sec
================================
Computed Value: 1.08679341567774e-14
  Target Value: 0
Absolute Error: 1.08679341567774e-14
         WTime: 1.92968165294118 sec
================================
Computed Value: 1.08679341567774e-14
  Target Value: 0
Absolute Error: 1.08679341567774e-14
         WTime: 1.92967993529412 sec
