[4.26588734897086, 4.31899667903781, 4.09503149194643, 4.22024144197349, ] # times
[6.24500451351651e-15, 6.24500451351651e-15, 6.24500451351651e-15, 6.24500451351651e-15, ] # errors
[12.9367004819214, 12.5628526723012, 13.1799417263828, 13.3088310630992, ] # times
[6.21724893790088e-15, 6.21724893790088e-15, 6.21724893790088e-15, 6.21724893790088e-15, ] # errors
