[2.13870911672711, 1.79874037904665, 1.83208571420982, 1.84712923178449, ] # times
[2.1582735598713e-13, 2.1582735598713e-13, 2.1582735598713e-13, 2.1582735598713e-13, ] # errors
[0.886461101938039, 0.880272389855236, 0.880057596601546, 0.880949065089226, ] # times
[2.1582735598713e-13, 2.1582735598713e-13, 2.1582735598713e-13, 2.1582735598713e-13, ] # errors
