Sender: LSF System <lsfadmin@polus-c4-ib.bmc.hpc.cs.msu.ru>
Subject: Job 176729: <# this file was automaticly created by mpisubmit.pl script for edu-cmc-skpod18-320-19 #;source /polusfs/setenv/setup.SMPI;#BSUB -n 12;#BSUB -W 00:15;#BSUB -o logs-C/mpi.1.12.out;#BSUB -e logs-C/mpi.1.12.dat;OMP_NUM_THREADS=1 mpiexec bin/mpi C 1073741824 4> in cluster <MSUCluster> Done

Job <# this file was automaticly created by mpisubmit.pl script for edu-cmc-skpod18-320-19 #;source /polusfs/setenv/setup.SMPI;#BSUB -n 12;#BSUB -W 00:15;#BSUB -o logs-C/mpi.1.12.out;#BSUB -e logs-C/mpi.1.12.dat;OMP_NUM_THREADS=1 mpiexec bin/mpi C 1073741824 4> was submitted from host <polus-ib.bmc.hpc.cs.msu.ru> by user <edu-cmc-skpod18-320-19> in cluster <MSUCluster> at Sat Dec 15 13:45:02 2018
Job was executed on host(s) <12*polus-c4-ib.bmc.hpc.cs.msu.ru>, in queue <short>, as user <edu-cmc-skpod18-320-19> in cluster <MSUCluster> at Sat Dec 15 13:45:17 2018
</home_edu/edu-cmc-skpod18-320/edu-cmc-skpod18-320-19> was used as the home directory.
</home_edu/edu-cmc-skpod18-320/edu-cmc-skpod18-320-19/sc_pdp> was used as the working directory.
Started at Sat Dec 15 13:45:17 2018
Terminated at Sat Dec 15 13:45:21 2018
Results reported at Sat Dec 15 13:45:21 2018

Your job looked like:

------------------------------------------------------------
# LSBATCH: User input
# this file was automaticly created by mpisubmit.pl script for edu-cmc-skpod18-320-19 #
source /polusfs/setenv/setup.SMPI
#BSUB -n 12
#BSUB -W 00:15
#BSUB -o logs-C/mpi.1.12.out
#BSUB -e logs-C/mpi.1.12.dat
OMP_NUM_THREADS=1 mpiexec bin/mpi C 1073741824 4

------------------------------------------------------------

Successfully completed.

Resource usage summary:

    CPU time :                                   31.68 sec.
    Max Memory :                                 645 MB
    Average Memory :                             1.00 MB
    Total Requested Memory :                     -
    Delta Memory :                               -
    Max Swap :                                   -
    Max Processes :                              16
    Max Threads :                                45
    Run time :                                   3 sec.
    Turnaround time :                            19 sec.

The output (if any) follows:

Evaluating method of middle rectangles with MPI implementation.
Integrating 2sqrt(1-x^2) from -1.000000 to 1.000000, sampling at 1073741824 points.
================================
Computed Value: 3.14159267699681
  Target Value: 3.14159265358979
Absolute Error: 2.34070149929266e-08
         WTime: 0.658683505374938 sec
================================
Computed Value: 3.14159267699681
  Target Value: 3.14159265358979
Absolute Error: 2.34070149929266e-08
         WTime: 0.648008792195469 sec
================================
Computed Value: 3.14159267699681
  Target Value: 3.14159265358979
Absolute Error: 2.34070149929266e-08
         WTime: 0.627352238632739 sec
================================
Computed Value: 3.14159267699681
  Target Value: 3.14159265358979
Absolute Error: 2.34070149929266e-08
         WTime: 0.629587039817125 sec


PS:

Read file <logs-C/mpi.1.12.dat> for stderr output of this job.

Sender: LSF System <lsfadmin@polus-c4-ib.bmc.hpc.cs.msu.ru>
Subject: Job 180854: <# this file was automaticly created by mpisubmit.pl script for edu-cmc-skpod18-320-19 #;source /polusfs/setenv/setup.SMPI;#BSUB -n 12;#BSUB -W 00:15;#BSUB -o logs-C/mpi.1.12.out;#BSUB -e logs-C/mpi.1.12.dat;OMP_NUM_THREADS=1 mpiexec -np 12 bin/mpi C 1073741824 4> in cluster <MSUCluster> Done

Job <# this file was automaticly created by mpisubmit.pl script for edu-cmc-skpod18-320-19 #;source /polusfs/setenv/setup.SMPI;#BSUB -n 12;#BSUB -W 00:15;#BSUB -o logs-C/mpi.1.12.out;#BSUB -e logs-C/mpi.1.12.dat;OMP_NUM_THREADS=1 mpiexec -np 12 bin/mpi C 1073741824 4> was submitted from host <polus-ib.bmc.hpc.cs.msu.ru> by user <edu-cmc-skpod18-320-19> in cluster <MSUCluster> at Sun Dec 16 23:59:41 2018
Job was executed on host(s) <10*polus-c4-ib.bmc.hpc.cs.msu.ru>, in queue <short>, as user <edu-cmc-skpod18-320-19> in cluster <MSUCluster> at Sun Dec 16 23:59:51 2018
                            <2*polus-c3-ib.bmc.hpc.cs.msu.ru>
</home_edu/edu-cmc-skpod18-320/edu-cmc-skpod18-320-19> was used as the home directory.
</home_edu/edu-cmc-skpod18-320/edu-cmc-skpod18-320-19/sc_pdp> was used as the working directory.
Started at Sun Dec 16 23:59:51 2018
Terminated at Sun Dec 16 23:59:56 2018
Results reported at Sun Dec 16 23:59:56 2018

Your job looked like:

------------------------------------------------------------
# LSBATCH: User input
# this file was automaticly created by mpisubmit.pl script for edu-cmc-skpod18-320-19 #
source /polusfs/setenv/setup.SMPI
#BSUB -n 12
#BSUB -W 00:15
#BSUB -o logs-C/mpi.1.12.out
#BSUB -e logs-C/mpi.1.12.dat
OMP_NUM_THREADS=1 mpiexec -np 12 bin/mpi C 1073741824 4

------------------------------------------------------------

Successfully completed.

Resource usage summary:

    CPU time :                                   42.83 sec.
    Max Memory :                                 541 MB
    Average Memory :                             1.00 MB
    Total Requested Memory :                     -
    Delta Memory :                               -
    Max Swap :                                   -
    Max Processes :                              14
    Max Threads :                                39
    Run time :                                   5 sec.
    Turnaround time :                            15 sec.

The output (if any) follows:

Evaluating method of middle rectangles with MPI implementation.
Integrating 2sqrt(1-x^2) from -1.000000 to 1.000000, sampling at 1073741824 points.
================================
Computed Value: 3.14159267699681
  Target Value: 3.14159265358979
Absolute Error: 2.34070149929266e-08
         WTime: 0.7507547698915 sec
================================
Computed Value: 3.14159267699681
  Target Value: 3.14159265358979
Absolute Error: 2.34070149929266e-08
         WTime: 1.10313866799697 sec
================================
Computed Value: 3.14159267699681
  Target Value: 3.14159265358979
Absolute Error: 2.34070149929266e-08
         WTime: 0.740205383859575 sec
================================
Computed Value: 3.14159267699681
  Target Value: 3.14159265358979
Absolute Error: 2.34070149929266e-08
         WTime: 0.873663526959717 sec


PS:

Read file <logs-C/mpi.1.12.dat> for stderr output of this job.

