[2.53389816102572, 2.71547057596035, 2.70902493107133, 2.2808092830237, ] # times
[7.9658502016855e-15, 7.9658502016855e-15, 7.9658502016855e-15, 7.9658502016855e-15, ] # errors
[1.53372019389644, 1.51347005786374, 1.47246094886214, 1.56486322591081, ] # times
[8.02136135291676e-15, 8.02136135291676e-15, 8.02136135291676e-15, 8.02136135291676e-15, ] # errors
