Evaluating method of middle rectangles with MPI implementation.
Integrating exp(sin(pi*cos(2pi*x))) * sin(pi*cos(pi*x)) from 0.000000 to 1.000000, sampling at 67108864 points.
================================
Computed Value: 8.12627236560439e-16
  Target Value: 0
Absolute Error: 8.12627236560439e-16
         WTime: 0.120949610588235 sec
================================
Computed Value: 8.12627236560439e-16
  Target Value: 0
Absolute Error: 8.12627236560439e-16
         WTime: 0.120929991764706 sec
================================
Computed Value: 8.12627236560439e-16
  Target Value: 0
Absolute Error: 8.12627236560439e-16
         WTime: 0.120930314117647 sec
================================
Computed Value: 8.12627236560439e-16
  Target Value: 0
Absolute Error: 8.12627236560439e-16
         WTime: 0.120929777647059 sec
