Sender: LSF System <lsfadmin@polus-c1-ib.bmc.hpc.cs.msu.ru>
Subject: Job 178019: <# this file was automaticly created by mpisubmit.pl script for edu-cmc-skpod18-320-19 #;source /polusfs/setenv/setup.SMPI;#BSUB -n 42;#BSUB -W 00:15;#BSUB -o logs-M/mpi.1.42.out;#BSUB -e logs-M/mpi.1.42.dat;OMP_NUM_THREADS=1 mpiexec bin/mpi M 1073741824 4> in cluster <MSUCluster> Done

Job <# this file was automaticly created by mpisubmit.pl script for edu-cmc-skpod18-320-19 #;source /polusfs/setenv/setup.SMPI;#BSUB -n 42;#BSUB -W 00:15;#BSUB -o logs-M/mpi.1.42.out;#BSUB -e logs-M/mpi.1.42.dat;OMP_NUM_THREADS=1 mpiexec bin/mpi M 1073741824 4> was submitted from host <polus-ib.bmc.hpc.cs.msu.ru> by user <edu-cmc-skpod18-320-19> in cluster <MSUCluster> at Sat Dec 15 15:27:35 2018
Job was executed on host(s) <18*polus-c1-ib.bmc.hpc.cs.msu.ru>, in queue <short>, as user <edu-cmc-skpod18-320-19> in cluster <MSUCluster> at Sat Dec 15 15:35:36 2018
                            <20*polus-c3-ib.bmc.hpc.cs.msu.ru>
                            <4*polus-c4-ib.bmc.hpc.cs.msu.ru>
</home_edu/edu-cmc-skpod18-320/edu-cmc-skpod18-320-19> was used as the home directory.
</home_edu/edu-cmc-skpod18-320/edu-cmc-skpod18-320-19/sc_pdp> was used as the working directory.
Started at Sat Dec 15 15:35:36 2018
Terminated at Sat Dec 15 15:35:57 2018
Results reported at Sat Dec 15 15:35:57 2018

Your job looked like:

------------------------------------------------------------
# LSBATCH: User input
# this file was automaticly created by mpisubmit.pl script for edu-cmc-skpod18-320-19 #
source /polusfs/setenv/setup.SMPI
#BSUB -n 42
#BSUB -W 00:15
#BSUB -o logs-M/mpi.1.42.out
#BSUB -e logs-M/mpi.1.42.dat
OMP_NUM_THREADS=1 mpiexec bin/mpi M 1073741824 4

------------------------------------------------------------

Successfully completed.

Resource usage summary:

    CPU time :                                   820.24 sec.
    Max Memory :                                 979 MB
    Average Memory :                             653.00 MB
    Total Requested Memory :                     -
    Delta Memory :                               -
    Max Swap :                                   -
    Max Processes :                              22
    Max Threads :                                63
    Run time :                                   22 sec.
    Turnaround time :                            502 sec.

The output (if any) follows:

Evaluating method of middle rectangles with MPI implementation.
Integrating exp(sin(pi*cos(2pi*x))) * sin(pi*cos(pi*x)) from 0.000000 to 1.000000, sampling at 1073741824 points.
================================
Computed Value: 2.07889261361061e-14
  Target Value: 0
Absolute Error: 2.07889261361061e-14
         WTime: 4.87809348799055 sec
================================
Computed Value: 2.07889261361061e-14
  Target Value: 0
Absolute Error: 2.07889261361061e-14
         WTime: 4.84130316000665 sec
================================
Computed Value: 2.07889261361061e-14
  Target Value: 0
Absolute Error: 2.07889261361061e-14
         WTime: 4.84850473003462 sec
================================
Computed Value: 2.07889261361061e-14
  Target Value: 0
Absolute Error: 2.07889261361061e-14
         WTime: 4.8569056050037 sec


PS:

Read file <logs-M/mpi.1.42.dat> for stderr output of this job.

Sender: LSF System <lsfadmin@polus-c4-ib.bmc.hpc.cs.msu.ru>
Subject: Job 180938: <# this file was automaticly created by mpisubmit.pl script for edu-cmc-skpod18-320-19 #;source /polusfs/setenv/setup.SMPI;#BSUB -n 42;#BSUB -W 00:15;#BSUB -o logs-M/mpi.1.42.out;#BSUB -e logs-M/mpi.1.42.dat;OMP_NUM_THREADS=1 mpiexec -np 42 bin/mpi M 1073741824 4> in cluster <MSUCluster> Done

Job <# this file was automaticly created by mpisubmit.pl script for edu-cmc-skpod18-320-19 #;source /polusfs/setenv/setup.SMPI;#BSUB -n 42;#BSUB -W 00:15;#BSUB -o logs-M/mpi.1.42.out;#BSUB -e logs-M/mpi.1.42.dat;OMP_NUM_THREADS=1 mpiexec -np 42 bin/mpi M 1073741824 4> was submitted from host <polus-ib.bmc.hpc.cs.msu.ru> by user <edu-cmc-skpod18-320-19> in cluster <MSUCluster> at Mon Dec 17 00:00:15 2018
Job was executed on host(s) <16*polus-c4-ib.bmc.hpc.cs.msu.ru>, in queue <short>, as user <edu-cmc-skpod18-320-19> in cluster <MSUCluster> at Mon Dec 17 01:42:43 2018
                            <18*polus-c1-ib.bmc.hpc.cs.msu.ru>
                            <8*polus-c3-ib.bmc.hpc.cs.msu.ru>
</home_edu/edu-cmc-skpod18-320/edu-cmc-skpod18-320-19> was used as the home directory.
</home_edu/edu-cmc-skpod18-320/edu-cmc-skpod18-320-19/sc_pdp> was used as the working directory.
Started at Mon Dec 17 01:42:43 2018
Terminated at Mon Dec 17 01:42:54 2018
Results reported at Mon Dec 17 01:42:54 2018

Your job looked like:

------------------------------------------------------------
# LSBATCH: User input
# this file was automaticly created by mpisubmit.pl script for edu-cmc-skpod18-320-19 #
source /polusfs/setenv/setup.SMPI
#BSUB -n 42
#BSUB -W 00:15
#BSUB -o logs-M/mpi.1.42.out
#BSUB -e logs-M/mpi.1.42.dat
OMP_NUM_THREADS=1 mpiexec -np 42 bin/mpi M 1073741824 4

------------------------------------------------------------

Successfully completed.

Resource usage summary:

    CPU time :                                   370.07 sec.
    Max Memory :                                 873 MB
    Average Memory :                             445.50 MB
    Total Requested Memory :                     -
    Delta Memory :                               -
    Max Swap :                                   -
    Max Processes :                              20
    Max Threads :                                57
    Run time :                                   12 sec.
    Turnaround time :                            6159 sec.

The output (if any) follows:

Evaluating method of middle rectangles with MPI implementation.
Integrating exp(sin(pi*cos(2pi*x))) * sin(pi*cos(pi*x)) from 0.000000 to 1.000000, sampling at 1073741824 points.
================================
Computed Value: 2.07889261361061e-14
  Target Value: 0
Absolute Error: 2.07889261361061e-14
         WTime: 2.13524380000308 sec
================================
Computed Value: 2.07889261361061e-14
  Target Value: 0
Absolute Error: 2.07889261361061e-14
         WTime: 2.30248208576813 sec
================================
Computed Value: 2.07889261361061e-14
  Target Value: 0
Absolute Error: 2.07889261361061e-14
         WTime: 2.1525293388404 sec
================================
Computed Value: 2.07889261361061e-14
  Target Value: 0
Absolute Error: 2.07889261361061e-14
         WTime: 2.07777967816219 sec


PS:

Read file <logs-M/mpi.1.42.dat> for stderr output of this job.

