Evaluating method of middle rectangles with MPI implementation.
Integrating 2sqrt(1-x^2) from -1.000000 to 1.000000, sampling at 67108864 points.
================================
Computed Value: 3.14159433887318
  Target Value: 3.14159265358979
Absolute Error: 1.6852833821801e-06
         WTime: 0.155227474117647 sec
================================
Computed Value: 3.14159433887318
  Target Value: 3.14159265358979
Absolute Error: 1.6852833821801e-06
         WTime: 0.15521514 sec
================================
Computed Value: 3.14159433887318
  Target Value: 3.14159265358979
Absolute Error: 1.6852833821801e-06
         WTime: 0.155214732941176 sec
================================
Computed Value: 3.14159433887318
  Target Value: 3.14159265358979
Absolute Error: 1.6852833821801e-06
         WTime: 0.155214615294118 sec
