Evaluating method of middle rectangles with OpenMP implementation.
Integrating 2sqrt(1-x^2) from -1.000000 to 1.000000, sampling at 67108864 points.
================================
Computed Value: 3.14159265359147
  Target Value: 3.14159265358979
Absolute Error: 1.67643676718399e-12
         WTime: 9.94793294235294 sec
================================
Computed Value: 3.14159265359147
  Target Value: 3.14159265358979
Absolute Error: 1.67643676718399e-12
         WTime: 9.94790581882353 sec
================================
Computed Value: 3.14159265359147
  Target Value: 3.14159265358979
Absolute Error: 1.67643676718399e-12
         WTime: 9.94790444235294 sec
================================
Computed Value: 3.14159265359147
  Target Value: 3.14159265358979
Absolute Error: 1.67643676718399e-12
         WTime: 9.94790413882353 sec
