Evaluating method of middle rectangles with MPI implementation.
Integrating exp(sin(pi*cos(2pi*x))) * sin(pi*cos(pi*x)) from 0.000000 to 1.000000, sampling at 67108864 points.
================================
Computed Value: -4.10980386007787e-15
  Target Value: 0
Absolute Error: 4.10980386007787e-15
         WTime: 0.967218655294118 sec
================================
Computed Value: -4.10980386007787e-15
  Target Value: 0
Absolute Error: 4.10980386007787e-15
         WTime: 0.967197747058824 sec
================================
Computed Value: -4.10980386007787e-15
  Target Value: 0
Absolute Error: 4.10980386007787e-15
         WTime: 0.967197605882353 sec
================================
Computed Value: -4.10980386007787e-15
  Target Value: 0
Absolute Error: 4.10980386007787e-15
         WTime: 0.967191777647059 sec
