Evaluating method of middle rectangles with MPI implementation.
Integrating exp(sin(pi*cos(2pi*x))) * sin(pi*cos(pi*x)) from 0.000000 to 1.000000, sampling at 67108864 points.
================================
Computed Value: 1.1837861420283e-15
  Target Value: 0
Absolute Error: 1.1837861420283e-15
         WTime: 1.20900806 sec
================================
Computed Value: 1.1837861420283e-15
  Target Value: 0
Absolute Error: 1.1837861420283e-15
         WTime: 1.20898717764706 sec
================================
Computed Value: 1.1837861420283e-15
  Target Value: 0
Absolute Error: 1.1837861420283e-15
         WTime: 1.20898685058823 sec
================================
Computed Value: 1.1837861420283e-15
  Target Value: 0
Absolute Error: 1.1837861420283e-15
         WTime: 1.20898715176471 sec
