Sender: LSF System <lsfadmin@polus-c1-ib.bmc.hpc.cs.msu.ru>
Subject: Job 178143: <# this file was automaticly created by mpisubmit.pl script for edu-cmc-skpod18-320-19 #;source /polusfs/setenv/setup.SMPI;#BSUB -n 62;#BSUB -W 00:15;#BSUB -o logs-M/mpi.1.62.out;#BSUB -e logs-M/mpi.1.62.dat;OMP_NUM_THREADS=1 mpiexec bin/mpi M 1073741824 4> in cluster <MSUCluster> Done

Job <# this file was automaticly created by mpisubmit.pl script for edu-cmc-skpod18-320-19 #;source /polusfs/setenv/setup.SMPI;#BSUB -n 62;#BSUB -W 00:15;#BSUB -o logs-M/mpi.1.62.out;#BSUB -e logs-M/mpi.1.62.dat;OMP_NUM_THREADS=1 mpiexec bin/mpi M 1073741824 4> was submitted from host <polus-ib.bmc.hpc.cs.msu.ru> by user <edu-cmc-skpod18-320-19> in cluster <MSUCluster> at Sat Dec 15 15:57:36 2018
Job was executed on host(s) <20*polus-c1-ib.bmc.hpc.cs.msu.ru>, in queue <short>, as user <edu-cmc-skpod18-320-19> in cluster <MSUCluster> at Sat Dec 15 16:21:49 2018
                            <20*polus-c3-ib.bmc.hpc.cs.msu.ru>
                            <20*polus-c2-ib.bmc.hpc.cs.msu.ru>
                            <2*polus-c4-ib.bmc.hpc.cs.msu.ru>
</home_edu/edu-cmc-skpod18-320/edu-cmc-skpod18-320-19> was used as the home directory.
</home_edu/edu-cmc-skpod18-320/edu-cmc-skpod18-320-19/sc_pdp> was used as the working directory.
Started at Sat Dec 15 16:21:49 2018
Terminated at Sat Dec 15 16:21:57 2018
Results reported at Sat Dec 15 16:21:57 2018

Your job looked like:

------------------------------------------------------------
# LSBATCH: User input
# this file was automaticly created by mpisubmit.pl script for edu-cmc-skpod18-320-19 #
source /polusfs/setenv/setup.SMPI
#BSUB -n 62
#BSUB -W 00:15
#BSUB -o logs-M/mpi.1.62.out
#BSUB -e logs-M/mpi.1.62.dat
OMP_NUM_THREADS=1 mpiexec bin/mpi M 1073741824 4

------------------------------------------------------------

Successfully completed.

Resource usage summary:

    CPU time :                                   356.78 sec.
    Max Memory :                                 1069 MB
    Average Memory :                             1.00 MB
    Total Requested Memory :                     -
    Delta Memory :                               -
    Max Swap :                                   -
    Max Processes :                              24
    Max Threads :                                69
    Run time :                                   8 sec.
    Turnaround time :                            1461 sec.

The output (if any) follows:

Evaluating method of middle rectangles with MPI implementation.
Integrating exp(sin(pi*cos(2pi*x))) * sin(pi*cos(pi*x)) from 0.000000 to 1.000000, sampling at 1073741824 points.
================================
Computed Value: 3.36048463361882e-15
  Target Value: 0
Absolute Error: 3.36048463361882e-15
         WTime: 1.49385213799542 sec
================================
Computed Value: 3.36048463361882e-15
  Target Value: 0
Absolute Error: 3.36048463361882e-15
         WTime: 1.35545825900044 sec
================================
Computed Value: 3.36048463361882e-15
  Target Value: 0
Absolute Error: 3.36048463361882e-15
         WTime: 1.30357761995401 sec
================================
Computed Value: 3.36048463361882e-15
  Target Value: 0
Absolute Error: 3.36048463361882e-15
         WTime: 1.30301445699297 sec


PS:

Read file <logs-M/mpi.1.62.dat> for stderr output of this job.

Sender: LSF System <lsfadmin@polus-c2-ib.bmc.hpc.cs.msu.ru>
Subject: Job 180948: <# this file was automaticly created by mpisubmit.pl script for edu-cmc-skpod18-320-19 #;source /polusfs/setenv/setup.SMPI;#BSUB -n 62;#BSUB -W 00:15;#BSUB -o logs-M/mpi.1.62.out;#BSUB -e logs-M/mpi.1.62.dat;OMP_NUM_THREADS=1 mpiexec -np 62 bin/mpi M 1073741824 4> in cluster <MSUCluster> Done

Job <# this file was automaticly created by mpisubmit.pl script for edu-cmc-skpod18-320-19 #;source /polusfs/setenv/setup.SMPI;#BSUB -n 62;#BSUB -W 00:15;#BSUB -o logs-M/mpi.1.62.out;#BSUB -e logs-M/mpi.1.62.dat;OMP_NUM_THREADS=1 mpiexec -np 62 bin/mpi M 1073741824 4> was submitted from host <polus-ib.bmc.hpc.cs.msu.ru> by user <edu-cmc-skpod18-320-19> in cluster <MSUCluster> at Mon Dec 17 00:00:17 2018
Job was executed on host(s) <18*polus-c2-ib.bmc.hpc.cs.msu.ru>, in queue <short>, as user <edu-cmc-skpod18-320-19> in cluster <MSUCluster> at Mon Dec 17 11:42:43 2018
                            <18*polus-c1-ib.bmc.hpc.cs.msu.ru>
                            <18*polus-c4-ib.bmc.hpc.cs.msu.ru>
                            <8*polus-c3-ib.bmc.hpc.cs.msu.ru>
</home_edu/edu-cmc-skpod18-320/edu-cmc-skpod18-320-19> was used as the home directory.
</home_edu/edu-cmc-skpod18-320/edu-cmc-skpod18-320-19/sc_pdp> was used as the working directory.
Started at Mon Dec 17 11:42:43 2018
Terminated at Mon Dec 17 11:42:50 2018
Results reported at Mon Dec 17 11:42:50 2018

Your job looked like:

------------------------------------------------------------
# LSBATCH: User input
# this file was automaticly created by mpisubmit.pl script for edu-cmc-skpod18-320-19 #
source /polusfs/setenv/setup.SMPI
#BSUB -n 62
#BSUB -W 00:15
#BSUB -o logs-M/mpi.1.62.out
#BSUB -e logs-M/mpi.1.62.dat
OMP_NUM_THREADS=1 mpiexec -np 62 bin/mpi M 1073741824 4

------------------------------------------------------------

Successfully completed.

Resource usage summary:

    CPU time :                                   369.20 sec.
    Max Memory :                                 992 MB
    Average Memory :                             1.00 MB
    Total Requested Memory :                     -
    Delta Memory :                               -
    Max Swap :                                   -
    Max Processes :                              22
    Max Threads :                                63
    Run time :                                   7 sec.
    Turnaround time :                            42153 sec.

The output (if any) follows:

Evaluating method of middle rectangles with MPI implementation.
Integrating exp(sin(pi*cos(2pi*x))) * sin(pi*cos(pi*x)) from 0.000000 to 1.000000, sampling at 1073741824 points.
================================
Computed Value: 3.33413852082742e-15
  Target Value: 0
Absolute Error: 3.33413852082742e-15
         WTime: 1.4125571269542 sec
================================
Computed Value: 3.33413852082742e-15
  Target Value: 0
Absolute Error: 3.33413852082742e-15
         WTime: 1.41341940779239 sec
================================
Computed Value: 3.33413852082742e-15
  Target Value: 0
Absolute Error: 3.33413852082742e-15
         WTime: 1.50331163685769 sec
================================
Computed Value: 3.33413852082742e-15
  Target Value: 0
Absolute Error: 3.33413852082742e-15
         WTime: 1.44828682113439 sec


PS:

Read file <logs-M/mpi.1.62.dat> for stderr output of this job.

