Evaluating method of middle rectangles with MPI implementation.
Integrating exp(sin(pi*cos(2pi*x))) * sin(pi*cos(pi*x)) from 0.000000 to 1.000000, sampling at 67108864 points.
================================
Computed Value: -1.22713521039107e-16
  Target Value: 0
Absolute Error: 1.22713521039107e-16
         WTime: 0.0864062764705882 sec
================================
Computed Value: -1.22713521039107e-16
  Target Value: 0
Absolute Error: 1.22713521039107e-16
         WTime: 0.0863860552941176 sec
================================
Computed Value: -1.22713521039107e-16
  Target Value: 0
Absolute Error: 1.22713521039107e-16
         WTime: 0.0863843376470588 sec
================================
Computed Value: -1.22713521039107e-16
  Target Value: 0
Absolute Error: 1.22713521039107e-16
         WTime: 0.0863852858823529 sec
