Evaluating method of middle rectangles with MPI implementation.
Integrating 2sqrt(1-x^2) from -1.000000 to 1.000000, sampling at 67108864 points.
================================
Computed Value: 3.14159387073941
  Target Value: 3.14159265358979
Absolute Error: 1.21714961709429e-06
         WTime: 0.300062834117647 sec
================================
Computed Value: 3.14159387073941
  Target Value: 3.14159265358979
Absolute Error: 1.21714961709429e-06
         WTime: 0.300049309411765 sec
================================
Computed Value: 3.14159387073941
  Target Value: 3.14159265358979
Absolute Error: 1.21714961709429e-06
         WTime: 0.300050511764706 sec
================================
Computed Value: 3.14159387073941
  Target Value: 3.14159265358979
Absolute Error: 1.21714961709429e-06
         WTime: 0.300048241176471 sec
