Sender: LSF System <lsfadmin@polus-c4-ib.bmc.hpc.cs.msu.ru>
Subject: Job 179385: <# this file was automaticly created by mpisubmit.pl script for edu-cmc-skpod18-320-19 #;source /polusfs/setenv/setup.SMPI;#BSUB -n 4;#BSUB -W 00:15;#BSUB -o logs-C/open_mp.4.1.out;#BSUB -e logs-C/open_mp.4.1.dat;OMP_NUM_THREADS=4 mpiexec -np 1 bin/open_mp C 1073741824 4> in cluster <MSUCluster> Done

Job <# this file was automaticly created by mpisubmit.pl script for edu-cmc-skpod18-320-19 #;source /polusfs/setenv/setup.SMPI;#BSUB -n 4;#BSUB -W 00:15;#BSUB -o logs-C/open_mp.4.1.out;#BSUB -e logs-C/open_mp.4.1.dat;OMP_NUM_THREADS=4 mpiexec -np 1 bin/open_mp C 1073741824 4> was submitted from host <polus-ib.bmc.hpc.cs.msu.ru> by user <edu-cmc-skpod18-320-19> in cluster <MSUCluster> at Sat Dec 15 21:13:36 2018
Job was executed on host(s) <4*polus-c4-ib.bmc.hpc.cs.msu.ru>, in queue <short>, as user <edu-cmc-skpod18-320-19> in cluster <MSUCluster> at Sat Dec 15 21:13:36 2018
</home_edu/edu-cmc-skpod18-320/edu-cmc-skpod18-320-19> was used as the home directory.
</home_edu/edu-cmc-skpod18-320/edu-cmc-skpod18-320-19/sc_pdp> was used as the working directory.
Started at Sat Dec 15 21:13:36 2018
Terminated at Sat Dec 15 21:15:06 2018
Results reported at Sat Dec 15 21:15:06 2018

Your job looked like:

------------------------------------------------------------
# LSBATCH: User input
# this file was automaticly created by mpisubmit.pl script for edu-cmc-skpod18-320-19 #
source /polusfs/setenv/setup.SMPI
#BSUB -n 4
#BSUB -W 00:15
#BSUB -o logs-C/open_mp.4.1.out
#BSUB -e logs-C/open_mp.4.1.dat
OMP_NUM_THREADS=4 mpiexec -np 1 bin/open_mp C 1073741824 4

------------------------------------------------------------

Successfully completed.

Resource usage summary:

    CPU time :                                   132.79 sec.
    Max Memory :                                 70 MB
    Average Memory :                             64.69 MB
    Total Requested Memory :                     -
    Delta Memory :                               -
    Max Swap :                                   -
    Max Processes :                              5
    Max Threads :                                15
    Run time :                                   90 sec.
    Turnaround time :                            90 sec.

The output (if any) follows:

Evaluating method of middle rectangles with OpenMP implementation.
Integrating 2sqrt(1-x^2) from -1.000000 to 1.000000, sampling at 1073741824 points.
================================
Computed Value: 3.14159265359064
  Target Value: 3.14159265358979
Absolute Error: 8.45101766344669e-13
         WTime: 15.0235950020142 sec
================================
Computed Value: 3.14159265359064
  Target Value: 3.14159265358979
Absolute Error: 8.45101766344669e-13
         WTime: 20.1031772550195 sec
================================
Computed Value: 3.14159265359064
  Target Value: 3.14159265358979
Absolute Error: 8.45101766344669e-13
         WTime: 27.0485782441683 sec
================================
Computed Value: 3.14159265359064
  Target Value: 3.14159265358979
Absolute Error: 8.45101766344669e-13
         WTime: 26.4261175012216 sec


PS:

Read file <logs-C/open_mp.4.1.dat> for stderr output of this job.

Sender: LSF System <lsfadmin@polus-c3-ib.bmc.hpc.cs.msu.ru>
Subject: Job 180884: <# this file was automaticly created by mpisubmit.pl script for edu-cmc-skpod18-320-19 #;source /polusfs/setenv/setup.SMPI;#BSUB -n 4;#BSUB -W 00:15;#BSUB -o logs-C/open_mp.4.1.out;#BSUB -e logs-C/open_mp.4.1.dat;OMP_NUM_THREADS=4 mpiexec -np 1 bin/open_mp C 1073741824 4> in cluster <MSUCluster> Done

Job <# this file was automaticly created by mpisubmit.pl script for edu-cmc-skpod18-320-19 #;source /polusfs/setenv/setup.SMPI;#BSUB -n 4;#BSUB -W 00:15;#BSUB -o logs-C/open_mp.4.1.out;#BSUB -e logs-C/open_mp.4.1.dat;OMP_NUM_THREADS=4 mpiexec -np 1 bin/open_mp C 1073741824 4> was submitted from host <polus-ib.bmc.hpc.cs.msu.ru> by user <edu-cmc-skpod18-320-19> in cluster <MSUCluster> at Sun Dec 16 23:59:56 2018
Job was executed on host(s) <4*polus-c3-ib.bmc.hpc.cs.msu.ru>, in queue <short>, as user <edu-cmc-skpod18-320-19> in cluster <MSUCluster> at Sun Dec 16 23:59:57 2018
</home_edu/edu-cmc-skpod18-320/edu-cmc-skpod18-320-19> was used as the home directory.
</home_edu/edu-cmc-skpod18-320/edu-cmc-skpod18-320-19/sc_pdp> was used as the working directory.
Started at Sun Dec 16 23:59:57 2018
Terminated at Mon Dec 17 00:00:53 2018
Results reported at Mon Dec 17 00:00:53 2018

Your job looked like:

------------------------------------------------------------
# LSBATCH: User input
# this file was automaticly created by mpisubmit.pl script for edu-cmc-skpod18-320-19 #
source /polusfs/setenv/setup.SMPI
#BSUB -n 4
#BSUB -W 00:15
#BSUB -o logs-C/open_mp.4.1.out
#BSUB -e logs-C/open_mp.4.1.dat
OMP_NUM_THREADS=4 mpiexec -np 1 bin/open_mp C 1073741824 4

------------------------------------------------------------

Successfully completed.

Resource usage summary:

    CPU time :                                   121.42 sec.
    Max Memory :                                 69 MB
    Average Memory :                             60.50 MB
    Total Requested Memory :                     -
    Delta Memory :                               -
    Max Swap :                                   -
    Max Processes :                              5
    Max Threads :                                15
    Run time :                                   55 sec.
    Turnaround time :                            57 sec.

The output (if any) follows:

Evaluating method of middle rectangles with OpenMP implementation.
Integrating 2sqrt(1-x^2) from -1.000000 to 1.000000, sampling at 1073741824 points.
================================
Computed Value: 3.14159265359064
  Target Value: 3.14159265358979
Absolute Error: 8.45101766344669e-13
         WTime: 13.331737827044 sec
================================
Computed Value: 3.14159265359064
  Target Value: 3.14159265358979
Absolute Error: 8.45101766344669e-13
         WTime: 13.5810888130218 sec
================================
Computed Value: 3.14159265359064
  Target Value: 3.14159265358979
Absolute Error: 8.45101766344669e-13
         WTime: 13.5897904329468 sec
================================
Computed Value: 3.14159265359064
  Target Value: 3.14159265358979
Absolute Error: 8.45101766344669e-13
         WTime: 13.5866758790798 sec


PS:

Read file <logs-C/open_mp.4.1.dat> for stderr output of this job.

