Evaluating method of middle rectangles with MPI implementation.
Integrating exp(sin(pi*cos(2pi*x))) * sin(pi*cos(pi*x)) from 0.000000 to 1.000000, sampling at 67108864 points.
================================
Computed Value: -6.1477990124896e-16
  Target Value: 0
Absolute Error: 6.1477990124896e-16
         WTime: 0.158877187058824 sec
================================
Computed Value: -6.1477990124896e-16
  Target Value: 0
Absolute Error: 6.1477990124896e-16
         WTime: 0.157394034117647 sec
================================
Computed Value: -6.1477990124896e-16
  Target Value: 0
Absolute Error: 6.1477990124896e-16
         WTime: 0.156147692941176 sec
================================
Computed Value: -6.1477990124896e-16
  Target Value: 0
Absolute Error: 6.1477990124896e-16
         WTime: 0.156143987058823 sec
