Sender: LSF System <lsfadmin@polus-c3-ib.bmc.hpc.cs.msu.ru>
Subject: Job 178017: <# this file was automaticly created by mpisubmit.pl script for edu-cmc-skpod18-320-19 #;source /polusfs/setenv/setup.SMPI;#BSUB -n 38;#BSUB -W 00:15;#BSUB -o logs-M/mpi.1.38.out;#BSUB -e logs-M/mpi.1.38.dat;OMP_NUM_THREADS=1 mpiexec bin/mpi M 1073741824 4> in cluster <MSUCluster> Done

Job <# this file was automaticly created by mpisubmit.pl script for edu-cmc-skpod18-320-19 #;source /polusfs/setenv/setup.SMPI;#BSUB -n 38;#BSUB -W 00:15;#BSUB -o logs-M/mpi.1.38.out;#BSUB -e logs-M/mpi.1.38.dat;OMP_NUM_THREADS=1 mpiexec bin/mpi M 1073741824 4> was submitted from host <polus-ib.bmc.hpc.cs.msu.ru> by user <edu-cmc-skpod18-320-19> in cluster <MSUCluster> at Sat Dec 15 15:27:34 2018
Job was executed on host(s) <20*polus-c3-ib.bmc.hpc.cs.msu.ru>, in queue <short>, as user <edu-cmc-skpod18-320-19> in cluster <MSUCluster> at Sat Dec 15 15:34:47 2018
                            <17*polus-c1-ib.bmc.hpc.cs.msu.ru>
                            <1*polus-c4-ib.bmc.hpc.cs.msu.ru>
</home_edu/edu-cmc-skpod18-320/edu-cmc-skpod18-320-19> was used as the home directory.
</home_edu/edu-cmc-skpod18-320/edu-cmc-skpod18-320-19/sc_pdp> was used as the working directory.
Started at Sat Dec 15 15:34:47 2018
Terminated at Sat Dec 15 15:35:12 2018
Results reported at Sat Dec 15 15:35:12 2018

Your job looked like:

------------------------------------------------------------
# LSBATCH: User input
# this file was automaticly created by mpisubmit.pl script for edu-cmc-skpod18-320-19 #
source /polusfs/setenv/setup.SMPI
#BSUB -n 38
#BSUB -W 00:15
#BSUB -o logs-M/mpi.1.38.out
#BSUB -e logs-M/mpi.1.38.dat
OMP_NUM_THREADS=1 mpiexec bin/mpi M 1073741824 4

------------------------------------------------------------

Successfully completed.

Resource usage summary:

    CPU time :                                   849.68 sec.
    Max Memory :                                 1077 MB
    Average Memory :                             808.00 MB
    Total Requested Memory :                     -
    Delta Memory :                               -
    Max Swap :                                   -
    Max Processes :                              24
    Max Threads :                                69
    Run time :                                   25 sec.
    Turnaround time :                            458 sec.

The output (if any) follows:

Evaluating method of middle rectangles with MPI implementation.
Integrating exp(sin(pi*cos(2pi*x))) * sin(pi*cos(pi*x)) from 0.000000 to 1.000000, sampling at 1073741824 points.
================================
Computed Value: -2.17048601314218e-14
  Target Value: 0
Absolute Error: 2.17048601314218e-14
         WTime: 5.70166904502548 sec
================================
Computed Value: -2.17048601314218e-14
  Target Value: 0
Absolute Error: 2.17048601314218e-14
         WTime: 5.47437312803231 sec
================================
Computed Value: -2.17048601314218e-14
  Target Value: 0
Absolute Error: 2.17048601314218e-14
         WTime: 5.68184145307168 sec
================================
Computed Value: -2.17048601314218e-14
  Target Value: 0
Absolute Error: 2.17048601314218e-14
         WTime: 5.37240641983226 sec


PS:

Read file <logs-M/mpi.1.38.dat> for stderr output of this job.

Sender: LSF System <lsfadmin@polus-c4-ib.bmc.hpc.cs.msu.ru>
Subject: Job 180936: <# this file was automaticly created by mpisubmit.pl script for edu-cmc-skpod18-320-19 #;source /polusfs/setenv/setup.SMPI;#BSUB -n 38;#BSUB -W 00:15;#BSUB -o logs-M/mpi.1.38.out;#BSUB -e logs-M/mpi.1.38.dat;OMP_NUM_THREADS=1 mpiexec -np 38 bin/mpi M 1073741824 4> in cluster <MSUCluster> Done

Job <# this file was automaticly created by mpisubmit.pl script for edu-cmc-skpod18-320-19 #;source /polusfs/setenv/setup.SMPI;#BSUB -n 38;#BSUB -W 00:15;#BSUB -o logs-M/mpi.1.38.out;#BSUB -e logs-M/mpi.1.38.dat;OMP_NUM_THREADS=1 mpiexec -np 38 bin/mpi M 1073741824 4> was submitted from host <polus-ib.bmc.hpc.cs.msu.ru> by user <edu-cmc-skpod18-320-19> in cluster <MSUCluster> at Mon Dec 17 00:00:14 2018
Job was executed on host(s) <17*polus-c4-ib.bmc.hpc.cs.msu.ru>, in queue <short>, as user <edu-cmc-skpod18-320-19> in cluster <MSUCluster> at Mon Dec 17 01:38:42 2018
                            <10*polus-c3-ib.bmc.hpc.cs.msu.ru>
                            <11*polus-c1-ib.bmc.hpc.cs.msu.ru>
</home_edu/edu-cmc-skpod18-320/edu-cmc-skpod18-320-19> was used as the home directory.
</home_edu/edu-cmc-skpod18-320/edu-cmc-skpod18-320-19/sc_pdp> was used as the working directory.
Started at Mon Dec 17 01:38:42 2018
Terminated at Mon Dec 17 01:38:57 2018
Results reported at Mon Dec 17 01:38:57 2018

Your job looked like:

------------------------------------------------------------
# LSBATCH: User input
# this file was automaticly created by mpisubmit.pl script for edu-cmc-skpod18-320-19 #
source /polusfs/setenv/setup.SMPI
#BSUB -n 38
#BSUB -W 00:15
#BSUB -o logs-M/mpi.1.38.out
#BSUB -e logs-M/mpi.1.38.dat
OMP_NUM_THREADS=1 mpiexec -np 38 bin/mpi M 1073741824 4

------------------------------------------------------------

Successfully completed.

Resource usage summary:

    CPU time :                                   510.56 sec.
    Max Memory :                                 923 MB
    Average Memory :                             462.00 MB
    Total Requested Memory :                     -
    Delta Memory :                               -
    Max Swap :                                   -
    Max Processes :                              21
    Max Threads :                                60
    Run time :                                   21 sec.
    Turnaround time :                            5923 sec.

The output (if any) follows:

Evaluating method of middle rectangles with MPI implementation.
Integrating exp(sin(pi*cos(2pi*x))) * sin(pi*cos(pi*x)) from 0.000000 to 1.000000, sampling at 1073741824 points.
================================
Computed Value: -2.1690982343614e-14
  Target Value: 0
Absolute Error: 2.1690982343614e-14
         WTime: 2.97981044510379 sec
================================
Computed Value: -2.1690982343614e-14
  Target Value: 0
Absolute Error: 2.1690982343614e-14
         WTime: 3.91867626085877 sec
================================
Computed Value: -2.1690982343614e-14
  Target Value: 0
Absolute Error: 2.1690982343614e-14
         WTime: 3.44022362725809 sec
================================
Computed Value: -2.1690982343614e-14
  Target Value: 0
Absolute Error: 2.1690982343614e-14
         WTime: 3.21996573498473 sec


PS:

Read file <logs-M/mpi.1.38.dat> for stderr output of this job.

