Sender: LSF System <lsfadmin@polus-c2-ib.bmc.hpc.cs.msu.ru>
Subject: Job 179393: <# this file was automaticly created by mpisubmit.pl script for edu-cmc-skpod18-320-19 #;source /polusfs/setenv/setup.SMPI;#BSUB -n 20;#BSUB -W 00:15;#BSUB -o logs-C/open_mp.20.1.out;#BSUB -e logs-C/open_mp.20.1.dat;OMP_NUM_THREADS=20 mpiexec -np 1 bin/open_mp C 1073741824 4> in cluster <MSUCluster> Done

Job <# this file was automaticly created by mpisubmit.pl script for edu-cmc-skpod18-320-19 #;source /polusfs/setenv/setup.SMPI;#BSUB -n 20;#BSUB -W 00:15;#BSUB -o logs-C/open_mp.20.1.out;#BSUB -e logs-C/open_mp.20.1.dat;OMP_NUM_THREADS=20 mpiexec -np 1 bin/open_mp C 1073741824 4> was submitted from host <polus-ib.bmc.hpc.cs.msu.ru> by user <edu-cmc-skpod18-320-19> in cluster <MSUCluster> at Sat Dec 15 21:13:38 2018
Job was executed on host(s) <18*polus-c2-ib.bmc.hpc.cs.msu.ru>, in queue <short>, as user <edu-cmc-skpod18-320-19> in cluster <MSUCluster> at Sat Dec 15 21:56:34 2018
                            <2*polus-c4-ib.bmc.hpc.cs.msu.ru>
</home_edu/edu-cmc-skpod18-320/edu-cmc-skpod18-320-19> was used as the home directory.
</home_edu/edu-cmc-skpod18-320/edu-cmc-skpod18-320-19/sc_pdp> was used as the working directory.
Started at Sat Dec 15 21:56:34 2018
Terminated at Sat Dec 15 21:56:37 2018
Results reported at Sat Dec 15 21:56:37 2018

Your job looked like:

------------------------------------------------------------
# LSBATCH: User input
# this file was automaticly created by mpisubmit.pl script for edu-cmc-skpod18-320-19 #
source /polusfs/setenv/setup.SMPI
#BSUB -n 20
#BSUB -W 00:15
#BSUB -o logs-C/open_mp.20.1.out
#BSUB -e logs-C/open_mp.20.1.dat
OMP_NUM_THREADS=20 mpiexec -np 1 bin/open_mp C 1073741824 4

------------------------------------------------------------

Successfully completed.

Resource usage summary:

    CPU time :                                   60.67 sec.
    Max Memory :                                 73 MB
    Average Memory :                             1.00 MB
    Total Requested Memory :                     -
    Delta Memory :                               -
    Max Swap :                                   -
    Max Processes :                              5
    Max Threads :                                31
    Run time :                                   3 sec.
    Turnaround time :                            2579 sec.

The output (if any) follows:

Evaluating method of middle rectangles with OpenMP implementation.
Integrating 2sqrt(1-x^2) from -1.000000 to 1.000000, sampling at 1073741824 points.
================================
Computed Value: 3.14159265358989
  Target Value: 3.14159265358979
Absolute Error: 1.01696429055664e-13
         WTime: 0.767607090063393 sec
================================
Computed Value: 3.14159265358989
  Target Value: 3.14159265358979
Absolute Error: 1.01696429055664e-13
         WTime: 0.75291546061635 sec
================================
Computed Value: 3.14159265358989
  Target Value: 3.14159265358979
Absolute Error: 1.01696429055664e-13
         WTime: 0.753368628211319 sec
================================
Computed Value: 3.14159265358989
  Target Value: 3.14159265358979
Absolute Error: 1.01696429055664e-13
         WTime: 0.751166340894997 sec


PS:

Read file <logs-C/open_mp.20.1.dat> for stderr output of this job.

Sender: LSF System <lsfadmin@polus-c4-ib.bmc.hpc.cs.msu.ru>
Subject: Job 180892: <# this file was automaticly created by mpisubmit.pl script for edu-cmc-skpod18-320-19 #;source /polusfs/setenv/setup.SMPI;#BSUB -n 20;#BSUB -W 00:15;#BSUB -o logs-C/open_mp.20.1.out;#BSUB -e logs-C/open_mp.20.1.dat;OMP_NUM_THREADS=20 mpiexec -np 1 bin/open_mp C 1073741824 4> in cluster <MSUCluster> Done

Job <# this file was automaticly created by mpisubmit.pl script for edu-cmc-skpod18-320-19 #;source /polusfs/setenv/setup.SMPI;#BSUB -n 20;#BSUB -W 00:15;#BSUB -o logs-C/open_mp.20.1.out;#BSUB -e logs-C/open_mp.20.1.dat;OMP_NUM_THREADS=20 mpiexec -np 1 bin/open_mp C 1073741824 4> was submitted from host <polus-ib.bmc.hpc.cs.msu.ru> by user <edu-cmc-skpod18-320-19> in cluster <MSUCluster> at Mon Dec 17 00:00:05 2018
Job was executed on host(s) <8*polus-c4-ib.bmc.hpc.cs.msu.ru>, in queue <short>, as user <edu-cmc-skpod18-320-19> in cluster <MSUCluster> at Mon Dec 17 00:11:17 2018
                            <12*polus-c3-ib.bmc.hpc.cs.msu.ru>
</home_edu/edu-cmc-skpod18-320/edu-cmc-skpod18-320-19> was used as the home directory.
</home_edu/edu-cmc-skpod18-320/edu-cmc-skpod18-320-19/sc_pdp> was used as the working directory.
Started at Mon Dec 17 00:11:17 2018
Terminated at Mon Dec 17 00:11:25 2018
Results reported at Mon Dec 17 00:11:25 2018

Your job looked like:

------------------------------------------------------------
# LSBATCH: User input
# this file was automaticly created by mpisubmit.pl script for edu-cmc-skpod18-320-19 #
source /polusfs/setenv/setup.SMPI
#BSUB -n 20
#BSUB -W 00:15
#BSUB -o logs-C/open_mp.20.1.out
#BSUB -e logs-C/open_mp.20.1.dat
OMP_NUM_THREADS=20 mpiexec -np 1 bin/open_mp C 1073741824 4

------------------------------------------------------------

Successfully completed.

Resource usage summary:

    CPU time :                                   89.97 sec.
    Max Memory :                                 73 MB
    Average Memory :                             1.50 MB
    Total Requested Memory :                     -
    Delta Memory :                               -
    Max Swap :                                   -
    Max Processes :                              5
    Max Threads :                                31
    Run time :                                   8 sec.
    Turnaround time :                            680 sec.

The output (if any) follows:

Evaluating method of middle rectangles with OpenMP implementation.
Integrating 2sqrt(1-x^2) from -1.000000 to 1.000000, sampling at 1073741824 points.
================================
Computed Value: 3.14159265358989
  Target Value: 3.14159265358979
Absolute Error: 1.01696429055664e-13
         WTime: 2.30246275709942 sec
================================
Computed Value: 3.14159265358989
  Target Value: 3.14159265358979
Absolute Error: 1.01696429055664e-13
         WTime: 2.22584899514914 sec
================================
Computed Value: 3.14159265358989
  Target Value: 3.14159265358979
Absolute Error: 1.01696429055664e-13
         WTime: 0.954663049895316 sec
================================
Computed Value: 3.14159265358989
  Target Value: 3.14159265358979
Absolute Error: 1.01696429055664e-13
         WTime: 0.639879198744893 sec


PS:

Read file <logs-C/open_mp.20.1.dat> for stderr output of this job.

