Evaluating method of middle rectangles with MPI implementation.
Integrating exp(sin(pi*cos(2pi*x))) * sin(pi*cos(pi*x)) from 0.000000 to 1.000000, sampling at 67108864 points.
================================
Computed Value: 1.17679303801577e-15
  Target Value: 0
Absolute Error: 1.17679303801577e-15
         WTime: 1.25887594941176 sec
================================
Computed Value: 1.17679303801577e-15
  Target Value: 0
Absolute Error: 1.17679303801577e-15
         WTime: 1.27316545529412 sec
================================
Computed Value: 1.17679303801577e-15
  Target Value: 0
Absolute Error: 1.17679303801577e-15
         WTime: 1.24356667647059 sec
================================
Computed Value: 1.17679303801577e-15
  Target Value: 0
Absolute Error: 1.17679303801577e-15
         WTime: 1.24356850941176 sec
