Evaluating method of middle rectangles with MPI implementation.
Integrating exp(sin(pi*cos(2pi*x))) * sin(pi*cos(pi*x)) from 0.000000 to 1.000000, sampling at 67108864 points.
================================
Computed Value: 3.84777930004243e-15
  Target Value: 0
Absolute Error: 3.84777930004243e-15
         WTime: 0.773781064705882 sec
================================
Computed Value: 3.84777930004243e-15
  Target Value: 0
Absolute Error: 3.84777930004243e-15
         WTime: 0.773762455294118 sec
================================
Computed Value: 3.84777930004243e-15
  Target Value: 0
Absolute Error: 3.84777930004243e-15
         WTime: 0.773761358823529 sec
================================
Computed Value: 3.84777930004243e-15
  Target Value: 0
Absolute Error: 3.84777930004243e-15
         WTime: 0.773758834117647 sec
