Evaluating method of middle rectangles with MPI implementation.
Integrating 2sqrt(1-x^2) from -1.000000 to 1.000000, sampling at 67108864 points.
================================
Computed Value: 3.14159274721832
  Target Value: 3.14159265358979
Absolute Error: 9.36285271535553e-08
         WTime: 0.842722021176471 sec
================================
Computed Value: 3.14159274721832
  Target Value: 3.14159265358979
Absolute Error: 9.36285271535553e-08
         WTime: 0.84222650117647 sec
================================
Computed Value: 3.14159274721832
  Target Value: 3.14159265358979
Absolute Error: 9.36285271535553e-08
         WTime: 0.842226785882353 sec
================================
Computed Value: 3.14159274721832
  Target Value: 3.14159265358979
Absolute Error: 9.36285271535553e-08
         WTime: 0.842224858823529 sec
