Sender: LSF System <lsfadmin@polus-c4-ib.bmc.hpc.cs.msu.ru>
Subject: Job 176722: <# this file was automaticly created by mpisubmit.pl script for edu-cmc-skpod18-320-19 #;source /polusfs/setenv/setup.SMPI;#BSUB -n 1;#BSUB -W 00:15;#BSUB -o logs-C/baseline.1.1.out;#BSUB -e logs-C/baseline.1.1.dat;OMP_NUM_THREADS=1 mpiexec bin/baseline C 1073741824 4> in cluster <MSUCluster> Done

Job <# this file was automaticly created by mpisubmit.pl script for edu-cmc-skpod18-320-19 #;source /polusfs/setenv/setup.SMPI;#BSUB -n 1;#BSUB -W 00:15;#BSUB -o logs-C/baseline.1.1.out;#BSUB -e logs-C/baseline.1.1.dat;OMP_NUM_THREADS=1 mpiexec bin/baseline C 1073741824 4> was submitted from host <polus-ib.bmc.hpc.cs.msu.ru> by user <edu-cmc-skpod18-320-19> in cluster <MSUCluster> at Sat Dec 15 13:44:57 2018
Job was executed on host(s) <polus-c4-ib.bmc.hpc.cs.msu.ru>, in queue <short>, as user <edu-cmc-skpod18-320-19> in cluster <MSUCluster> at Sat Dec 15 13:44:58 2018
</home_edu/edu-cmc-skpod18-320/edu-cmc-skpod18-320-19> was used as the home directory.
</home_edu/edu-cmc-skpod18-320/edu-cmc-skpod18-320-19/sc_pdp> was used as the working directory.
Started at Sat Dec 15 13:44:58 2018
Terminated at Sat Dec 15 13:45:26 2018
Results reported at Sat Dec 15 13:45:26 2018

Your job looked like:

------------------------------------------------------------
# LSBATCH: User input
# this file was automaticly created by mpisubmit.pl script for edu-cmc-skpod18-320-19 #
source /polusfs/setenv/setup.SMPI
#BSUB -n 1
#BSUB -W 00:15
#BSUB -o logs-C/baseline.1.1.out
#BSUB -e logs-C/baseline.1.1.dat
OMP_NUM_THREADS=1 mpiexec bin/baseline C 1073741824 4

------------------------------------------------------------

Successfully completed.

Resource usage summary:

    CPU time :                                   26.53 sec.
    Max Memory :                                 70 MB
    Average Memory :                             52.75 MB
    Total Requested Memory :                     -
    Delta Memory :                               -
    Max Swap :                                   -
    Max Processes :                              5
    Max Threads :                                12
    Run time :                                   28 sec.
    Turnaround time :                            29 sec.

The output (if any) follows:

Evaluating method of middle rectangles with baseline implementation.
Integrating 2sqrt(1-x^2) from -1.000000 to 1.000000, sampling at 1073741824 points.
================================
Computed Value: 3.14159265359476
  Target Value: 3.14159265358979
Absolute Error: 4.964029187704e-12
         WTime: 6.73296628706157 sec
================================
Computed Value: 3.14159265359476
  Target Value: 3.14159265358979
Absolute Error: 4.964029187704e-12
         WTime: 6.54693713923916 sec
================================
Computed Value: 3.14159265359476
  Target Value: 3.14159265358979
Absolute Error: 4.964029187704e-12
         WTime: 6.5712779588066 sec
================================
Computed Value: 3.14159265359476
  Target Value: 3.14159265358979
Absolute Error: 4.964029187704e-12
         WTime: 6.47132053878158 sec


PS:

Read file <logs-C/baseline.1.1.dat> for stderr output of this job.

Sender: LSF System <lsfadmin@polus-c4-ib.bmc.hpc.cs.msu.ru>
Subject: Job 180844: <# this file was automaticly created by mpisubmit.pl script for edu-cmc-skpod18-320-19 #;source /polusfs/setenv/setup.SMPI;#BSUB -n 1;#BSUB -W 00:15;#BSUB -o logs-C/baseline.1.1.out;#BSUB -e logs-C/baseline.1.1.dat;OMP_NUM_THREADS=1 mpiexec -np 1 bin/baseline C 1073741824 4> in cluster <MSUCluster> Done

Job <# this file was automaticly created by mpisubmit.pl script for edu-cmc-skpod18-320-19 #;source /polusfs/setenv/setup.SMPI;#BSUB -n 1;#BSUB -W 00:15;#BSUB -o logs-C/baseline.1.1.out;#BSUB -e logs-C/baseline.1.1.dat;OMP_NUM_THREADS=1 mpiexec -np 1 bin/baseline C 1073741824 4> was submitted from host <polus-ib.bmc.hpc.cs.msu.ru> by user <edu-cmc-skpod18-320-19> in cluster <MSUCluster> at Sun Dec 16 23:58:06 2018
Job was executed on host(s) <polus-c4-ib.bmc.hpc.cs.msu.ru>, in queue <short>, as user <edu-cmc-skpod18-320-19> in cluster <MSUCluster> at Sun Dec 16 23:58:07 2018
</home_edu/edu-cmc-skpod18-320/edu-cmc-skpod18-320-19> was used as the home directory.
</home_edu/edu-cmc-skpod18-320/edu-cmc-skpod18-320-19/sc_pdp> was used as the working directory.
Started at Sun Dec 16 23:58:07 2018
Terminated at Sun Dec 16 23:58:35 2018
Results reported at Sun Dec 16 23:58:35 2018

Your job looked like:

------------------------------------------------------------
# LSBATCH: User input
# this file was automaticly created by mpisubmit.pl script for edu-cmc-skpod18-320-19 #
source /polusfs/setenv/setup.SMPI
#BSUB -n 1
#BSUB -W 00:15
#BSUB -o logs-C/baseline.1.1.out
#BSUB -e logs-C/baseline.1.1.dat
OMP_NUM_THREADS=1 mpiexec -np 1 bin/baseline C 1073741824 4

------------------------------------------------------------

Successfully completed.

Resource usage summary:

    CPU time :                                   26.09 sec.
    Max Memory :                                 70 MB
    Average Memory :                             52.75 MB
    Total Requested Memory :                     -
    Delta Memory :                               -
    Max Swap :                                   -
    Max Processes :                              5
    Max Threads :                                12
    Run time :                                   33 sec.
    Turnaround time :                            29 sec.

The output (if any) follows:

Evaluating method of middle rectangles with baseline implementation.
Integrating 2sqrt(1-x^2) from -1.000000 to 1.000000, sampling at 1073741824 points.
================================
Computed Value: 3.14159265359476
  Target Value: 3.14159265358979
Absolute Error: 4.964029187704e-12
         WTime: 6.54140249500051 sec
================================
Computed Value: 3.14159265359476
  Target Value: 3.14159265358979
Absolute Error: 4.964029187704e-12
         WTime: 6.44376449659467 sec
================================
Computed Value: 3.14159265359476
  Target Value: 3.14159265358979
Absolute Error: 4.964029187704e-12
         WTime: 6.44344993215054 sec
================================
Computed Value: 3.14159265359476
  Target Value: 3.14159265358979
Absolute Error: 4.964029187704e-12
         WTime: 6.44235779810697 sec


PS:

Read file <logs-C/baseline.1.1.dat> for stderr output of this job.

