# Running __TRIALS__ with FILTERED_SAMPLING/DELTA_STOPPING and epsilon=1.000000e-04, comm_size=1, seed=42
__TRIALS__ = [
#   (trial_time, trial_iters, trial_points, trial_error),
    (2.584581e+02, 268800000, 70363658, 6.000327e-05),  # __TRIALS__
    (2.584608e+02, 268800000, 70374353, 2.568350e-05),  # __TRIALS__
    (2.584619e+02, 268800000, 70376111, 1.249243e-04),  # __TRIALS__
