Sender: LSF System <lsfadmin@polus-c1-ib.bmc.hpc.cs.msu.ru>
Subject: Job 798499: <# this file was automaticly created by mpisubmit.pl script for edu-cmc-skmodel21-622-16 #;source /polusfs/setenv/setup.SMPI;#BSUB -n 32;#BSUB -W 00:15;#BSUB -o main_filtered_error.%J.out;#BSUB -e main_filtered_error.%J.err;OMP_NUM_THREADS=1 mpiexec main_filtered_error 3.0e-5 42> in cluster <MSUCluster> Done

Job <# this file was automaticly created by mpisubmit.pl script for edu-cmc-skmodel21-622-16 #;source /polusfs/setenv/setup.SMPI;#BSUB -n 32;#BSUB -W 00:15;#BSUB -o main_filtered_error.%J.out;#BSUB -e main_filtered_error.%J.err;OMP_NUM_THREADS=1 mpiexec main_filtered_error 3.0e-5 42> was submitted from host <polus-ib.bmc.hpc.cs.msu.ru> by user <edu-cmc-skmodel21-622-16> in cluster <MSUCluster> at Sun Nov  7 06:54:54 2021
Job was executed on host(s) <20*polus-c1-ib.bmc.hpc.cs.msu.ru>, in queue <short>, as user <edu-cmc-skmodel21-622-16> in cluster <MSUCluster> at Sun Nov  7 06:54:54 2021
                            <12*polus-c2-ib.bmc.hpc.cs.msu.ru>
</home_edu/edu-cmc-skmodel21-622/edu-cmc-skmodel21-622-16> was used as the home directory.
</home_edu/edu-cmc-skmodel21-622/edu-cmc-skmodel21-622-16/solution> was used as the working directory.
Started at Sun Nov  7 06:54:54 2021
Terminated at Sun Nov  7 06:54:56 2021
Results reported at Sun Nov  7 06:54:56 2021

Your job looked like:

------------------------------------------------------------
# LSBATCH: User input
# this file was automaticly created by mpisubmit.pl script for edu-cmc-skmodel21-622-16 #
source /polusfs/setenv/setup.SMPI
#BSUB -n 32
#BSUB -W 00:15
#BSUB -o main_filtered_error.%J.out
#BSUB -e main_filtered_error.%J.err
OMP_NUM_THREADS=1 mpiexec main_filtered_error 3.0e-5 42

------------------------------------------------------------

Successfully completed.

Resource usage summary:

    CPU time :                                   16.00 sec.
    Max Memory :                                 1080 MB
    Average Memory :                             720.33 MB
    Total Requested Memory :                     -
    Delta Memory :                               -
    Max Swap :                                   -
    Max Processes :                              24
    Max Threads :                                69
    Run time :                                   4 sec.
    Turnaround time :                            2 sec.

The output (if any) follows:

# Running __TRIALS__ with FILTERED_SAMPLING/ERROR_STOPPING and epsilon=3.000000e-05, comm_size=32, seed=42
__TRIALS__ = [
#   (trial_time, trial_iters, trial_points, trial_error),
    (6.958919e-03, 712320, 186380, 1.504189e-05),  # __TRIALS__
    (7.253287e-03, 752640, 196919, 8.488354e-06),  # __TRIALS__
    (3.305788e-01, 50991360, 13349411, 2.912914e-05),  # __TRIALS__
    (3.124903e-03, 685440, 179695, 7.674547e-06),  # __TRIALS__
    (1.155543e-02, 2520000, 659865, 2.254969e-06),  # __TRIALS__
    (8.768820e-03, 1915200, 501408, 2.787460e-05),  # __TRIALS__
    (2.328916e-03, 510720, 133849, 4.553302e-06),  # __TRIALS__
    (7.435773e-04, 154560, 40474, 9.684642e-06),  # __TRIALS__
    (4.298662e-03, 940800, 246109, 2.933807e-05),  # __TRIALS__
    (4.604571e-03, 1008000, 263678, 2.269759e-05),  # __TRIALS__
]  # __TRIALS__
# Done.


PS:

Read file <main_filtered_error.798499.err> for stderr output of this job.

