Sender: LSF System <lsfadmin@polus-c3-ib.bmc.hpc.cs.msu.ru>
Subject: Job 836927: <# this file was automaticly created by mpisubmit.pl script for edu-cmc-skmodel21-622-16 #;source /polusfs/setenv/setup.SMPI;#BSUB -n 10;#BSUB -W 00:15;#BSUB -o main.%J.out;#BSUB -e main.%J.err;OMP_NUM_THREADS=1 mpiexec main 3.141592653589793 0.01 256 20> in cluster <MSUCluster> Done

Job <# this file was automaticly created by mpisubmit.pl script for edu-cmc-skmodel21-622-16 #;source /polusfs/setenv/setup.SMPI;#BSUB -n 10;#BSUB -W 00:15;#BSUB -o main.%J.out;#BSUB -e main.%J.err;OMP_NUM_THREADS=1 mpiexec main 3.141592653589793 0.01 256 20> was submitted from host <polus-ib.bmc.hpc.cs.msu.ru> by user <edu-cmc-skmodel21-622-16> in cluster <MSUCluster> at Mon Dec 13 23:13:25 2021
Job was executed on host(s) <10*polus-c3-ib.bmc.hpc.cs.msu.ru>, in queue <short>, as user <edu-cmc-skmodel21-622-16> in cluster <MSUCluster> at Mon Dec 13 23:13:41 2021
</home_edu/edu-cmc-skmodel21-622/edu-cmc-skmodel21-622-16> was used as the home directory.
</home_edu/edu-cmc-skmodel21-622/edu-cmc-skmodel21-622-16/solution> was used as the working directory.
Started at Mon Dec 13 23:13:41 2021
Terminated at Mon Dec 13 23:13:50 2021
Results reported at Mon Dec 13 23:13:50 2021

Your job looked like:

------------------------------------------------------------
# LSBATCH: User input
# this file was automaticly created by mpisubmit.pl script for edu-cmc-skmodel21-622-16 #
source /polusfs/setenv/setup.SMPI
#BSUB -n 10
#BSUB -W 00:15
#BSUB -o main.%J.out
#BSUB -e main.%J.err
OMP_NUM_THREADS=1 mpiexec main 3.141592653589793 0.01 256 20

------------------------------------------------------------

Successfully completed.

Resource usage summary:

    CPU time :                                   86.93 sec.
    Max Memory :                                 950 MB
    Average Memory :                             712.75 MB
    Total Requested Memory :                     -
    Delta Memory :                               -
    Max Swap :                                   -
    Max Processes :                              14
    Max Threads :                                39
    Run time :                                   10 sec.
    Turnaround time :                            25 sec.

The output (if any) follows:

=======================
__.world.size = 10;
__.world.rank = 4;

__.nodes.shape = {.x=256, .y=256, .z=256, .t=20};
__.nodes.bound = {.x=3.141593, .y=3.141593, .z=3.141593, .t=0.010000};
__.nodes.steps = {.x=0.012272, .y=0.012272, .z=0.012272, .t=0.000500};

__.param.period = {.x=1, .y=0, .z=0};
__.param.a = {.x=2.000000, .y=1.000000, .z=1.000000, .t=2.449490};
__.param.b = {.x=0.000000, .y=0.000000, .z=0.000000, .t=7.853982};

__.local.rank = 4;
__.local.shape = {.x=5, .y=2, .z=1};
__.local.coord = {.x=2, .y=0, .z=0};

__.block.shape = {.x=54, .y=130, .z=258};
__.block.coord = {.x=104, .y=0, .z=0};
__.block.elems = 1811160;

=======================
__.world.size = 10;
__.world.rank = 5;

__.nodes.shape = {.x=256, .y=256, .z=256, .t=20};
__.nodes.bound = {.x=3.141593, .y=3.141593, .z=3.141593, .t=0.010000};
__.nodes.steps = {.x=0.012272, .y=0.012272, .z=0.012272, .t=0.000500};

__.param.period = {.x=1, .y=0, .z=0};
__.param.a = {.x=2.000000, .y=1.000000, .z=1.000000, .t=2.449490};
__.param.b = {.x=0.000000, .y=0.000000, .z=0.000000, .t=7.853982};

__.local.rank = 5;
__.local.shape = {.x=5, .y=2, .z=1};
__.local.coord = {.x=2, .y=1, .z=0};

__.block.shape = {.x=54, .y=130, .z=258};
__.block.coord = {.x=104, .y=128, .z=0};
__.block.elems = 1811160;

=======================
__.world.size = 10;
__.world.rank = 6;

__.nodes.shape = {.x=256, .y=256, .z=256, .t=20};
__.nodes.bound = {.x=3.141593, .y=3.141593, .z=3.141593, .t=0.010000};
__.nodes.steps = {.x=0.012272, .y=0.012272, .z=0.012272, .t=0.000500};

__.param.period = {.x=1, .y=0, .z=0};
__.param.a = {.x=2.000000, .y=1.000000, .z=1.000000, .t=2.449490};
__.param.b = {.x=0.000000, .y=0.000000, .z=0.000000, .t=7.853982};

__.local.rank = 6;
__.local.shape = {.x=5, .y=2, .z=1};
__.local.coord = {.x=3, .y=0, .z=0};

__.block.shape = {.x=54, .y=130, .z=258};
__.block.coord = {.x=156, .y=0, .z=0};
__.block.elems = 1811160;

=======================
__.world.size = 10;
__.world.rank = 7;

__.nodes.shape = {.x=256, .y=256, .z=256, .t=20};
__.nodes.bound = {.x=3.141593, .y=3.141593, .z=3.141593, .t=0.010000};
__.nodes.steps = {.x=0.012272, .y=0.012272, .z=0.012272, .t=0.000500};

__.param.period = {.x=1, .y=0, .z=0};
__.param.a = {.x=2.000000, .y=1.000000, .z=1.000000, .t=2.449490};
__.param.b = {.x=0.000000, .y=0.000000, .z=0.000000, .t=7.853982};

__.local.rank = 7;
__.local.shape = {.x=5, .y=2, .z=1};
__.local.coord = {.x=3, .y=1, .z=0};

__.block.shape = {.x=54, .y=130, .z=258};
__.block.coord = {.x=156, .y=128, .z=0};
__.block.elems = 1811160;

=======================
__.world.size = 10;
__.world.rank = 8;

__.nodes.shape = {.x=256, .y=256, .z=256, .t=20};
__.nodes.bound = {.x=3.141593, .y=3.141593, .z=3.141593, .t=0.010000};
__.nodes.steps = {.x=0.012272, .y=0.012272, .z=0.012272, .t=0.000500};

__.param.period = {.x=1, .y=0, .z=0};
__.param.a = {.x=2.000000, .y=1.000000, .z=1.000000, .t=2.449490};
__.param.b = {.x=0.000000, .y=0.000000, .z=0.000000, .t=7.853982};

__.local.rank = 8;
__.local.shape = {.x=5, .y=2, .z=1};
__.local.coord = {.x=4, .y=0, .z=0};

__.block.shape = {.x=50, .y=130, .z=258};
__.block.coord = {.x=208, .y=0, .z=0};
__.block.elems = 1677000;

=======================
__.world.size = 10;
__.world.rank = 9;

__.nodes.shape = {.x=256, .y=256, .z=256, .t=20};
__.nodes.bound = {.x=3.141593, .y=3.141593, .z=3.141593, .t=0.010000};
__.nodes.steps = {.x=0.012272, .y=0.012272, .z=0.012272, .t=0.000500};

__.param.period = {.x=1, .y=0, .z=0};
__.param.a = {.x=2.000000, .y=1.000000, .z=1.000000, .t=2.449490};
__.param.b = {.x=0.000000, .y=0.000000, .z=0.000000, .t=7.853982};

__.local.rank = 9;
__.local.shape = {.x=5, .y=2, .z=1};
__.local.coord = {.x=4, .y=1, .z=0};

__.block.shape = {.x=50, .y=130, .z=258};
__.block.coord = {.x=208, .y=128, .z=0};
__.block.elems = 1677000;

__PARAMS__ = {'P': 10, 'O': 0, 'L': 3.141593e+00, 'T': 1.000000e-02, 'N': 256, 'K': 20}
=======================
__.world.size = 10;
__.world.rank = 0;

__.nodes.shape = {.x=256, .y=256, .z=256, .t=20};
__.nodes.bound = {.x=3.141593, .y=3.141593, .z=3.141593, .t=0.010000};
__.nodes.steps = {.x=0.012272, .y=0.012272, .z=0.012272, .t=0.000500};

__.param.period = {.x=1, .y=0, .z=0};
__.param.a = {.x=2.000000, .y=1.000000, .z=1.000000, .t=2.449490};
__.param.b = {.x=0.000000, .y=0.000000, .z=0.000000, .t=7.853982};

__.local.rank = 0;
__.local.shape = {.x=5, .y=2, .z=1};
__.local.coord = {.x=0, .y=0, .z=0};

__.block.shape = {.x=54, .y=130, .z=258};
__.block.coord = {.x=0, .y=0, .z=0};
__.block.elems = 1811160;

=======================
__.world.size = 10;
__.world.rank = 1;

__.nodes.shape = {.x=256, .y=256, .z=256, .t=20};
__.nodes.bound = {.x=3.141593, .y=3.141593, .z=3.141593, .t=0.010000};
__.nodes.steps = {.x=0.012272, .y=0.012272, .z=0.012272, .t=0.000500};

__.param.period = {.x=1, .y=0, .z=0};
__.param.a = {.x=2.000000, .y=1.000000, .z=1.000000, .t=2.449490};
__.param.b = {.x=0.000000, .y=0.000000, .z=0.000000, .t=7.853982};

__.local.rank = 1;
__.local.shape = {.x=5, .y=2, .z=1};
__.local.coord = {.x=0, .y=1, .z=0};

__.block.shape = {.x=54, .y=130, .z=258};
__.block.coord = {.x=0, .y=128, .z=0};
__.block.elems = 1811160;

=======================
__.world.size = 10;
__.world.rank = 2;

__.nodes.shape = {.x=256, .y=256, .z=256, .t=20};
__.nodes.bound = {.x=3.141593, .y=3.141593, .z=3.141593, .t=0.010000};
__.nodes.steps = {.x=0.012272, .y=0.012272, .z=0.012272, .t=0.000500};

__.param.period = {.x=1, .y=0, .z=0};
__.param.a = {.x=2.000000, .y=1.000000, .z=1.000000, .t=2.449490};
__.param.b = {.x=0.000000, .y=0.000000, .z=0.000000, .t=7.853982};

__.local.rank = 2;
__.local.shape = {.x=5, .y=2, .z=1};
__.local.coord = {.x=1, .y=0, .z=0};

__.block.shape = {.x=54, .y=130, .z=258};
__.block.coord = {.x=52, .y=0, .z=0};
__.block.elems = 1811160;

=======================
__.world.size = 10;
__.world.rank = 3;

__.nodes.shape = {.x=256, .y=256, .z=256, .t=20};
__.nodes.bound = {.x=3.141593, .y=3.141593, .z=3.141593, .t=0.010000};
__.nodes.steps = {.x=0.012272, .y=0.012272, .z=0.012272, .t=0.000500};

__.param.period = {.x=1, .y=0, .z=0};
__.param.a = {.x=2.000000, .y=1.000000, .z=1.000000, .t=2.449490};
__.param.b = {.x=0.000000, .y=0.000000, .z=0.000000, .t=7.853982};

__.local.rank = 3;
__.local.shape = {.x=5, .y=2, .z=1};
__.local.coord = {.x=1, .y=1, .z=0};

__.block.shape = {.x=54, .y=130, .z=258};
__.block.coord = {.x=52, .y=128, .z=0};
__.block.elems = 1811160;

__TRIALS__.append((1.048255e+00, [0.000000e+00, 2.814293e-11, 1.125714e-10, 2.532855e-10, 4.502845e-10, 7.035680e-10, 1.013135e-09, 1.378985e-09, 1.801117e-09, 2.279529e-09, 2.814220e-09, 3.405188e-09, 4.052432e-09, 4.755950e-09, 5.515739e-09, 6.331797e-09, 7.204122e-09, 8.132712e-09, 9.117562e-09, 1.015867e-08, 1.125604e-08, ]))
__TRIALS__.append((8.643187e-01, [0.000000e+00, 2.814293e-11, 1.125714e-10, 2.532855e-10, 4.502845e-10, 7.035680e-10, 1.013135e-09, 1.378985e-09, 1.801117e-09, 2.279529e-09, 2.814220e-09, 3.405188e-09, 4.052432e-09, 4.755950e-09, 5.515739e-09, 6.331797e-09, 7.204122e-09, 8.132712e-09, 9.117562e-09, 1.015867e-08, 1.125604e-08, ]))
__TRIALS__.append((8.036410e-01, [0.000000e+00, 2.814293e-11, 1.125714e-10, 2.532855e-10, 4.502845e-10, 7.035680e-10, 1.013135e-09, 1.378985e-09, 1.801117e-09, 2.279529e-09, 2.814220e-09, 3.405188e-09, 4.052432e-09, 4.755950e-09, 5.515739e-09, 6.331797e-09, 7.204122e-09, 8.132712e-09, 9.117562e-09, 1.015867e-08, 1.125604e-08, ]))
__TRIALS__.append((8.712467e-01, [0.000000e+00, 2.814293e-11, 1.125714e-10, 2.532855e-10, 4.502845e-10, 7.035680e-10, 1.013135e-09, 1.378985e-09, 1.801117e-09, 2.279529e-09, 2.814220e-09, 3.405188e-09, 4.052432e-09, 4.755950e-09, 5.515739e-09, 6.331797e-09, 7.204122e-09, 8.132712e-09, 9.117562e-09, 1.015867e-08, 1.125604e-08, ]))
__TRIALS__.append((8.345774e-01, [0.000000e+00, 2.814293e-11, 1.125714e-10, 2.532855e-10, 4.502845e-10, 7.035680e-10, 1.013135e-09, 1.378985e-09, 1.801117e-09, 2.279529e-09, 2.814220e-09, 3.405188e-09, 4.052432e-09, 4.755950e-09, 5.515739e-09, 6.331797e-09, 7.204122e-09, 8.132712e-09, 9.117562e-09, 1.015867e-08, 1.125604e-08, ]))
__TRIALS__.append((8.037318e-01, [0.000000e+00, 2.814293e-11, 1.125714e-10, 2.532855e-10, 4.502845e-10, 7.035680e-10, 1.013135e-09, 1.378985e-09, 1.801117e-09, 2.279529e-09, 2.814220e-09, 3.405188e-09, 4.052432e-09, 4.755950e-09, 5.515739e-09, 6.331797e-09, 7.204122e-09, 8.132712e-09, 9.117562e-09, 1.015867e-08, 1.125604e-08, ]))
__TRIALS__.append((8.038621e-01, [0.000000e+00, 2.814293e-11, 1.125714e-10, 2.532855e-10, 4.502845e-10, 7.035680e-10, 1.013135e-09, 1.378985e-09, 1.801117e-09, 2.279529e-09, 2.814220e-09, 3.405188e-09, 4.052432e-09, 4.755950e-09, 5.515739e-09, 6.331797e-09, 7.204122e-09, 8.132712e-09, 9.117562e-09, 1.015867e-08, 1.125604e-08, ]))
__TRIALS__.append((8.343695e-01, [0.000000e+00, 2.814293e-11, 1.125714e-10, 2.532855e-10, 4.502845e-10, 7.035680e-10, 1.013135e-09, 1.378985e-09, 1.801117e-09, 2.279529e-09, 2.814220e-09, 3.405188e-09, 4.052432e-09, 4.755950e-09, 5.515739e-09, 6.331797e-09, 7.204122e-09, 8.132712e-09, 9.117562e-09, 1.015867e-08, 1.125604e-08, ]))
__TRIALS__.append((8.318120e-01, [0.000000e+00, 2.814293e-11, 1.125714e-10, 2.532855e-10, 4.502845e-10, 7.035680e-10, 1.013135e-09, 1.378985e-09, 1.801117e-09, 2.279529e-09, 2.814220e-09, 3.405188e-09, 4.052432e-09, 4.755950e-09, 5.515739e-09, 6.331797e-09, 7.204122e-09, 8.132712e-09, 9.117562e-09, 1.015867e-08, 1.125604e-08, ]))
__TRIALS__.append((8.987561e-01, [0.000000e+00, 2.814293e-11, 1.125714e-10, 2.532855e-10, 4.502845e-10, 7.035680e-10, 1.013135e-09, 1.378985e-09, 1.801117e-09, 2.279529e-09, 2.814220e-09, 3.405188e-09, 4.052432e-09, 4.755950e-09, 5.515739e-09, 6.331797e-09, 7.204122e-09, 8.132712e-09, 9.117562e-09, 1.015867e-08, 1.125604e-08, ]))


PS:

Read file <main.836927.err> for stderr output of this job.

