# Running __TRIALS__ with FILTERED_SAMPLING/ERROR_STOPPING and epsilon=8.000000e-06, comm_size=4, seed=42
__TRIALS__ = [
#   (trial_time, trial_iters, trial_points, trial_error),
    (7.276392e+00, 29789760, 7796918, 7.299688e-06),  # __TRIALS__
    (6.893548e-02, 282240, 73928, 2.474268e-06),  # __TRIALS__
    (1.469638e+02, 601648320, 157517297, 7.956868e-06),  # __TRIALS__
    (7.076543e+00, 28969920, 7584623, 7.923902e-06),  # __TRIALS__
    (2.167023e-01, 887040, 232306, 7.246795e-06),  # __TRIALS__
    (7.715152e-02, 315840, 82646, 6.196395e-06),  # __TRIALS__
    (4.764448e-02, 194880, 51148, 4.850508e-06),  # __TRIALS__
    (1.937167e-01, 792960, 207751, 6.579888e-06),  # __TRIALS__
    (2.413391e-01, 987840, 258645, 5.148264e-06),  # __TRIALS__
    (7.391407e-02, 302400, 79378, 3.075926e-06),  # __TRIALS__
]  # __TRIALS__
# Done.
