Sender: LSF System <lsfadmin@polus-c1-ib.bmc.hpc.cs.msu.ru>
Subject: Job 798489: <# this file was automaticly created by mpisubmit.pl script for edu-cmc-skmodel21-622-16 #;source /polusfs/setenv/setup.SMPI;#BSUB -n 1;#BSUB -W 00:15;#BSUB -o main_filtered_error.%J.out;#BSUB -e main_filtered_error.%J.err;OMP_NUM_THREADS=1 mpiexec main_filtered_error 3.0e-5 42> in cluster <MSUCluster> Done

Job <# this file was automaticly created by mpisubmit.pl script for edu-cmc-skmodel21-622-16 #;source /polusfs/setenv/setup.SMPI;#BSUB -n 1;#BSUB -W 00:15;#BSUB -o main_filtered_error.%J.out;#BSUB -e main_filtered_error.%J.err;OMP_NUM_THREADS=1 mpiexec main_filtered_error 3.0e-5 42> was submitted from host <polus-ib.bmc.hpc.cs.msu.ru> by user <edu-cmc-skmodel21-622-16> in cluster <MSUCluster> at Sun Nov  7 06:30:41 2021
Job was executed on host(s) <polus-c1-ib.bmc.hpc.cs.msu.ru>, in queue <short>, as user <edu-cmc-skmodel21-622-16> in cluster <MSUCluster> at Sun Nov  7 06:30:42 2021
</home_edu/edu-cmc-skmodel21-622/edu-cmc-skmodel21-622-16> was used as the home directory.
</home_edu/edu-cmc-skmodel21-622/edu-cmc-skmodel21-622-16/solution> was used as the working directory.
Started at Sun Nov  7 06:30:42 2021
Terminated at Sun Nov  7 06:30:44 2021
Results reported at Sun Nov  7 06:30:44 2021

Your job looked like:

------------------------------------------------------------
# LSBATCH: User input
# this file was automaticly created by mpisubmit.pl script for edu-cmc-skmodel21-622-16 #
source /polusfs/setenv/setup.SMPI
#BSUB -n 1
#BSUB -W 00:15
#BSUB -o main_filtered_error.%J.out
#BSUB -e main_filtered_error.%J.err
OMP_NUM_THREADS=1 mpiexec main_filtered_error 3.0e-5 42

------------------------------------------------------------

Successfully completed.

Resource usage summary:

    CPU time :                                   0.96 sec.
    Max Memory :                                 70 MB
    Average Memory :                             47.00 MB
    Total Requested Memory :                     -
    Delta Memory :                               -
    Max Swap :                                   -
    Max Processes :                              5
    Max Threads :                                12
    Run time :                                   6 sec.
    Turnaround time :                            3 sec.

The output (if any) follows:

# Running __TRIALS__ with FILTERED_SAMPLING/ERROR_STOPPING and epsilon=3.000000e-05, comm_size=1, seed=42
__TRIALS__ = [
#   (trial_time, trial_iters, trial_points, trial_error),
    (2.524092e-02, 275520, 72052, 3.377190e-06),  # __TRIALS__
    (3.125334e-03, 33600, 8781, 2.363894e-05),  # __TRIALS__
    (3.330325e-01, 3642240, 953668, 2.826311e-05),  # __TRIALS__
    (7.001567e-02, 766080, 200095, 2.786597e-06),  # __TRIALS__
    (2.397195e-02, 262080, 68511, 2.344252e-05),  # __TRIALS__
    (1.217821e-01, 1330560, 348403, 1.813903e-05),  # __TRIALS__
    (2.398708e-02, 262080, 68634, 2.346406e-05),  # __TRIALS__
    (2.213074e-02, 241920, 63335, 2.222374e-05),  # __TRIALS__
    (1.044869e-02, 114240, 29997, 2.279230e-05),  # __TRIALS__
    (7.560277e-02, 826560, 216319, 1.376777e-05),  # __TRIALS__
]  # __TRIALS__
# Done.


PS:

Read file <main_filtered_error.798489.err> for stderr output of this job.

