Sender: LSF System <lsfadmin@polus-c1-ib.bmc.hpc.cs.msu.ru>
Subject: Job 862851: <source /polusfs/setenv/setup.SMPI;#BSUB -n 2;#BSUB -W 00:15;#BSUB -x;#BSUB -R "span[ptile=1]";#BSUB -o main.%J.out;#BSUB -e main.%J.err;OMP_NUM_THREADS=8 mpiexec main_omp 1 0.01 512 20> in cluster <MSUCluster> Done

Job <source /polusfs/setenv/setup.SMPI;#BSUB -n 2;#BSUB -W 00:15;#BSUB -x;#BSUB -R "span[ptile=1]";#BSUB -o main.%J.out;#BSUB -e main.%J.err;OMP_NUM_THREADS=8 mpiexec main_omp 1 0.01 512 20> was submitted from host <polus-ib.bmc.hpc.cs.msu.ru> by user <edu-cmc-skmodel21-622-16> in cluster <MSUCluster> at Fri Dec 24 08:09:29 2021
Job was executed on host(s) <1*polus-c1-ib.bmc.hpc.cs.msu.ru>, in queue <short>, as user <edu-cmc-skmodel21-622-16> in cluster <MSUCluster> at Fri Dec 24 08:11:57 2021
                            <1*polus-c4-ib.bmc.hpc.cs.msu.ru>
</home_edu/edu-cmc-skmodel21-622/edu-cmc-skmodel21-622-16> was used as the home directory.
</home_edu/edu-cmc-skmodel21-622/edu-cmc-skmodel21-622-16/solution_1> was used as the working directory.
Started at Fri Dec 24 08:11:57 2021
Terminated at Fri Dec 24 08:14:19 2021
Results reported at Fri Dec 24 08:14:19 2021

Your job looked like:

------------------------------------------------------------
# LSBATCH: User input
source /polusfs/setenv/setup.SMPI
#BSUB -n 2
#BSUB -W 00:15
#BSUB -x
#BSUB -R "span[ptile=1]"
#BSUB -o main.%J.out
#BSUB -e main.%J.err
OMP_NUM_THREADS=8 mpiexec main_omp 1 0.01 512 20

------------------------------------------------------------

Successfully completed.

Resource usage summary:

    CPU time :                                   2111.41 sec.
    Max Memory :                                 3257 MB
    Average Memory :                             2276.36 MB
    Total Requested Memory :                     -
    Delta Memory :                               -
    Max Swap :                                   -
    Max Processes :                              7
    Max Threads :                                33
    Run time :                                   146 sec.
    Turnaround time :                            290 sec.

The output (if any) follows:

__PARAMS__ = {'P': 2, 'O': 8, 'L': 1.000000e+00, 'T': 1.000000e-02, 'N': 512, 'K': 20}
=======================
__.world.size = 2;
__.world.rank = 0;

__.nodes.shape = {.x=512, .y=512, .z=512, .t=20};
__.nodes.bound = {.x=1.000000, .y=1.000000, .z=1.000000, .t=0.010000};
__.nodes.steps = {.x=0.001953, .y=0.001953, .z=0.001953, .t=0.000500};

__.param.period = {.x=1, .y=0, .z=0};
__.param.a = {.x=6.283185, .y=3.141593, .z=3.141593, .t=7.695299};
__.param.b = {.x=0.000000, .y=0.000000, .z=0.000000, .t=7.853982};

__.local.rank = 0;
__.local.shape = {.x=2, .y=1, .z=1};
__.local.coord = {.x=0, .y=0, .z=0};

__.block.shape = {.x=258, .y=514, .z=514};
__.block.coord = {.x=0, .y=0, .z=0};
__.block.elems = 68162568;

=======================
__.world.size = 2;
__.world.rank = 1;

__.nodes.shape = {.x=512, .y=512, .z=512, .t=20};
__.nodes.bound = {.x=1.000000, .y=1.000000, .z=1.000000, .t=0.010000};
__.nodes.steps = {.x=0.001953, .y=0.001953, .z=0.001953, .t=0.000500};

__.param.period = {.x=1, .y=0, .z=0};
__.param.a = {.x=6.283185, .y=3.141593, .z=3.141593, .t=7.695299};
__.param.b = {.x=0.000000, .y=0.000000, .z=0.000000, .t=7.853982};

__.local.rank = 1;
__.local.shape = {.x=2, .y=1, .z=1};
__.local.coord = {.x=1, .y=0, .z=0};

__.block.shape = {.x=258, .y=514, .z=514};
__.block.coord = {.x=256, .y=0, .z=0};
__.block.elems = 68162568;

__TRIALS__.append((1.422895e+01, [0.000000e+00, 6.054002e-11, 2.421581e-10, 5.448489e-10, 9.686038e-10, 1.513410e-09, 2.179251e-09, 2.966108e-09, 3.873957e-09, 4.902772e-09, 6.052521e-09, 7.323171e-09, 8.714684e-09, 1.022702e-08, 1.186013e-08, 1.361397e-08, 1.548849e-08, 1.748363e-08, 1.959933e-08, 2.183553e-08, 2.419216e-08, ]))
__TRIALS__.append((1.411396e+01, [0.000000e+00, 6.054002e-11, 2.421581e-10, 5.448489e-10, 9.686038e-10, 1.513410e-09, 2.179251e-09, 2.966108e-09, 3.873957e-09, 4.902772e-09, 6.052521e-09, 7.323171e-09, 8.714684e-09, 1.022702e-08, 1.186013e-08, 1.361397e-08, 1.548849e-08, 1.748363e-08, 1.959933e-08, 2.183553e-08, 2.419216e-08, ]))
__TRIALS__.append((1.413219e+01, [0.000000e+00, 6.054002e-11, 2.421581e-10, 5.448489e-10, 9.686038e-10, 1.513410e-09, 2.179251e-09, 2.966108e-09, 3.873957e-09, 4.902772e-09, 6.052521e-09, 7.323171e-09, 8.714684e-09, 1.022702e-08, 1.186013e-08, 1.361397e-08, 1.548849e-08, 1.748363e-08, 1.959933e-08, 2.183553e-08, 2.419216e-08, ]))
__TRIALS__.append((1.412291e+01, [0.000000e+00, 6.054002e-11, 2.421581e-10, 5.448489e-10, 9.686038e-10, 1.513410e-09, 2.179251e-09, 2.966108e-09, 3.873957e-09, 4.902772e-09, 6.052521e-09, 7.323171e-09, 8.714684e-09, 1.022702e-08, 1.186013e-08, 1.361397e-08, 1.548849e-08, 1.748363e-08, 1.959933e-08, 2.183553e-08, 2.419216e-08, ]))
__TRIALS__.append((1.410277e+01, [0.000000e+00, 6.054002e-11, 2.421581e-10, 5.448489e-10, 9.686038e-10, 1.513410e-09, 2.179251e-09, 2.966108e-09, 3.873957e-09, 4.902772e-09, 6.052521e-09, 7.323171e-09, 8.714684e-09, 1.022702e-08, 1.186013e-08, 1.361397e-08, 1.548849e-08, 1.748363e-08, 1.959933e-08, 2.183553e-08, 2.419216e-08, ]))
__TRIALS__.append((1.409382e+01, [0.000000e+00, 6.054002e-11, 2.421581e-10, 5.448489e-10, 9.686038e-10, 1.513410e-09, 2.179251e-09, 2.966108e-09, 3.873957e-09, 4.902772e-09, 6.052521e-09, 7.323171e-09, 8.714684e-09, 1.022702e-08, 1.186013e-08, 1.361397e-08, 1.548849e-08, 1.748363e-08, 1.959933e-08, 2.183553e-08, 2.419216e-08, ]))
__TRIALS__.append((1.411779e+01, [0.000000e+00, 6.054002e-11, 2.421581e-10, 5.448489e-10, 9.686038e-10, 1.513410e-09, 2.179251e-09, 2.966108e-09, 3.873957e-09, 4.902772e-09, 6.052521e-09, 7.323171e-09, 8.714684e-09, 1.022702e-08, 1.186013e-08, 1.361397e-08, 1.548849e-08, 1.748363e-08, 1.959933e-08, 2.183553e-08, 2.419216e-08, ]))
__TRIALS__.append((1.408901e+01, [0.000000e+00, 6.054002e-11, 2.421581e-10, 5.448489e-10, 9.686038e-10, 1.513410e-09, 2.179251e-09, 2.966108e-09, 3.873957e-09, 4.902772e-09, 6.052521e-09, 7.323171e-09, 8.714684e-09, 1.022702e-08, 1.186013e-08, 1.361397e-08, 1.548849e-08, 1.748363e-08, 1.959933e-08, 2.183553e-08, 2.419216e-08, ]))
__TRIALS__.append((1.409607e+01, [0.000000e+00, 6.054002e-11, 2.421581e-10, 5.448489e-10, 9.686038e-10, 1.513410e-09, 2.179251e-09, 2.966108e-09, 3.873957e-09, 4.902772e-09, 6.052521e-09, 7.323171e-09, 8.714684e-09, 1.022702e-08, 1.186013e-08, 1.361397e-08, 1.548849e-08, 1.748363e-08, 1.959933e-08, 2.183553e-08, 2.419216e-08, ]))
__TRIALS__.append((1.410887e+01, [0.000000e+00, 6.054002e-11, 2.421581e-10, 5.448489e-10, 9.686038e-10, 1.513410e-09, 2.179251e-09, 2.966108e-09, 3.873957e-09, 4.902772e-09, 6.052521e-09, 7.323171e-09, 8.714684e-09, 1.022702e-08, 1.186013e-08, 1.361397e-08, 1.548849e-08, 1.748363e-08, 1.959933e-08, 2.183553e-08, 2.419216e-08, ]))


PS:

Read file <main.862851.err> for stderr output of this job.

