Sender: LSF System <lsfadmin@polus-c3-ib.bmc.hpc.cs.msu.ru>
Subject: Job 805246: <# this file was automaticly created by mpisubmit.pl script for edu-cmc-skmodel21-622-16 #;source /polusfs/setenv/setup.SMPI;#BSUB -n 64;#BSUB -W 00:15;#BSUB -o main_filtered_error.%J.out;#BSUB -e main_filtered_error.%J.err;OMP_NUM_THREADS=1 mpiexec main_filtered_error 5.0e-6 42> in cluster <MSUCluster> Done

Job <# this file was automaticly created by mpisubmit.pl script for edu-cmc-skmodel21-622-16 #;source /polusfs/setenv/setup.SMPI;#BSUB -n 64;#BSUB -W 00:15;#BSUB -o main_filtered_error.%J.out;#BSUB -e main_filtered_error.%J.err;OMP_NUM_THREADS=1 mpiexec main_filtered_error 5.0e-6 42> was submitted from host <polus-ib.bmc.hpc.cs.msu.ru> by user <edu-cmc-skmodel21-622-16> in cluster <MSUCluster> at Mon Nov  8 23:35:14 2021
Job was executed on host(s) <19*polus-c3-ib.bmc.hpc.cs.msu.ru>, in queue <short>, as user <edu-cmc-skmodel21-622-16> in cluster <MSUCluster> at Mon Nov  8 23:35:15 2021
                            <20*polus-c4-ib.bmc.hpc.cs.msu.ru>
                            <20*polus-c1-ib.bmc.hpc.cs.msu.ru>
                            <5*polus-c2-ib.bmc.hpc.cs.msu.ru>
</home_edu/edu-cmc-skmodel21-622/edu-cmc-skmodel21-622-16> was used as the home directory.
</home_edu/edu-cmc-skmodel21-622/edu-cmc-skmodel21-622-16/solution> was used as the working directory.
Started at Mon Nov  8 23:35:15 2021
Terminated at Mon Nov  8 23:35:19 2021
Results reported at Mon Nov  8 23:35:19 2021

Your job looked like:

------------------------------------------------------------
# LSBATCH: User input
# this file was automaticly created by mpisubmit.pl script for edu-cmc-skmodel21-622-16 #
source /polusfs/setenv/setup.SMPI
#BSUB -n 64
#BSUB -W 00:15
#BSUB -o main_filtered_error.%J.out
#BSUB -e main_filtered_error.%J.err
OMP_NUM_THREADS=1 mpiexec main_filtered_error 5.0e-6 42

------------------------------------------------------------

Successfully completed.

Resource usage summary:

    CPU time :                                   64.26 sec.
    Max Memory :                                 312 MB
    Average Memory :                             208.33 MB
    Total Requested Memory :                     -
    Delta Memory :                               -
    Max Swap :                                   -
    Max Processes :                              23
    Max Threads :                                66
    Run time :                                   3 sec.
    Turnaround time :                            5 sec.

The output (if any) follows:

# Running __TRIALS__ with FILTERED_SAMPLING/ERROR_STOPPING and epsilon=5.000000e-06, comm_size=64, seed=42
__TRIALS__ = [
#   (trial_time, trial_iters, trial_points, trial_error),
    (5.985513e-01, 155554560, 40724366, 4.430772e-06),  # __TRIALS__
    (2.165211e-02, 7351680, 1924032, 8.403113e-07),  # __TRIALS__
    (1.776509e-03, 604800, 158402, 2.563621e-06),  # __TRIALS__
    (5.248353e-03, 1747200, 457455, 4.498125e-06),  # __TRIALS__
    (1.465348e-02, 4919040, 1288724, 1.776791e-06),  # __TRIALS__
    (1.589489e-02, 5369280, 1405146, 5.615865e-07),  # __TRIALS__
    (5.088143e-03, 1720320, 450062, 3.444636e-07),  # __TRIALS__
    (1.407232e-02, 4724160, 1237889, 3.806911e-06),  # __TRIALS__
    (1.169837e-02, 3904320, 1022111, 1.824039e-06),  # __TRIALS__
    (1.674107e-01, 55231680, 14458385, 3.211760e-06),  # __TRIALS__
]  # __TRIALS__
# Done.


PS:

Read file <main_filtered_error.805246.err> for stderr output of this job.

