Sender: LSF System <lsfadmin@polus-c3-ib.bmc.hpc.cs.msu.ru>
Subject: Job 862858: <source /polusfs/setenv/setup.SMPI;#BSUB -n 8;#BSUB -W 00:15;#BSUB -x;#BSUB -R "span[ptile=2]";#BSUB -o main.%J.out;#BSUB -e main.%J.err;OMP_NUM_THREADS=8 mpiexec main_omp 1 0.01 128 20> in cluster <MSUCluster> Done

Job <source /polusfs/setenv/setup.SMPI;#BSUB -n 8;#BSUB -W 00:15;#BSUB -x;#BSUB -R "span[ptile=2]";#BSUB -o main.%J.out;#BSUB -e main.%J.err;OMP_NUM_THREADS=8 mpiexec main_omp 1 0.01 128 20> was submitted from host <polus-ib.bmc.hpc.cs.msu.ru> by user <edu-cmc-skmodel21-622-16> in cluster <MSUCluster> at Fri Dec 24 08:18:02 2021
Job was executed on host(s) <2*polus-c3-ib.bmc.hpc.cs.msu.ru>, in queue <short>, as user <edu-cmc-skmodel21-622-16> in cluster <MSUCluster> at Fri Dec 24 08:18:12 2021
                            <2*polus-c1-ib.bmc.hpc.cs.msu.ru>
                            <2*polus-c4-ib.bmc.hpc.cs.msu.ru>
                            <2*polus-c2-ib.bmc.hpc.cs.msu.ru>
</home_edu/edu-cmc-skmodel21-622/edu-cmc-skmodel21-622-16> was used as the home directory.
</home_edu/edu-cmc-skmodel21-622/edu-cmc-skmodel21-622-16/solution_1> was used as the working directory.
Started at Fri Dec 24 08:18:12 2021
Terminated at Fri Dec 24 08:18:14 2021
Results reported at Fri Dec 24 08:18:14 2021

Your job looked like:

------------------------------------------------------------
# LSBATCH: User input
source /polusfs/setenv/setup.SMPI
#BSUB -n 8
#BSUB -W 00:15
#BSUB -x
#BSUB -R "span[ptile=2]"
#BSUB -o main.%J.out
#BSUB -e main.%J.err
OMP_NUM_THREADS=8 mpiexec main_omp 1 0.01 128 20

------------------------------------------------------------

Successfully completed.

Resource usage summary:

    CPU time :                                   39.56 sec.
    Max Memory :                                 139 MB
    Average Memory :                             93.00 MB
    Total Requested Memory :                     -
    Delta Memory :                               -
    Max Swap :                                   -
    Max Processes :                              6
    Max Threads :                                29
    Run time :                                   1 sec.
    Turnaround time :                            12 sec.

The output (if any) follows:

__PARAMS__ = {'P': 8, 'O': 8, 'L': 1.000000e+00, 'T': 1.000000e-02, 'N': 128, 'K': 20}
=======================
__.world.size = 8;
__.world.rank = 0;

__.nodes.shape = {.x=128, .y=128, .z=128, .t=20};
__.nodes.bound = {.x=1.000000, .y=1.000000, .z=1.000000, .t=0.010000};
__.nodes.steps = {.x=0.007812, .y=0.007812, .z=0.007812, .t=0.000500};

__.param.period = {.x=1, .y=0, .z=0};
__.param.a = {.x=6.283185, .y=3.141593, .z=3.141593, .t=7.695299};
__.param.b = {.x=0.000000, .y=0.000000, .z=0.000000, .t=7.853982};

__.local.rank = 0;
__.local.shape = {.x=2, .y=2, .z=2};
__.local.coord = {.x=0, .y=0, .z=0};

__.block.shape = {.x=66, .y=66, .z=66};
__.block.coord = {.x=0, .y=0, .z=0};
__.block.elems = 287496;

=======================
__.world.size = 8;
__.world.rank = 1;

__.nodes.shape = {.x=128, .y=128, .z=128, .t=20};
__.nodes.bound = {.x=1.000000, .y=1.000000, .z=1.000000, .t=0.010000};
__.nodes.steps = {.x=0.007812, .y=0.007812, .z=0.007812, .t=0.000500};

__.param.period = {.x=1, .y=0, .z=0};
__.param.a = {.x=6.283185, .y=3.141593, .z=3.141593, .t=7.695299};
__.param.b = {.x=0.000000, .y=0.000000, .z=0.000000, .t=7.853982};

__.local.rank = 1;
__.local.shape = {.x=2, .y=2, .z=2};
__.local.coord = {.x=0, .y=0, .z=1};

__.block.shape = {.x=66, .y=66, .z=66};
__.block.coord = {.x=0, .y=0, .z=64};
__.block.elems = 287496;

=======================
=======================
__.world.size = 8;
__.world.rank = 2;

__.nodes.shape = {.x=128, .y=128, .z=128, .t=20};
__.nodes.bound = {.x=1.000000, .y=1.000000, .z=1.000000, .t=0.010000};
__.nodes.steps = {.x=0.007812, .y=0.007812, .z=0.007812, .t=0.000500};

__.param.period = {.x=1, .y=0, .z=0};
__.param.a = {.x=6.283185, .y=3.141593, .z=3.141593, .t=7.695299};
__.param.b = {.x=0.000000, .y=0.000000, .z=0.000000, .t=7.853982};

__.local.rank = 2;
__.local.shape = {.x=2, .y=2, .z=2};
__.local.coord = {.x=0, .y=1, .z=0};

__.block.shape = {.x=66, .y=66, .z=66};
__.block.coord = {.x=0, .y=64, .z=0};
__.block.elems = 287496;

__.world.size = 8;
__.world.rank = 6;

__.nodes.shape = {.x=128, .y=128, .z=128, .t=20};
__.nodes.bound = {.x=1.000000, .y=1.000000, .z=1.000000, .t=0.010000};
__.nodes.steps = {.x=0.007812, .y=0.007812, .z=0.007812, .t=0.000500};

__.param.period = {.x=1, .y=0, .z=0};
__.param.a = {.x=6.283185, .y=3.141593, .z=3.141593, .t=7.695299};
__.param.b = {.x=0.000000, .y=0.000000, .z=0.000000, .t=7.853982};

__.local.rank = 6;
__.local.shape = {.x=2, .y=2, .z=2};
__.local.coord = {.x=1, .y=1, .z=0};

__.block.shape = {.x=66, .y=66, .z=66};
__.block.coord = {.x=64, .y=64, .z=0};
__.block.elems = 287496;

=======================
__.world.size = 8;
__.world.rank = 3;

__.nodes.shape = {.x=128, .y=128, .z=128, .t=20};
__.nodes.bound = {.x=1.000000, .y=1.000000, .z=1.000000, .t=0.010000};
__.nodes.steps = {.x=0.007812, .y=0.007812, .z=0.007812, .t=0.000500};

__.param.period = {.x=1, .y=0, .z=0};
__.param.a = {.x=6.283185, .y=3.141593, .z=3.141593, .t=7.695299};
__.param.b = {.x=0.000000, .y=0.000000, .z=0.000000, .t=7.853982};

__.local.rank = 3;
__.local.shape = {.x=2, .y=2, .z=2};
__.local.coord = {.x=0, .y=1, .z=1};

__.block.shape = {.x=66, .y=66, .z=66};
__.block.coord = {.x=0, .y=64, .z=64};
__.block.elems = 287496;

=======================
__.world.size = 8;
__.world.rank = 7;

__.nodes.shape = {.x=128, .y=128, .z=128, .t=20};
__.nodes.bound = {.x=1.000000, .y=1.000000, .z=1.000000, .t=0.010000};
__.nodes.steps = {.x=0.007812, .y=0.007812, .z=0.007812, .t=0.000500};

__.param.period = {.x=1, .y=0, .z=0};
__.param.a = {.x=6.283185, .y=3.141593, .z=3.141593, .t=7.695299};
__.param.b = {.x=0.000000, .y=0.000000, .z=0.000000, .t=7.853982};

__.local.rank = 7;
__.local.shape = {.x=2, .y=2, .z=2};
__.local.coord = {.x=1, .y=1, .z=1};

__.block.shape = {.x=66, .y=66, .z=66};
__.block.coord = {.x=64, .y=64, .z=64};
__.block.elems = 287496;

=======================
__.world.size = 8;
__.world.rank = 4;

__.nodes.shape = {.x=128, .y=128, .z=128, .t=20};
__.nodes.bound = {.x=1.000000, .y=1.000000, .z=1.000000, .t=0.010000};
__.nodes.steps = {.x=0.007812, .y=0.007812, .z=0.007812, .t=0.000500};

__.param.period = {.x=1, .y=0, .z=0};
__.param.a = {.x=6.283185, .y=3.141593, .z=3.141593, .t=7.695299};
__.param.b = {.x=0.000000, .y=0.000000, .z=0.000000, .t=7.853982};

__.local.rank = 4;
__.local.shape = {.x=2, .y=2, .z=2};
__.local.coord = {.x=1, .y=0, .z=0};

__.block.shape = {.x=66, .y=66, .z=66};
__.block.coord = {.x=64, .y=0, .z=0};
__.block.elems = 287496;

=======================
__.world.size = 8;
__.world.rank = 5;

__.nodes.shape = {.x=128, .y=128, .z=128, .t=20};
__.nodes.bound = {.x=1.000000, .y=1.000000, .z=1.000000, .t=0.010000};
__.nodes.steps = {.x=0.007812, .y=0.007812, .z=0.007812, .t=0.000500};

__.param.period = {.x=1, .y=0, .z=0};
__.param.a = {.x=6.283185, .y=3.141593, .z=3.141593, .t=7.695299};
__.param.b = {.x=0.000000, .y=0.000000, .z=0.000000, .t=7.853982};

__.local.rank = 5;
__.local.shape = {.x=2, .y=2, .z=2};
__.local.coord = {.x=1, .y=0, .z=1};

__.block.shape = {.x=66, .y=66, .z=66};
__.block.coord = {.x=64, .y=0, .z=64};
__.block.elems = 287496;

__TRIALS__.append((8.295698e-02, [0.000000e+00, 1.105544e-09, 4.422145e-09, 9.949703e-09, 1.768806e-08, 2.763697e-08, 3.979616e-08, 5.416526e-08, 7.074384e-08, 8.953142e-08, 1.105274e-07, 1.337313e-07, 1.591422e-07, 1.867596e-07, 2.165825e-07, 2.486100e-07, 2.828413e-07, 3.192754e-07, 3.579110e-07, 3.987471e-07, 4.417826e-07, ]))
__TRIALS__.append((6.937300e-02, [0.000000e+00, 1.105544e-09, 4.422145e-09, 9.949703e-09, 1.768806e-08, 2.763697e-08, 3.979616e-08, 5.416526e-08, 7.074384e-08, 8.953142e-08, 1.105274e-07, 1.337313e-07, 1.591422e-07, 1.867596e-07, 2.165825e-07, 2.486100e-07, 2.828413e-07, 3.192754e-07, 3.579110e-07, 3.987471e-07, 4.417826e-07, ]))
__TRIALS__.append((6.921253e-02, [0.000000e+00, 1.105544e-09, 4.422145e-09, 9.949703e-09, 1.768806e-08, 2.763697e-08, 3.979616e-08, 5.416526e-08, 7.074384e-08, 8.953142e-08, 1.105274e-07, 1.337313e-07, 1.591422e-07, 1.867596e-07, 2.165825e-07, 2.486100e-07, 2.828413e-07, 3.192754e-07, 3.579110e-07, 3.987471e-07, 4.417826e-07, ]))
__TRIALS__.append((6.885482e-02, [0.000000e+00, 1.105544e-09, 4.422145e-09, 9.949703e-09, 1.768806e-08, 2.763697e-08, 3.979616e-08, 5.416526e-08, 7.074384e-08, 8.953142e-08, 1.105274e-07, 1.337313e-07, 1.591422e-07, 1.867596e-07, 2.165825e-07, 2.486100e-07, 2.828413e-07, 3.192754e-07, 3.579110e-07, 3.987471e-07, 4.417826e-07, ]))
__TRIALS__.append((6.901625e-02, [0.000000e+00, 1.105544e-09, 4.422145e-09, 9.949703e-09, 1.768806e-08, 2.763697e-08, 3.979616e-08, 5.416526e-08, 7.074384e-08, 8.953142e-08, 1.105274e-07, 1.337313e-07, 1.591422e-07, 1.867596e-07, 2.165825e-07, 2.486100e-07, 2.828413e-07, 3.192754e-07, 3.579110e-07, 3.987471e-07, 4.417826e-07, ]))
__TRIALS__.append((7.070561e-02, [0.000000e+00, 1.105544e-09, 4.422145e-09, 9.949703e-09, 1.768806e-08, 2.763697e-08, 3.979616e-08, 5.416526e-08, 7.074384e-08, 8.953142e-08, 1.105274e-07, 1.337313e-07, 1.591422e-07, 1.867596e-07, 2.165825e-07, 2.486100e-07, 2.828413e-07, 3.192754e-07, 3.579110e-07, 3.987471e-07, 4.417826e-07, ]))
__TRIALS__.append((6.888815e-02, [0.000000e+00, 1.105544e-09, 4.422145e-09, 9.949703e-09, 1.768806e-08, 2.763697e-08, 3.979616e-08, 5.416526e-08, 7.074384e-08, 8.953142e-08, 1.105274e-07, 1.337313e-07, 1.591422e-07, 1.867596e-07, 2.165825e-07, 2.486100e-07, 2.828413e-07, 3.192754e-07, 3.579110e-07, 3.987471e-07, 4.417826e-07, ]))
__TRIALS__.append((6.879183e-02, [0.000000e+00, 1.105544e-09, 4.422145e-09, 9.949703e-09, 1.768806e-08, 2.763697e-08, 3.979616e-08, 5.416526e-08, 7.074384e-08, 8.953142e-08, 1.105274e-07, 1.337313e-07, 1.591422e-07, 1.867596e-07, 2.165825e-07, 2.486100e-07, 2.828413e-07, 3.192754e-07, 3.579110e-07, 3.987471e-07, 4.417826e-07, ]))
__TRIALS__.append((6.882653e-02, [0.000000e+00, 1.105544e-09, 4.422145e-09, 9.949703e-09, 1.768806e-08, 2.763697e-08, 3.979616e-08, 5.416526e-08, 7.074384e-08, 8.953142e-08, 1.105274e-07, 1.337313e-07, 1.591422e-07, 1.867596e-07, 2.165825e-07, 2.486100e-07, 2.828413e-07, 3.192754e-07, 3.579110e-07, 3.987471e-07, 4.417826e-07, ]))
__TRIALS__.append((6.875203e-02, [0.000000e+00, 1.105544e-09, 4.422145e-09, 9.949703e-09, 1.768806e-08, 2.763697e-08, 3.979616e-08, 5.416526e-08, 7.074384e-08, 8.953142e-08, 1.105274e-07, 1.337313e-07, 1.591422e-07, 1.867596e-07, 2.165825e-07, 2.486100e-07, 2.828413e-07, 3.192754e-07, 3.579110e-07, 3.987471e-07, 4.417826e-07, ]))


PS:

Read file <main.862858.err> for stderr output of this job.

