__PARAMS__ = {'P': 64, 'O': 4, 'L': 1.000000e+00, 'T': 1.000000e-02, 'N': 512, 'K': 20}
=======================
__.world.size = 64;
__.world.rank = 0;

__.nodes.shape = {.x=512, .y=512, .z=512, .t=20};
__.nodes.bound = {.x=1.000000, .y=1.000000, .z=1.000000, .t=0.010000};
__.nodes.steps = {.x=0.001953, .y=0.001953, .z=0.001953, .t=0.000500};

__.param.period = {.x=1, .y=0, .z=0};
__.param.a = {.x=6.283185, .y=3.141593, .z=3.141593, .t=7.695299};
__.param.b = {.x=0.000000, .y=0.000000, .z=0.000000, .t=7.853982};

__.local.rank = 0;
__.local.shape = {.x=4, .y=4, .z=4};
__.local.coord = {.x=0, .y=0, .z=0};

__.block.shape = {.x=130, .y=130, .z=130};
__.block.coord = {.x=0, .y=0, .z=0};
__.block.elems = 2197000;

=======================
__.world.size = 64;
__.world.rank = 1;

__.nodes.shape = {.x=512, .y=512, .z=512, .t=20};
__.nodes.bound = {.x=1.000000, .y=1.000000, .z=1.000000, .t=0.010000};
__.nodes.steps = {.x=0.001953, .y=0.001953, .z=0.001953, .t=0.000500};

__.param.period = {.x=1, .y=0, .z=0};
__.param.a = {.x=6.283185, .y=3.141593, .z=3.141593, .t=7.695299};
__.param.b = {.x=0.000000, .y=0.000000, .z=0.000000, .t=7.853982};

__.local.rank = 1;
__.local.shape = {.x=4, .y=4, .z=4};
__.local.coord = {.x=0, .y=0, .z=1};

__.block.shape = {.x=130, .y=130, .z=130};
__.block.coord = {.x=0, .y=0, .z=128};
__.block.elems = 2197000;

=======================
__.world.size = 64;
__.world.rank = 2;

__.nodes.shape = {.x=512, .y=512, .z=512, .t=20};
__.nodes.bound = {.x=1.000000, .y=1.000000, .z=1.000000, .t=0.010000};
__.nodes.steps = {.x=0.001953, .y=0.001953, .z=0.001953, .t=0.000500};

__.param.period = {.x=1, .y=0, .z=0};
__.param.a = {.x=6.283185, .y=3.141593, .z=3.141593, .t=7.695299};
__.param.b = {.x=0.000000, .y=0.000000, .z=0.000000, .t=7.853982};

__.local.rank = 2;
__.local.shape = {.x=4, .y=4, .z=4};
__.local.coord = {.x=0, .y=0, .z=2};

__.block.shape = {.x=130, .y=130, .z=130};
__.block.coord = {.x=0, .y=0, .z=256};
__.block.elems = 2197000;

=======================
__.world.size = 64;
__.world.rank = 3;

__.nodes.shape = {.x=512, .y=512, .z=512, .t=20};
__.nodes.bound = {.x=1.000000, .y=1.000000, .z=1.000000, .t=0.010000};
__.nodes.steps = {.x=0.001953, .y=0.001953, .z=0.001953, .t=0.000500};

__.param.period = {.x=1, .y=0, .z=0};
__.param.a = {.x=6.283185, .y=3.141593, .z=3.141593, .t=7.695299};
__.param.b = {.x=0.000000, .y=0.000000, .z=0.000000, .t=7.853982};

__.local.rank = 3;
__.local.shape = {.x=4, .y=4, .z=4};
__.local.coord = {.x=0, .y=0, .z=3};

__.block.shape = {.x=130, .y=130, .z=130};
__.block.coord = {.x=0, .y=0, .z=384};
__.block.elems = 2197000;

=======================
__.world.size = 64;
__.world.rank = 4;

__.nodes.shape = {.x=512, .y=512, .z=512, .t=20};
__.nodes.bound = {.x=1.000000, .y=1.000000, .z=1.000000, .t=0.010000};
__.nodes.steps = {.x=0.001953, .y=0.001953, .z=0.001953, .t=0.000500};

__.param.period = {.x=1, .y=0, .z=0};
__.param.a = {.x=6.283185, .y=3.141593, .z=3.141593, .t=7.695299};
__.param.b = {.x=0.000000, .y=0.000000, .z=0.000000, .t=7.853982};

__.local.rank = 4;
__.local.shape = {.x=4, .y=4, .z=4};
__.local.coord = {.x=0, .y=1, .z=0};

__.block.shape = {.x=130, .y=130, .z=130};
__.block.coord = {.x=0, .y=128, .z=0};
__.block.elems = 2197000;

=======================
__.world.size = 64;
__.world.rank = 5;

__.nodes.shape = {.x=512, .y=512, .z=512, .t=20};
__.nodes.bound = {.x=1.000000, .y=1.000000, .z=1.000000, .t=0.010000};
__.nodes.steps = {.x=0.001953, .y=0.001953, .z=0.001953, .t=0.000500};

__.param.period = {.x=1, .y=0, .z=0};
__.param.a = {.x=6.283185, .y=3.141593, .z=3.141593, .t=7.695299};
__.param.b = {.x=0.000000, .y=0.000000, .z=0.000000, .t=7.853982};

__.local.rank = 5;
__.local.shape = {.x=4, .y=4, .z=4};
__.local.coord = {.x=0, .y=1, .z=1};

__.block.shape = {.x=130, .y=130, .z=130};
__.block.coord = {.x=0, .y=128, .z=128};
__.block.elems = 2197000;

=======================
__.world.size = 64;
__.world.rank = 6;

__.nodes.shape = {.x=512, .y=512, .z=512, .t=20};
__.nodes.bound = {.x=1.000000, .y=1.000000, .z=1.000000, .t=0.010000};
__.nodes.steps = {.x=0.001953, .y=0.001953, .z=0.001953, .t=0.000500};

__.param.period = {.x=1, .y=0, .z=0};
__.param.a = {.x=6.283185, .y=3.141593, .z=3.141593, .t=7.695299};
__.param.b = {.x=0.000000, .y=0.000000, .z=0.000000, .t=7.853982};

__.local.rank = 6;
__.local.shape = {.x=4, .y=4, .z=4};
__.local.coord = {.x=0, .y=1, .z=2};

__.block.shape = {.x=130, .y=130, .z=130};
__.block.coord = {.x=0, .y=128, .z=256};
__.block.elems = 2197000;

=======================
__.world.size = 64;
__.world.rank = 7;

__.nodes.shape = {.x=512, .y=512, .z=512, .t=20};
__.nodes.bound = {.x=1.000000, .y=1.000000, .z=1.000000, .t=0.010000};
__.nodes.steps = {.x=0.001953, .y=0.001953, .z=0.001953, .t=0.000500};

__.param.period = {.x=1, .y=0, .z=0};
__.param.a = {.x=6.283185, .y=3.141593, .z=3.141593, .t=7.695299};
__.param.b = {.x=0.000000, .y=0.000000, .z=0.000000, .t=7.853982};

__.local.rank = 7;
__.local.shape = {.x=4, .y=4, .z=4};
__.local.coord = {.x=0, .y=1, .z=3};

__.block.shape = {.x=130, .y=130, .z=130};
__.block.coord = {.x=0, .y=128, .z=384};
__.block.elems = 2197000;

=======================
__.world.size = 64;
__.world.rank = 8;

__.nodes.shape = {.x=512, .y=512, .z=512, .t=20};
__.nodes.bound = {.x=1.000000, .y=1.000000, .z=1.000000, .t=0.010000};
__.nodes.steps = {.x=0.001953, .y=0.001953, .z=0.001953, .t=0.000500};

__.param.period = {.x=1, .y=0, .z=0};
__.param.a = {.x=6.283185, .y=3.141593, .z=3.141593, .t=7.695299};
__.param.b = {.x=0.000000, .y=0.000000, .z=0.000000, .t=7.853982};

__.local.rank = 8;
__.local.shape = {.x=4, .y=4, .z=4};
__.local.coord = {.x=0, .y=2, .z=0};

__.block.shape = {.x=130, .y=130, .z=130};
__.block.coord = {.x=0, .y=256, .z=0};
__.block.elems = 2197000;

=======================
__.world.size = 64;
__.world.rank = 9;

__.nodes.shape = {.x=512, .y=512, .z=512, .t=20};
__.nodes.bound = {.x=1.000000, .y=1.000000, .z=1.000000, .t=0.010000};
__.nodes.steps = {.x=0.001953, .y=0.001953, .z=0.001953, .t=0.000500};

__.param.period = {.x=1, .y=0, .z=0};
__.param.a = {.x=6.283185, .y=3.141593, .z=3.141593, .t=7.695299};
__.param.b = {.x=0.000000, .y=0.000000, .z=0.000000, .t=7.853982};

__.local.rank = 9;
__.local.shape = {.x=4, .y=4, .z=4};
__.local.coord = {.x=0, .y=2, .z=1};

__.block.shape = {.x=130, .y=130, .z=130};
__.block.coord = {.x=0, .y=256, .z=128};
__.block.elems = 2197000;

=======================
__.world.size = 64;
__.world.rank = 10;

__.nodes.shape = {.x=512, .y=512, .z=512, .t=20};
__.nodes.bound = {.x=1.000000, .y=1.000000, .z=1.000000, .t=0.010000};
__.nodes.steps = {.x=0.001953, .y=0.001953, .z=0.001953, .t=0.000500};

__.param.period = {.x=1, .y=0, .z=0};
__.param.a = {.x=6.283185, .y=3.141593, .z=3.141593, .t=7.695299};
__.param.b = {.x=0.000000, .y=0.000000, .z=0.000000, .t=7.853982};

__.local.rank = 10;
__.local.shape = {.x=4, .y=4, .z=4};
__.local.coord = {.x=0, .y=2, .z=2};

__.block.shape = {.x=130, .y=130, .z=130};
__.block.coord = {.x=0, .y=256, .z=256};
__.block.elems = 2197000;

=======================
__.world.size = 64;
__.world.rank = 11;

__.nodes.shape = {.x=512, .y=512, .z=512, .t=20};
__.nodes.bound = {.x=1.000000, .y=1.000000, .z=1.000000, .t=0.010000};
__.nodes.steps = {.x=0.001953, .y=0.001953, .z=0.001953, .t=0.000500};

__.param.period = {.x=1, .y=0, .z=0};
__.param.a = {.x=6.283185, .y=3.141593, .z=3.141593, .t=7.695299};
__.param.b = {.x=0.000000, .y=0.000000, .z=0.000000, .t=7.853982};

__.local.rank = 11;
__.local.shape = {.x=4, .y=4, .z=4};
__.local.coord = {.x=0, .y=2, .z=3};

__.block.shape = {.x=130, .y=130, .z=130};
__.block.coord = {.x=0, .y=256, .z=384};
__.block.elems = 2197000;

=======================
__.world.size = 64;
__.world.rank = 12;

__.nodes.shape = {.x=512, .y=512, .z=512, .t=20};
__.nodes.bound = {.x=1.000000, .y=1.000000, .z=1.000000, .t=0.010000};
__.nodes.steps = {.x=0.001953, .y=0.001953, .z=0.001953, .t=0.000500};

__.param.period = {.x=1, .y=0, .z=0};
__.param.a = {.x=6.283185, .y=3.141593, .z=3.141593, .t=7.695299};
__.param.b = {.x=0.000000, .y=0.000000, .z=0.000000, .t=7.853982};

__.local.rank = 12;
__.local.shape = {.x=4, .y=4, .z=4};
__.local.coord = {.x=0, .y=3, .z=0};

__.block.shape = {.x=130, .y=130, .z=130};
__.block.coord = {.x=0, .y=384, .z=0};
__.block.elems = 2197000;

=======================
__.world.size = 64;
__.world.rank = 13;

__.nodes.shape = {.x=512, .y=512, .z=512, .t=20};
__.nodes.bound = {.x=1.000000, .y=1.000000, .z=1.000000, .t=0.010000};
__.nodes.steps = {.x=0.001953, .y=0.001953, .z=0.001953, .t=0.000500};

__.param.period = {.x=1, .y=0, .z=0};
__.param.a = {.x=6.283185, .y=3.141593, .z=3.141593, .t=7.695299};
__.param.b = {.x=0.000000, .y=0.000000, .z=0.000000, .t=7.853982};

__.local.rank = 13;
__.local.shape = {.x=4, .y=4, .z=4};
__.local.coord = {.x=0, .y=3, .z=1};

__.block.shape = {.x=130, .y=130, .z=130};
__.block.coord = {.x=0, .y=384, .z=128};
__.block.elems = 2197000;

=======================
__.world.size = 64;
__.world.rank = 14;

__.nodes.shape = {.x=512, .y=512, .z=512, .t=20};
__.nodes.bound = {.x=1.000000, .y=1.000000, .z=1.000000, .t=0.010000};
__.nodes.steps = {.x=0.001953, .y=0.001953, .z=0.001953, .t=0.000500};

__.param.period = {.x=1, .y=0, .z=0};
__.param.a = {.x=6.283185, .y=3.141593, .z=3.141593, .t=7.695299};
__.param.b = {.x=0.000000, .y=0.000000, .z=0.000000, .t=7.853982};

__.local.rank = 14;
__.local.shape = {.x=4, .y=4, .z=4};
__.local.coord = {.x=0, .y=3, .z=2};

__.block.shape = {.x=130, .y=130, .z=130};
__.block.coord = {.x=0, .y=384, .z=256};
__.block.elems = 2197000;

=======================
__.world.size = 64;
__.world.rank = 15;

__.nodes.shape = {.x=512, .y=512, .z=512, .t=20};
__.nodes.bound = {.x=1.000000, .y=1.000000, .z=1.000000, .t=0.010000};
__.nodes.steps = {.x=0.001953, .y=0.001953, .z=0.001953, .t=0.000500};

__.param.period = {.x=1, .y=0, .z=0};
__.param.a = {.x=6.283185, .y=3.141593, .z=3.141593, .t=7.695299};
__.param.b = {.x=0.000000, .y=0.000000, .z=0.000000, .t=7.853982};

__.local.rank = 15;
__.local.shape = {.x=4, .y=4, .z=4};
__.local.coord = {.x=0, .y=3, .z=3};

__.block.shape = {.x=130, .y=130, .z=130};
__.block.coord = {.x=0, .y=384, .z=384};
__.block.elems = 2197000;

=======================
__.world.size = 64;
__.world.rank = 16;

__.nodes.shape = {.x=512, .y=512, .z=512, .t=20};
__.nodes.bound = {.x=1.000000, .y=1.000000, .z=1.000000, .t=0.010000};
__.nodes.steps = {.x=0.001953, .y=0.001953, .z=0.001953, .t=0.000500};

__.param.period = {.x=1, .y=0, .z=0};
__.param.a = {.x=6.283185, .y=3.141593, .z=3.141593, .t=7.695299};
__.param.b = {.x=0.000000, .y=0.000000, .z=0.000000, .t=7.853982};

__.local.rank = 16;
__.local.shape = {.x=4, .y=4, .z=4};
__.local.coord = {.x=1, .y=0, .z=0};

__.block.shape = {.x=130, .y=130, .z=130};
__.block.coord = {.x=128, .y=0, .z=0};
__.block.elems = 2197000;

=======================
__.world.size = 64;
__.world.rank = 17;

__.nodes.shape = {.x=512, .y=512, .z=512, .t=20};
__.nodes.bound = {.x=1.000000, .y=1.000000, .z=1.000000, .t=0.010000};
__.nodes.steps = {.x=0.001953, .y=0.001953, .z=0.001953, .t=0.000500};

__.param.period = {.x=1, .y=0, .z=0};
__.param.a = {.x=6.283185, .y=3.141593, .z=3.141593, .t=7.695299};
__.param.b = {.x=0.000000, .y=0.000000, .z=0.000000, .t=7.853982};

__.local.rank = 17;
__.local.shape = {.x=4, .y=4, .z=4};
__.local.coord = {.x=1, .y=0, .z=1};

__.block.shape = {.x=130, .y=130, .z=130};
__.block.coord = {.x=128, .y=0, .z=128};
__.block.elems = 2197000;

=======================
__.world.size = 64;
__.world.rank = 18;

__.nodes.shape = {.x=512, .y=512, .z=512, .t=20};
__.nodes.bound = {.x=1.000000, .y=1.000000, .z=1.000000, .t=0.010000};
__.nodes.steps = {.x=0.001953, .y=0.001953, .z=0.001953, .t=0.000500};

__.param.period = {.x=1, .y=0, .z=0};
__.param.a = {.x=6.283185, .y=3.141593, .z=3.141593, .t=7.695299};
__.param.b = {.x=0.000000, .y=0.000000, .z=0.000000, .t=7.853982};

__.local.rank = 18;
__.local.shape = {.x=4, .y=4, .z=4};
__.local.coord = {.x=1, .y=0, .z=2};

__.block.shape = {.x=130, .y=130, .z=130};
__.block.coord = {.x=128, .y=0, .z=256};
__.block.elems = 2197000;

=======================
__.world.size = 64;
__.world.rank = 19;

__.nodes.shape = {.x=512, .y=512, .z=512, .t=20};
__.nodes.bound = {.x=1.000000, .y=1.000000, .z=1.000000, .t=0.010000};
__.nodes.steps = {.x=0.001953, .y=0.001953, .z=0.001953, .t=0.000500};

__.param.period = {.x=1, .y=0, .z=0};
__.param.a = {.x=6.283185, .y=3.141593, .z=3.141593, .t=7.695299};
__.param.b = {.x=0.000000, .y=0.000000, .z=0.000000, .t=7.853982};

__.local.rank = 19;
__.local.shape = {.x=4, .y=4, .z=4};
__.local.coord = {.x=1, .y=0, .z=3};

__.block.shape = {.x=130, .y=130, .z=130};
__.block.coord = {.x=128, .y=0, .z=384};
__.block.elems = 2197000;

=======================
__.world.size = 64;
__.world.rank = 20;

__.nodes.shape = {.x=512, .y=512, .z=512, .t=20};
__.nodes.bound = {.x=1.000000, .y=1.000000, .z=1.000000, .t=0.010000};
__.nodes.steps = {.x=0.001953, .y=0.001953, .z=0.001953, .t=0.000500};

__.param.period = {.x=1, .y=0, .z=0};
__.param.a = {.x=6.283185, .y=3.141593, .z=3.141593, .t=7.695299};
__.param.b = {.x=0.000000, .y=0.000000, .z=0.000000, .t=7.853982};

__.local.rank = 20;
__.local.shape = {.x=4, .y=4, .z=4};
__.local.coord = {.x=1, .y=1, .z=0};

__.block.shape = {.x=130, .y=130, .z=130};
__.block.coord = {.x=128, .y=128, .z=0};
__.block.elems = 2197000;

=======================
__.world.size = 64;
__.world.rank = 21;

__.nodes.shape = {.x=512, .y=512, .z=512, .t=20};
__.nodes.bound = {.x=1.000000, .y=1.000000, .z=1.000000, .t=0.010000};
__.nodes.steps = {.x=0.001953, .y=0.001953, .z=0.001953, .t=0.000500};

__.param.period = {.x=1, .y=0, .z=0};
__.param.a = {.x=6.283185, .y=3.141593, .z=3.141593, .t=7.695299};
__.param.b = {.x=0.000000, .y=0.000000, .z=0.000000, .t=7.853982};

__.local.rank = 21;
__.local.shape = {.x=4, .y=4, .z=4};
__.local.coord = {.x=1, .y=1, .z=1};

__.block.shape = {.x=130, .y=130, .z=130};
__.block.coord = {.x=128, .y=128, .z=128};
__.block.elems = 2197000;

=======================
__.world.size = 64;
__.world.rank = 22;

__.nodes.shape = {.x=512, .y=512, .z=512, .t=20};
__.nodes.bound = {.x=1.000000, .y=1.000000, .z=1.000000, .t=0.010000};
__.nodes.steps = {.x=0.001953, .y=0.001953, .z=0.001953, .t=0.000500};

__.param.period = {.x=1, .y=0, .z=0};
__.param.a = {.x=6.283185, .y=3.141593, .z=3.141593, .t=7.695299};
__.param.b = {.x=0.000000, .y=0.000000, .z=0.000000, .t=7.853982};

__.local.rank = 22;
__.local.shape = {.x=4, .y=4, .z=4};
__.local.coord = {.x=1, .y=1, .z=2};

__.block.shape = {.x=130, .y=130, .z=130};
__.block.coord = {.x=128, .y=128, .z=256};
__.block.elems = 2197000;

=======================
__.world.size = 64;
__.world.rank = 23;

__.nodes.shape = {.x=512, .y=512, .z=512, .t=20};
__.nodes.bound = {.x=1.000000, .y=1.000000, .z=1.000000, .t=0.010000};
__.nodes.steps = {.x=0.001953, .y=0.001953, .z=0.001953, .t=0.000500};

__.param.period = {.x=1, .y=0, .z=0};
__.param.a = {.x=6.283185, .y=3.141593, .z=3.141593, .t=7.695299};
__.param.b = {.x=0.000000, .y=0.000000, .z=0.000000, .t=7.853982};

__.local.rank = 23;
__.local.shape = {.x=4, .y=4, .z=4};
__.local.coord = {.x=1, .y=1, .z=3};

__.block.shape = {.x=130, .y=130, .z=130};
__.block.coord = {.x=128, .y=128, .z=384};
__.block.elems = 2197000;

=======================
__.world.size = 64;
__.world.rank = 24;

__.nodes.shape = {.x=512, .y=512, .z=512, .t=20};
__.nodes.bound = {.x=1.000000, .y=1.000000, .z=1.000000, .t=0.010000};
__.nodes.steps = {.x=0.001953, .y=0.001953, .z=0.001953, .t=0.000500};

__.param.period = {.x=1, .y=0, .z=0};
__.param.a = {.x=6.283185, .y=3.141593, .z=3.141593, .t=7.695299};
__.param.b = {.x=0.000000, .y=0.000000, .z=0.000000, .t=7.853982};

__.local.rank = 24;
__.local.shape = {.x=4, .y=4, .z=4};
__.local.coord = {.x=1, .y=2, .z=0};

__.block.shape = {.x=130, .y=130, .z=130};
__.block.coord = {.x=128, .y=256, .z=0};
__.block.elems = 2197000;

=======================
__.world.size = 64;
__.world.rank = 25;

__.nodes.shape = {.x=512, .y=512, .z=512, .t=20};
__.nodes.bound = {.x=1.000000, .y=1.000000, .z=1.000000, .t=0.010000};
__.nodes.steps = {.x=0.001953, .y=0.001953, .z=0.001953, .t=0.000500};

__.param.period = {.x=1, .y=0, .z=0};
__.param.a = {.x=6.283185, .y=3.141593, .z=3.141593, .t=7.695299};
__.param.b = {.x=0.000000, .y=0.000000, .z=0.000000, .t=7.853982};

__.local.rank = 25;
__.local.shape = {.x=4, .y=4, .z=4};
__.local.coord = {.x=1, .y=2, .z=1};

__.block.shape = {.x=130, .y=130, .z=130};
__.block.coord = {.x=128, .y=256, .z=128};
__.block.elems = 2197000;

=======================
__.world.size = 64;
__.world.rank = 26;

__.nodes.shape = {.x=512, .y=512, .z=512, .t=20};
__.nodes.bound = {.x=1.000000, .y=1.000000, .z=1.000000, .t=0.010000};
__.nodes.steps = {.x=0.001953, .y=0.001953, .z=0.001953, .t=0.000500};

__.param.period = {.x=1, .y=0, .z=0};
__.param.a = {.x=6.283185, .y=3.141593, .z=3.141593, .t=7.695299};
=======================
__.param.b = {.x=0.000000, .y=0.000000, .z=0.000000, .t=7.853982};

__.local.rank = 26;
__.local.shape = {.x=4, .y=4, .z=4};
__.local.coord = {.x=1, .y=2, .z=2};
__.world.size = 64;

__.world.rank = 32;
__.block.shape = {.x=130, .y=130, .z=130};

__.block.coord = {.x=128, .y=256, .z=256};
__.nodes.shape = {.x=512, .y=512, .z=512, .t=20};
__.block.elems = 2197000;
__.nodes.bound = {.x=1.000000, .y=1.000000, .z=1.000000, .t=0.010000};

__.nodes.steps = {.x=0.001953, .y=0.001953, .z=0.001953, .t=0.000500};
=======================

__.world.size = 64;
__.param.period = {.x=1, .y=0, .z=0};
__.world.rank = 27;
__.param.a = {.x=6.283185, .y=3.141593, .z=3.141593, .t=7.695299};

__.param.b = {.x=0.000000, .y=0.000000, .z=0.000000, .t=7.853982};
__.nodes.shape = {.x=512, .y=512, .z=512, .t=20};

__.nodes.bound = {.x=1.000000, .y=1.000000, .z=1.000000, .t=0.010000};
__.local.rank = 32;
__.nodes.steps = {.x=0.001953, .y=0.001953, .z=0.001953, .t=0.000500};
__.local.shape = {.x=4, .y=4, .z=4};

__.local.coord = {.x=2, .y=0, .z=0};
__.param.period = {.x=1, .y=0, .z=0};

__.param.a = {.x=6.283185, .y=3.141593, .z=3.141593, .t=7.695299};
__.block.shape = {.x=130, .y=130, .z=130};
__.param.b = {.x=0.000000, .y=0.000000, .z=0.000000, .t=7.853982};
__.block.coord = {.x=256, .y=0, .z=0};

__.block.elems = 2197000;
__.local.rank = 27;

__.local.shape = {.x=4, .y=4, .z=4};
__.local.coord = {.x=1, .y=2, .z=3};

__.block.shape = {.x=130, .y=130, .z=130};
=======================
__.block.coord = {.x=128, .y=256, .z=384};
__.world.size = 64;
__.block.elems = 2197000;
__.world.rank = 33;


=======================
__.nodes.shape = {.x=512, .y=512, .z=512, .t=20};
__.world.size = 64;
__.nodes.bound = {.x=1.000000, .y=1.000000, .z=1.000000, .t=0.010000};
__.world.rank = 28;
__.nodes.steps = {.x=0.001953, .y=0.001953, .z=0.001953, .t=0.000500};


__.nodes.shape = {.x=512, .y=512, .z=512, .t=20};
__.param.period = {.x=1, .y=0, .z=0};
__.nodes.bound = {.x=1.000000, .y=1.000000, .z=1.000000, .t=0.010000};
__.param.a = {.x=6.283185, .y=3.141593, .z=3.141593, .t=7.695299};
__.nodes.steps = {.x=0.001953, .y=0.001953, .z=0.001953, .t=0.000500};
__.param.b = {.x=0.000000, .y=0.000000, .z=0.000000, .t=7.853982};


__.param.period = {.x=1, .y=0, .z=0};
__.local.rank = 33;
__.param.a = {.x=6.283185, .y=3.141593, .z=3.141593, .t=7.695299};
__.local.shape = {.x=4, .y=4, .z=4};
__.param.b = {.x=0.000000, .y=0.000000, .z=0.000000, .t=7.853982};
__.local.coord = {.x=2, .y=0, .z=1};


__.local.rank = 28;
__.block.shape = {.x=130, .y=130, .z=130};
__.local.shape = {.x=4, .y=4, .z=4};
__.block.coord = {.x=256, .y=0, .z=128};
__.local.coord = {.x=1, .y=3, .z=0};
__.block.elems = 2197000;

__.block.shape = {.x=130, .y=130, .z=130};
__.block.coord = {.x=128, .y=384, .z=0};
__.block.elems = 2197000;


=======================
=======================
__.world.size = 64;
__.world.size = 64;
__.world.rank = 34;
__.world.rank = 29;


__.nodes.shape = {.x=512, .y=512, .z=512, .t=20};
__.nodes.shape = {.x=512, .y=512, .z=512, .t=20};
__.nodes.bound = {.x=1.000000, .y=1.000000, .z=1.000000, .t=0.010000};
__.nodes.bound = {.x=1.000000, .y=1.000000, .z=1.000000, .t=0.010000};
__.nodes.steps = {.x=0.001953, .y=0.001953, .z=0.001953, .t=0.000500};
__.nodes.steps = {.x=0.001953, .y=0.001953, .z=0.001953, .t=0.000500};


__.param.period = {.x=1, .y=0, .z=0};
__.param.period = {.x=1, .y=0, .z=0};
__.param.a = {.x=6.283185, .y=3.141593, .z=3.141593, .t=7.695299};
__.param.a = {.x=6.283185, .y=3.141593, .z=3.141593, .t=7.695299};
__.param.b = {.x=0.000000, .y=0.000000, .z=0.000000, .t=7.853982};
__.param.b = {.x=0.000000, .y=0.000000, .z=0.000000, .t=7.853982};


__.local.rank = 34;
__.local.rank = 29;
__.local.shape = {.x=4, .y=4, .z=4};
__.local.shape = {.x=4, .y=4, .z=4};
__.local.coord = {.x=2, .y=0, .z=2};
__.local.coord = {.x=1, .y=3, .z=1};


__.block.shape = {.x=130, .y=130, .z=130};
__.block.shape = {.x=130, .y=130, .z=130};
__.block.coord = {.x=256, .y=0, .z=256};
__.block.coord = {.x=128, .y=384, .z=128};
__.block.elems = 2197000;

__.block.elems = 2197000;
=======================

__.world.size = 64;
=======================
__.world.rank = 30;
__.world.size = 64;

__.world.rank = 35;
__.nodes.shape = {.x=512, .y=512, .z=512, .t=20};

__.nodes.bound = {.x=1.000000, .y=1.000000, .z=1.000000, .t=0.010000};
__.nodes.shape = {.x=512, .y=512, .z=512, .t=20};
__.nodes.steps = {.x=0.001953, .y=0.001953, .z=0.001953, .t=0.000500};
__.nodes.bound = {.x=1.000000, .y=1.000000, .z=1.000000, .t=0.010000};
__.nodes.steps = {.x=0.001953, .y=0.001953, .z=0.001953, .t=0.000500};

__.param.period = {.x=1, .y=0, .z=0};
__.param.a = {.x=6.283185, .y=3.141593, .z=3.141593, .t=7.695299};
__.param.b = {.x=0.000000, .y=0.000000, .z=0.000000, .t=7.853982};

__.local.rank = 35;
__.local.shape = {.x=4, .y=4, .z=4};
__.local.coord = {.x=2, .y=0, .z=3};

__.block.shape = {.x=130, .y=130, .z=130};
__.block.coord = {.x=256, .y=0, .z=384};
__.block.elems = 2197000;

=======================
__.world.size = 64;
__.world.rank = 36;

__.nodes.shape = {.x=512, .y=512, .z=512, .t=20};
__.nodes.bound = {.x=1.000000, .y=1.000000, .z=1.000000, .t=0.010000};
__.nodes.steps = {.x=0.001953, .y=0.001953, .z=0.001953, .t=0.000500};

__.param.period = {.x=1, .y=0, .z=0};
__.param.a = {.x=6.283185, .y=3.141593, .z=3.141593, .t=7.695299};
__.param.b = {.x=0.000000, .y=0.000000, .z=0.000000, .t=7.853982};

__.local.rank = 36;
__.local.shape = {.x=4, .y=4, .z=4};
__.local.coord = {.x=2, .y=1, .z=0};

__.block.shape = {.x=130, .y=130, .z=130};
__.block.coord = {.x=256, .y=128, .z=0};
__.block.elems = 2197000;

=======================
__.world.size = 64;
__.world.rank = 37;

__.nodes.shape = {.x=512, .y=512, .z=512, .t=20};
__.nodes.bound = {.x=1.000000, .y=1.000000, .z=1.000000, .t=0.010000};
__.nodes.steps = {.x=0.001953, .y=0.001953, .z=0.001953, .t=0.000500};

__.param.period = {.x=1, .y=0, .z=0};
__.param.a = {.x=6.283185, .y=3.141593, .z=3.141593, .t=7.695299};
__.param.b = {.x=0.000000, .y=0.000000, .z=0.000000, .t=7.853982};

__.local.rank = 37;
__.local.shape = {.x=4, .y=4, .z=4};
__.local.coord = {.x=2, .y=1, .z=1};

__.block.shape = {.x=130, .y=130, .z=130};
__.block.coord = {.x=256, .y=128, .z=128};
__.block.elems = 2197000;

=======================
__.world.size = 64;
__.world.rank = 38;

__.nodes.shape = {.x=512, .y=512, .z=512, .t=20};
__.nodes.bound = {.x=1.000000, .y=1.000000, .z=1.000000, .t=0.010000};
__.nodes.steps = {.x=0.001953, .y=0.001953, .z=0.001953, .t=0.000500};

__.param.period = {.x=1, .y=0, .z=0};
__.param.a = {.x=6.283185, .y=3.141593, .z=3.141593, .t=7.695299};
__.param.b = {.x=0.000000, .y=0.000000, .z=0.000000, .t=7.853982};

__.local.rank = 38;
__.local.shape = {.x=4, .y=4, .z=4};
__.local.coord = {.x=2, .y=1, .z=2};

__.block.shape = {.x=130, .y=130, .z=130};
__.block.coord = {.x=256, .y=128, .z=256};
__.block.elems = 2197000;

=======================
__.world.size = 64;
__.world.rank = 39;

__.nodes.shape = {.x=512, .y=512, .z=512, .t=20};
__.nodes.bound = {.x=1.000000, .y=1.000000, .z=1.000000, .t=0.010000};
__.nodes.steps = {.x=0.001953, .y=0.001953, .z=0.001953, .t=0.000500};

__.param.period = {.x=1, .y=0, .z=0};
__.param.a = {.x=6.283185, .y=3.141593, .z=3.141593, .t=7.695299};
__.param.b = {.x=0.000000, .y=0.000000, .z=0.000000, .t=7.853982};

__.local.rank = 39;
__.local.shape = {.x=4, .y=4, .z=4};
__.local.coord = {.x=2, .y=1, .z=3};

__.block.shape = {.x=130, .y=130, .z=130};
__.block.coord = {.x=256, .y=128, .z=384};
__.block.elems = 2197000;

=======================
__.world.size = 64;
__.world.rank = 40;

__.nodes.shape = {.x=512, .y=512, .z=512, .t=20};
__.nodes.bound = {.x=1.000000, .y=1.000000, .z=1.000000, .t=0.010000};
__.nodes.steps = {.x=0.001953, .y=0.001953, .z=0.001953, .t=0.000500};

__.param.period = {.x=1, .y=0, .z=0};
__.param.a = {.x=6.283185, .y=3.141593, .z=3.141593, .t=7.695299};
__.param.b = {.x=0.000000, .y=0.000000, .z=0.000000, .t=7.853982};

__.local.rank = 40;
__.local.shape = {.x=4, .y=4, .z=4};
__.local.coord = {.x=2, .y=2, .z=0};

__.block.shape = {.x=130, .y=130, .z=130};
__.block.coord = {.x=256, .y=256, .z=0};
__.block.elems = 2197000;

=======================
__.world.size = 64;
__.world.rank = 41;

__.nodes.shape = {.x=512, .y=512, .z=512, .t=20};
__.nodes.bound = {.x=1.000000, .y=1.000000, .z=1.000000, .t=0.010000};
__.nodes.steps = {.x=0.001953, .y=0.001953, .z=0.001953, .t=0.000500};

__.param.period = {.x=1, .y=0, .z=0};
__.param.a = {.x=6.283185, .y=3.141593, .z=3.141593, .t=7.695299};
__.param.b = {.x=0.000000, .y=0.000000, .z=0.000000, .t=7.853982};

__.local.rank = 41;
__.local.shape = {.x=4, .y=4, .z=4};
__.local.coord = {.x=2, .y=2, .z=1};

__.block.shape = {.x=130, .y=130, .z=130};
__.block.coord = {.x=256, .y=256, .z=128};
__.block.elems = 2197000;

=======================
__.world.size = 64;
__.world.rank = 42;

__.nodes.shape = {.x=512, .y=512, .z=512, .t=20};
__.nodes.bound = {.x=1.000000, .y=1.000000, .z=1.000000, .t=0.010000};
__.nodes.steps = {.x=0.001953, .y=0.001953, .z=0.001953, .t=0.000500};

__.param.period = {.x=1, .y=0, .z=0};
__.param.a = {.x=6.283185, .y=3.141593, .z=3.141593, .t=7.695299};
__.param.b = {.x=0.000000, .y=0.000000, .z=0.000000, .t=7.853982};

__.local.rank = 42;
__.local.shape = {.x=4, .y=4, .z=4};
__.local.coord = {.x=2, .y=2, .z=2};

__.block.shape = {.x=130, .y=130, .z=130};
__.block.coord = {.x=256, .y=256, .z=256};
__.block.elems = 2197000;

=======================
__.world.size = 64;
__.world.rank = 43;

__.nodes.shape = {.x=512, .y=512, .z=512, .t=20};
__.nodes.bound = {.x=1.000000, .y=1.000000, .z=1.000000, .t=0.010000};
__.nodes.steps = {.x=0.001953, .y=0.001953, .z=0.001953, .t=0.000500};

__.param.period = {.x=1, .y=0, .z=0};
__.param.a = {.x=6.283185, .y=3.141593, .z=3.141593, .t=7.695299};
__.param.b = {.x=0.000000, .y=0.000000, .z=0.000000, .t=7.853982};

__.local.rank = 43;
__.local.shape = {.x=4, .y=4, .z=4};
__.local.coord = {.x=2, .y=2, .z=3};

__.block.shape = {.x=130, .y=130, .z=130};
__.block.coord = {.x=256, .y=256, .z=384};
__.block.elems = 2197000;

=======================
__.world.size = 64;
__.world.rank = 44;

__.nodes.shape = {.x=512, .y=512, .z=512, .t=20};
__.nodes.bound = {.x=1.000000, .y=1.000000, .z=1.000000, .t=0.010000};
__.nodes.steps = {.x=0.001953, .y=0.001953, .z=0.001953, .t=0.000500};

__.param.period = {.x=1, .y=0, .z=0};
__.param.a = {.x=6.283185, .y=3.141593, .z=3.141593, .t=7.695299};
__.param.b = {.x=0.000000, .y=0.000000, .z=0.000000, .t=7.853982};

__.local.rank = 44;
__.local.shape = {.x=4, .y=4, .z=4};
__.local.coord = {.x=2, .y=3, .z=0};

__.block.shape = {.x=130, .y=130, .z=130};
__.block.coord = {.x=256, .y=384, .z=0};
__.block.elems = 2197000;

=======================
__.world.size = 64;
__.world.rank = 45;

__.nodes.shape = {.x=512, .y=512, .z=512, .t=20};
__.nodes.bound = {.x=1.000000, .y=1.000000, .z=1.000000, .t=0.010000};
__.nodes.steps = {.x=0.001953, .y=0.001953, .z=0.001953, .t=0.000500};

__.param.period = {.x=1, .y=0, .z=0};
__.param.a = {.x=6.283185, .y=3.141593, .z=3.141593, .t=7.695299};
__.param.b = {.x=0.000000, .y=0.000000, .z=0.000000, .t=7.853982};

__.local.rank = 45;
__.local.shape = {.x=4, .y=4, .z=4};
__.local.coord = {.x=2, .y=3, .z=1};

__.block.shape = {.x=130, .y=130, .z=130};
__.block.coord = {.x=256, .y=384, .z=128};
__.block.elems = 2197000;

=======================
__.world.size = 64;
__.world.rank = 46;

__.nodes.shape = {.x=512, .y=512, .z=512, .t=20};
__.nodes.bound = {.x=1.000000, .y=1.000000, .z=1.000000, .t=0.010000};
__.nodes.steps = {.x=0.001953, .y=0.001953, .z=0.001953, .t=0.000500};

__.param.period = {.x=1, .y=0, .z=0};
__.param.a = {.x=6.283185, .y=3.141593, .z=3.141593, .t=7.695299};
__.param.b = {.x=0.000000, .y=0.000000, .z=0.000000, .t=7.853982};

__.local.rank = 46;
__.local.shape = {.x=4, .y=4, .z=4};
__.local.coord = {.x=2, .y=3, .z=2};

__.block.shape = {.x=130, .y=130, .z=130};
__.block.coord = {.x=256, .y=384, .z=256};
__.block.elems = 2197000;

=======================
__.world.size = 64;
__.world.rank = 47;

__.nodes.shape = {.x=512, .y=512, .z=512, .t=20};
__.nodes.bound = {.x=1.000000, .y=1.000000, .z=1.000000, .t=0.010000};
__.nodes.steps = {.x=0.001953, .y=0.001953, .z=0.001953, .t=0.000500};

__.param.period = {.x=1, .y=0, .z=0};
__.param.a = {.x=6.283185, .y=3.141593, .z=3.141593, .t=7.695299};
__.param.b = {.x=0.000000, .y=0.000000, .z=0.000000, .t=7.853982};

__.local.rank = 47;
__.local.shape = {.x=4, .y=4, .z=4};
__.local.coord = {.x=2, .y=3, .z=3};

__.block.shape = {.x=130, .y=130, .z=130};
__.block.coord = {.x=256, .y=384, .z=384};
__.block.elems = 2197000;

=======================
__.world.size = 64;
__.world.rank = 48;

__.nodes.shape = {.x=512, .y=512, .z=512, .t=20};
__.nodes.bound = {.x=1.000000, .y=1.000000, .z=1.000000, .t=0.010000};
__.nodes.steps = {.x=0.001953, .y=0.001953, .z=0.001953, .t=0.000500};

__.param.period = {.x=1, .y=0, .z=0};
__.param.a = {.x=6.283185, .y=3.141593, .z=3.141593, .t=7.695299};
__.param.b = {.x=0.000000, .y=0.000000, .z=0.000000, .t=7.853982};

__.local.rank = 48;
__.local.shape = {.x=4, .y=4, .z=4};
__.local.coord = {.x=3, .y=0, .z=0};

__.block.shape = {.x=130, .y=130, .z=130};
__.block.coord = {.x=384, .y=0, .z=0};
__.block.elems = 2197000;

=======================
__.world.size = 64;
__.world.rank = 49;

__.nodes.shape = {.x=512, .y=512, .z=512, .t=20};
__.nodes.bound = {.x=1.000000, .y=1.000000, .z=1.000000, .t=0.010000};
__.nodes.steps = {.x=0.001953, .y=0.001953, .z=0.001953, .t=0.000500};

__.param.period = {.x=1, .y=0, .z=0};
__.param.a = {.x=6.283185, .y=3.141593, .z=3.141593, .t=7.695299};
__.param.b = {.x=0.000000, .y=0.000000, .z=0.000000, .t=7.853982};

__.local.rank = 49;
__.local.shape = {.x=4, .y=4, .z=4};
__.local.coord = {.x=3, .y=0, .z=1};

__.block.shape = {.x=130, .y=130, .z=130};
__.block.coord = {.x=384, .y=0, .z=128};
__.block.elems = 2197000;

=======================
__.world.size = 64;
__.world.rank = 50;

__.nodes.shape = {.x=512, .y=512, .z=512, .t=20};
__.nodes.bound = {.x=1.000000, .y=1.000000, .z=1.000000, .t=0.010000};
__.nodes.steps = {.x=0.001953, .y=0.001953, .z=0.001953, .t=0.000500};

__.param.period = {.x=1, .y=0, .z=0};
__.param.a = {.x=6.283185, .y=3.141593, .z=3.141593, .t=7.695299};
__.param.b = {.x=0.000000, .y=0.000000, .z=0.000000, .t=7.853982};

__.local.rank = 50;
__.local.shape = {.x=4, .y=4, .z=4};
__.local.coord = {.x=3, .y=0, .z=2};

__.block.shape = {.x=130, .y=130, .z=130};
__.block.coord = {.x=384, .y=0, .z=256};
__.block.elems = 2197000;

=======================
__.world.size = 64;
__.world.rank = 51;

__.nodes.shape = {.x=512, .y=512, .z=512, .t=20};
__.nodes.bound = {.x=1.000000, .y=1.000000, .z=1.000000, .t=0.010000};
__.nodes.steps = {.x=0.001953, .y=0.001953, .z=0.001953, .t=0.000500};

__.param.period = {.x=1, .y=0, .z=0};
__.param.a = {.x=6.283185, .y=3.141593, .z=3.141593, .t=7.695299};
__.param.b = {.x=0.000000, .y=0.000000, .z=0.000000, .t=7.853982};

__.local.rank = 51;
__.local.shape = {.x=4, .y=4, .z=4};
__.local.coord = {.x=3, .y=0, .z=3};

__.block.shape = {.x=130, .y=130, .z=130};
__.block.coord = {.x=384, .y=0, .z=384};
__.block.elems = 2197000;

=======================
__.world.size = 64;
__.world.rank = 52;

__.nodes.shape = {.x=512, .y=512, .z=512, .t=20};
__.nodes.bound = {.x=1.000000, .y=1.000000, .z=1.000000, .t=0.010000};
__.nodes.steps = {.x=0.001953, .y=0.001953, .z=0.001953, .t=0.000500};

__.param.period = {.x=1, .y=0, .z=0};
__.param.a = {.x=6.283185, .y=3.141593, .z=3.141593, .t=7.695299};
__.param.b = {.x=0.000000, .y=0.000000, .z=0.000000, .t=7.853982};

__.local.rank = 52;
__.local.shape = {.x=4, .y=4, .z=4};
__.local.coord = {.x=3, .y=1, .z=0};

__.block.shape = {.x=130, .y=130, .z=130};
__.block.coord = {.x=384, .y=128, .z=0};
__.block.elems = 2197000;

=======================
__.world.size = 64;
__.world.rank = 53;

__.nodes.shape = {.x=512, .y=512, .z=512, .t=20};
__.nodes.bound = {.x=1.000000, .y=1.000000, .z=1.000000, .t=0.010000};
__.nodes.steps = {.x=0.001953, .y=0.001953, .z=0.001953, .t=0.000500};

__.param.period = {.x=1, .y=0, .z=0};
__.param.a = {.x=6.283185, .y=3.141593, .z=3.141593, .t=7.695299};
__.param.b = {.x=0.000000, .y=0.000000, .z=0.000000, .t=7.853982};

__.local.rank = 53;
__.local.shape = {.x=4, .y=4, .z=4};
__.local.coord = {.x=3, .y=1, .z=1};

__.block.shape = {.x=130, .y=130, .z=130};
__.block.coord = {.x=384, .y=128, .z=128};
__.block.elems = 2197000;

=======================
__.world.size = 64;
__.world.rank = 54;

__.nodes.shape = {.x=512, .y=512, .z=512, .t=20};
__.nodes.bound = {.x=1.000000, .y=1.000000, .z=1.000000, .t=0.010000};
__.nodes.steps = {.x=0.001953, .y=0.001953, .z=0.001953, .t=0.000500};

__.param.period = {.x=1, .y=0, .z=0};
__.param.a = {.x=6.283185, .y=3.141593, .z=3.141593, .t=7.695299};
__.param.b = {.x=0.000000, .y=0.000000, .z=0.000000, .t=7.853982};

__.local.rank = 54;
__.local.shape = {.x=4, .y=4, .z=4};
__.local.coord = {.x=3, .y=1, .z=2};

__.block.shape = {.x=130, .y=130, .z=130};
__.block.coord = {.x=384, .y=128, .z=256};
__.block.elems = 2197000;

=======================
__.world.size = 64;
__.world.rank = 55;

__.nodes.shape = {.x=512, .y=512, .z=512, .t=20};
__.nodes.bound = {.x=1.000000, .y=1.000000, .z=1.000000, .t=0.010000};
__.nodes.steps = {.x=0.001953, .y=0.001953, .z=0.001953, .t=0.000500};

__.param.period = {.x=1, .y=0, .z=0};
__.param.a = {.x=6.283185, .y=3.141593, .z=3.141593, .t=7.695299};
__.param.b = {.x=0.000000, .y=0.000000, .z=0.000000, .t=7.853982};

__.local.rank = 55;
__.local.shape = {.x=4, .y=4, .z=4};
__.local.coord = {.x=3, .y=1, .z=3};

__.block.shape = {.x=130, .y=130, .z=130};
__.block.coord = {.x=384, .y=128, .z=384};
__.block.elems = 2197000;

=======================
__.world.size = 64;
__.world.rank = 56;

__.nodes.shape = {.x=512, .y=512, .z=512, .t=20};
__.nodes.bound = {.x=1.000000, .y=1.000000, .z=1.000000, .t=0.010000};
__.nodes.steps = {.x=0.001953, .y=0.001953, .z=0.001953, .t=0.000500};

__.param.period = {.x=1, .y=0, .z=0};
__.param.a = {.x=6.283185, .y=3.141593, .z=3.141593, .t=7.695299};
__.param.b = {.x=0.000000, .y=0.000000, .z=0.000000, .t=7.853982};

__.local.rank = 56;
__.local.shape = {.x=4, .y=4, .z=4};
__.local.coord = {.x=3, .y=2, .z=0};

__.block.shape = {.x=130, .y=130, .z=130};
__.block.coord = {.x=384, .y=256, .z=0};
__.block.elems = 2197000;

=======================
__.world.size = 64;
__.world.rank = 57;

__.nodes.shape = {.x=512, .y=512, .z=512, .t=20};
__.nodes.bound = {.x=1.000000, .y=1.000000, .z=1.000000, .t=0.010000};
__.nodes.steps = {.x=0.001953, .y=0.001953, .z=0.001953, .t=0.000500};

__.param.period = {.x=1, .y=0, .z=0};
__.param.a = {.x=6.283185, .y=3.141593, .z=3.141593, .t=7.695299};
__.param.b = {.x=0.000000, .y=0.000000, .z=0.000000, .t=7.853982};

__.local.rank = 57;
__.local.shape = {.x=4, .y=4, .z=4};
__.local.coord = {.x=3, .y=2, .z=1};

__.block.shape = {.x=130, .y=130, .z=130};
__.block.coord = {.x=384, .y=256, .z=128};
__.block.elems = 2197000;

=======================
__.world.size = 64;
__.world.rank = 58;

__.nodes.shape = {.x=512, .y=512, .z=512, .t=20};
__.nodes.bound = {.x=1.000000, .y=1.000000, .z=1.000000, .t=0.010000};
__.nodes.steps = {.x=0.001953, .y=0.001953, .z=0.001953, .t=0.000500};


__.param.period = {.x=1, .y=0, .z=0};
__.param.period = {.x=1, .y=0, .z=0};
__.param.a = {.x=6.283185, .y=3.141593, .z=3.141593, .t=7.695299};
__.param.a = {.x=6.283185, .y=3.141593, .z=3.141593, .t=7.695299};
__.param.b = {.x=0.000000, .y=0.000000, .z=0.000000, .t=7.853982};
__.param.b = {.x=0.000000, .y=0.000000, .z=0.000000, .t=7.853982};


__.local.rank = 58;
__.local.rank = 30;
__.local.shape = {.x=4, .y=4, .z=4};
__.local.shape = {.x=4, .y=4, .z=4};
__.local.coord = {.x=3, .y=2, .z=2};
__.local.coord = {.x=1, .y=3, .z=2};


__.block.shape = {.x=130, .y=130, .z=130};
__.block.shape = {.x=130, .y=130, .z=130};
__.block.coord = {.x=384, .y=256, .z=256};
__.block.coord = {.x=128, .y=384, .z=256};
__.block.elems = 2197000;
__.block.elems = 2197000;


=======================
=======================
__.world.size = 64;
__.world.size = 64;
__.world.rank = 59;
__.world.rank = 31;


__.nodes.shape = {.x=512, .y=512, .z=512, .t=20};
__.nodes.shape = {.x=512, .y=512, .z=512, .t=20};
__.nodes.bound = {.x=1.000000, .y=1.000000, .z=1.000000, .t=0.010000};
__.nodes.bound = {.x=1.000000, .y=1.000000, .z=1.000000, .t=0.010000};
__.nodes.steps = {.x=0.001953, .y=0.001953, .z=0.001953, .t=0.000500};
__.nodes.steps = {.x=0.001953, .y=0.001953, .z=0.001953, .t=0.000500};


__.param.period = {.x=1, .y=0, .z=0};
__.param.period = {.x=1, .y=0, .z=0};
__.param.a = {.x=6.283185, .y=3.141593, .z=3.141593, .t=7.695299};
__.param.a = {.x=6.283185, .y=3.141593, .z=3.141593, .t=7.695299};
__.param.b = {.x=0.000000, .y=0.000000, .z=0.000000, .t=7.853982};
__.param.b = {.x=0.000000, .y=0.000000, .z=0.000000, .t=7.853982};


__.local.rank = 59;
__.local.rank = 31;
__.local.shape = {.x=4, .y=4, .z=4};
__.local.shape = {.x=4, .y=4, .z=4};
__.local.coord = {.x=3, .y=2, .z=3};
__.local.coord = {.x=1, .y=3, .z=3};


__.block.shape = {.x=130, .y=130, .z=130};
__.block.shape = {.x=130, .y=130, .z=130};
__.block.coord = {.x=384, .y=256, .z=384};
__.block.coord = {.x=128, .y=384, .z=384};
__.block.elems = 2197000;
__.block.elems = 2197000;


=======================
__.world.size = 64;
__.world.rank = 60;

__.nodes.shape = {.x=512, .y=512, .z=512, .t=20};
__.nodes.bound = {.x=1.000000, .y=1.000000, .z=1.000000, .t=0.010000};
__.nodes.steps = {.x=0.001953, .y=0.001953, .z=0.001953, .t=0.000500};

__.param.period = {.x=1, .y=0, .z=0};
__.param.a = {.x=6.283185, .y=3.141593, .z=3.141593, .t=7.695299};
__.param.b = {.x=0.000000, .y=0.000000, .z=0.000000, .t=7.853982};

__.local.rank = 60;
__.local.shape = {.x=4, .y=4, .z=4};
__.local.coord = {.x=3, .y=3, .z=0};

__.block.shape = {.x=130, .y=130, .z=130};
__.block.coord = {.x=384, .y=384, .z=0};
__.block.elems = 2197000;

=======================
__.world.size = 64;
__.world.rank = 61;

__.nodes.shape = {.x=512, .y=512, .z=512, .t=20};
__.nodes.bound = {.x=1.000000, .y=1.000000, .z=1.000000, .t=0.010000};
__.nodes.steps = {.x=0.001953, .y=0.001953, .z=0.001953, .t=0.000500};

__.param.period = {.x=1, .y=0, .z=0};
__.param.a = {.x=6.283185, .y=3.141593, .z=3.141593, .t=7.695299};
__.param.b = {.x=0.000000, .y=0.000000, .z=0.000000, .t=7.853982};

__.local.rank = 61;
__.local.shape = {.x=4, .y=4, .z=4};
__.local.coord = {.x=3, .y=3, .z=1};

__.block.shape = {.x=130, .y=130, .z=130};
__.block.coord = {.x=384, .y=384, .z=128};
__.block.elems = 2197000;

=======================
__.world.size = 64;
__.world.rank = 62;

__.nodes.shape = {.x=512, .y=512, .z=512, .t=20};
__.nodes.bound = {.x=1.000000, .y=1.000000, .z=1.000000, .t=0.010000};
__.nodes.steps = {.x=0.001953, .y=0.001953, .z=0.001953, .t=0.000500};

__.param.period = {.x=1, .y=0, .z=0};
__.param.a = {.x=6.283185, .y=3.141593, .z=3.141593, .t=7.695299};
__.param.b = {.x=0.000000, .y=0.000000, .z=0.000000, .t=7.853982};

__.local.rank = 62;
__.local.shape = {.x=4, .y=4, .z=4};
__.local.coord = {.x=3, .y=3, .z=2};

__.block.shape = {.x=130, .y=130, .z=130};
__.block.coord = {.x=384, .y=384, .z=256};
__.block.elems = 2197000;

=======================
__.world.size = 64;
__.world.rank = 63;

__.nodes.shape = {.x=512, .y=512, .z=512, .t=20};
__.nodes.bound = {.x=1.000000, .y=1.000000, .z=1.000000, .t=0.010000};
__.nodes.steps = {.x=0.001953, .y=0.001953, .z=0.001953, .t=0.000500};

__.param.period = {.x=1, .y=0, .z=0};
__.param.a = {.x=6.283185, .y=3.141593, .z=3.141593, .t=7.695299};
__.param.b = {.x=0.000000, .y=0.000000, .z=0.000000, .t=7.853982};

__.local.rank = 63;
__.local.shape = {.x=4, .y=4, .z=4};
__.local.coord = {.x=3, .y=3, .z=3};

__.block.shape = {.x=130, .y=130, .z=130};
__.block.coord = {.x=384, .y=384, .z=384};
__.block.elems = 2197000;

__TRIALS__.append((8.115561e+00, [0.000000e+00, 6.054002e-11, 2.421581e-10, 5.448489e-10, 9.686038e-10, 1.513410e-09, 2.179251e-09, 2.966108e-09, 3.873957e-09, 4.902772e-09, 6.052521e-09, 7.323171e-09, 8.714684e-09, 1.022702e-08, 1.186013e-08, 1.361397e-08, 1.548849e-08, 1.748363e-08, 1.959933e-08, 2.183553e-08, 2.419216e-08, ]))
__TRIALS__.append((8.084600e+00, [0.000000e+00, 6.054002e-11, 2.421581e-10, 5.448489e-10, 9.686038e-10, 1.513410e-09, 2.179251e-09, 2.966108e-09, 3.873957e-09, 4.902772e-09, 6.052521e-09, 7.323171e-09, 8.714684e-09, 1.022702e-08, 1.186013e-08, 1.361397e-08, 1.548849e-08, 1.748363e-08, 1.959933e-08, 2.183553e-08, 2.419216e-08, ]))
__TRIALS__.append((8.084417e+00, [0.000000e+00, 6.054002e-11, 2.421581e-10, 5.448489e-10, 9.686038e-10, 1.513410e-09, 2.179251e-09, 2.966108e-09, 3.873957e-09, 4.902772e-09, 6.052521e-09, 7.323171e-09, 8.714684e-09, 1.022702e-08, 1.186013e-08, 1.361397e-08, 1.548849e-08, 1.748363e-08, 1.959933e-08, 2.183553e-08, 2.419216e-08, ]))
__TRIALS__.append((8.084799e+00, [0.000000e+00, 6.054002e-11, 2.421581e-10, 5.448489e-10, 9.686038e-10, 1.513410e-09, 2.179251e-09, 2.966108e-09, 3.873957e-09, 4.902772e-09, 6.052521e-09, 7.323171e-09, 8.714684e-09, 1.022702e-08, 1.186013e-08, 1.361397e-08, 1.548849e-08, 1.748363e-08, 1.959933e-08, 2.183553e-08, 2.419216e-08, ]))
__TRIALS__.append((8.084266e+00, [0.000000e+00, 6.054002e-11, 2.421581e-10, 5.448489e-10, 9.686038e-10, 1.513410e-09, 2.179251e-09, 2.966108e-09, 3.873957e-09, 4.902772e-09, 6.052521e-09, 7.323171e-09, 8.714684e-09, 1.022702e-08, 1.186013e-08, 1.361397e-08, 1.548849e-08, 1.748363e-08, 1.959933e-08, 2.183553e-08, 2.419216e-08, ]))
__TRIALS__.append((8.084584e+00, [0.000000e+00, 6.054002e-11, 2.421581e-10, 5.448489e-10, 9.686038e-10, 1.513410e-09, 2.179251e-09, 2.966108e-09, 3.873957e-09, 4.902772e-09, 6.052521e-09, 7.323171e-09, 8.714684e-09, 1.022702e-08, 1.186013e-08, 1.361397e-08, 1.548849e-08, 1.748363e-08, 1.959933e-08, 2.183553e-08, 2.419216e-08, ]))
__TRIALS__.append((8.084494e+00, [0.000000e+00, 6.054002e-11, 2.421581e-10, 5.448489e-10, 9.686038e-10, 1.513410e-09, 2.179251e-09, 2.966108e-09, 3.873957e-09, 4.902772e-09, 6.052521e-09, 7.323171e-09, 8.714684e-09, 1.022702e-08, 1.186013e-08, 1.361397e-08, 1.548849e-08, 1.748363e-08, 1.959933e-08, 2.183553e-08, 2.419216e-08, ]))
__TRIALS__.append((8.084779e+00, [0.000000e+00, 6.054002e-11, 2.421581e-10, 5.448489e-10, 9.686038e-10, 1.513410e-09, 2.179251e-09, 2.966108e-09, 3.873957e-09, 4.902772e-09, 6.052521e-09, 7.323171e-09, 8.714684e-09, 1.022702e-08, 1.186013e-08, 1.361397e-08, 1.548849e-08, 1.748363e-08, 1.959933e-08, 2.183553e-08, 2.419216e-08, ]))
__TRIALS__.append((8.084477e+00, [0.000000e+00, 6.054002e-11, 2.421581e-10, 5.448489e-10, 9.686038e-10, 1.513410e-09, 2.179251e-09, 2.966108e-09, 3.873957e-09, 4.902772e-09, 6.052521e-09, 7.323171e-09, 8.714684e-09, 1.022702e-08, 1.186013e-08, 1.361397e-08, 1.548849e-08, 1.748363e-08, 1.959933e-08, 2.183553e-08, 2.419216e-08, ]))
__TRIALS__.append((8.084631e+00, [0.000000e+00, 6.054002e-11, 2.421581e-10, 5.448489e-10, 9.686038e-10, 1.513410e-09, 2.179251e-09, 2.966108e-09, 3.873957e-09, 4.902772e-09, 6.052521e-09, 7.323171e-09, 8.714684e-09, 1.022702e-08, 1.186013e-08, 1.361397e-08, 1.548849e-08, 1.748363e-08, 1.959933e-08, 2.183553e-08, 2.419216e-08, ]))
