Sender: LSF System <lsfadmin@polus-c3-ib.bmc.hpc.cs.msu.ru>
Subject: Job 862693: <source /polusfs/setenv/setup.OpenMPI;#BSUB -n 4;#BSUB -W 00:15;#BSUB -gpu "num=2:mode=exclusive_process";#BSUB -R "span[ptile=2]";#BSUB -o main.%J.out;#BSUB -e main.%J.err;OMP_NUM_THREADS=1 mpiexec ./main 1 0.01 256 20> in cluster <MSUCluster> Done

Job <source /polusfs/setenv/setup.OpenMPI;#BSUB -n 4;#BSUB -W 00:15;#BSUB -gpu "num=2:mode=exclusive_process";#BSUB -R "span[ptile=2]";#BSUB -o main.%J.out;#BSUB -e main.%J.err;OMP_NUM_THREADS=1 mpiexec ./main 1 0.01 256 20> was submitted from host <polus-ib.bmc.hpc.cs.msu.ru> by user <edu-cmc-skmodel21-622-16> in cluster <MSUCluster> at Fri Dec 24 04:15:05 2021
Job was executed on host(s) <2*polus-c3-ib.bmc.hpc.cs.msu.ru>, in queue <short>, as user <edu-cmc-skmodel21-622-16> in cluster <MSUCluster> at Fri Dec 24 04:15:05 2021
                            <2*polus-c1-ib.bmc.hpc.cs.msu.ru>
</home_edu/edu-cmc-skmodel21-622/edu-cmc-skmodel21-622-16> was used as the home directory.
</home_edu/edu-cmc-skmodel21-622/edu-cmc-skmodel21-622-16/solution> was used as the working directory.
Started at Fri Dec 24 04:15:05 2021
Terminated at Fri Dec 24 04:15:09 2021
Results reported at Fri Dec 24 04:15:09 2021

Your job looked like:

------------------------------------------------------------
# LSBATCH: User input
source /polusfs/setenv/setup.OpenMPI
#BSUB -n 4
#BSUB -W 00:15
#BSUB -gpu "num=2:mode=exclusive_process"
#BSUB -R "span[ptile=2]"
#BSUB -o main.%J.out
#BSUB -e main.%J.err
OMP_NUM_THREADS=1 mpiexec ./main 1 0.01 256 20

------------------------------------------------------------

Successfully completed.

Resource usage summary:

    CPU time :                                   8.00 sec.
    Max Memory :                                 162 MB
    Average Memory :                             110.00 MB
    Total Requested Memory :                     -
    Delta Memory :                               -
    Max Swap :                                   -
    Max Processes :                              6
    Max Threads :                                19
    Run time :                                   5 sec.
    Turnaround time :                            4 sec.

The output (if any) follows:

WORLD[0/4] | LOCAL[0/2] | CUDA[0/2] | 0002:01:00.0
__PARAMS__ = {'P': 4, 'O': 0, 'L': 1.000000e+00, 'T': 1.000000e-02, 'N': 256, 'K': 20}
WORLD[1/4] | LOCAL[1/2] | CUDA[1/2] | 0006:01:00.0
WORLD[3/4] | LOCAL[1/2] | CUDA[1/2] | 0006:01:00.0
WORLD[2/4] | LOCAL[0/2] | CUDA[0/2] | 0002:01:00.0
=======================
__.world.size = 4;
__.world.rank = 0;

__.nodes.shape = {.x=256, .y=256, .z=256, .t=20};
__.nodes.bound = {.x=1.000000, .y=1.000000, .z=1.000000, .t=0.010000};
__.nodes.steps = {.x=0.003906, .y=0.003906, .z=0.003906, .t=0.000500};

__.param.period = {.x=1, .y=0, .z=0};
__.param.a = {.x=6.283185, .y=3.141593, .z=3.141593, .t=7.695299};
__.param.b = {.x=0.000000, .y=0.000000, .z=0.000000, .t=7.853982};

__.local.rank = 0;
__.local.shape = {.x=2, .y=2, .z=1};
__.local.coord = {.x=0, .y=0, .z=0};

__.block.shape = {.x=130, .y=130, .z=258};
__.block.coord = {.x=0, .y=0, .z=0};
__.block.elems = 4360200;

=======================
__.world.size = 4;
__.world.rank = 1;

__.nodes.shape = {.x=256, .y=256, .z=256, .t=20};
__.nodes.bound = {.x=1.000000, .y=1.000000, .z=1.000000, .t=0.010000};
__.nodes.steps = {.x=0.003906, .y=0.003906, .z=0.003906, .t=0.000500};

__.param.period = {.x=1, .y=0, .z=0};
__.param.a = {.x=6.283185, .y=3.141593, .z=3.141593, .t=7.695299};
__.param.b = {.x=0.000000, .y=0.000000, .z=0.000000, .t=7.853982};

__.local.rank = 1;
__.local.shape = {.x=2, .y=2, .z=1};
__.local.coord = {.x=0, .y=1, .z=0};

__.block.shape = {.x=130, .y=130, .z=258};
__.block.coord = {.x=0, .y=128, .z=0};
__.block.elems = 4360200;

=======================
__.world.size = 4;
__.world.rank = 3;

__.nodes.shape = {.x=256, .y=256, .z=256, .t=20};
__.nodes.bound = {.x=1.000000, .y=1.000000, .z=1.000000, .t=0.010000};
__.nodes.steps = {.x=0.003906, .y=0.003906, .z=0.003906, .t=0.000500};

__.param.period = {.x=1, .y=0, .z=0};
__.param.a = {.x=6.283185, .y=3.141593, .z=3.141593, .t=7.695299};
__.param.b = {.x=0.000000, .y=0.000000, .z=0.000000, .t=7.853982};

__.local.rank = 3;
__.local.shape = {.x=2, .y=2, .z=1};
__.local.coord = {.x=1, .y=1, .z=0};

__.block.shape = {.x=130, .y=130, .z=258};
__.block.coord = {.x=128, .y=128, .z=0};
__.block.elems = 4360200;

=======================
__.world.size = 4;
__.world.rank = 2;

__.nodes.shape = {.x=256, .y=256, .z=256, .t=20};
__.nodes.bound = {.x=1.000000, .y=1.000000, .z=1.000000, .t=0.010000};
__.nodes.steps = {.x=0.003906, .y=0.003906, .z=0.003906, .t=0.000500};

__.param.period = {.x=1, .y=0, .z=0};
__.param.a = {.x=6.283185, .y=3.141593, .z=3.141593, .t=7.695299};
__.param.b = {.x=0.000000, .y=0.000000, .z=0.000000, .t=7.853982};

__.local.rank = 2;
__.local.shape = {.x=2, .y=2, .z=1};
__.local.coord = {.x=1, .y=0, .z=0};

__.block.shape = {.x=130, .y=130, .z=258};
__.block.coord = {.x=128, .y=0, .z=0};
__.block.elems = 4360200;

__TRIALS__.append((2.215373e-01, [0.000000e+00, 2.695524e-10, 1.078202e-09, 2.425924e-09, 4.312679e-09, 6.738411e-09, 9.703048e-09, 1.320650e-08, 1.724867e-08, 2.182944e-08, 2.694866e-08, 3.260619e-08, 3.880185e-08, 4.553548e-08, 5.280686e-08, 6.061578e-08, 6.896201e-08, 7.784531e-08, 8.726540e-08, 9.722201e-08, 1.077149e-07, ]))
__TRIALS__.append((1.762993e-01, [0.000000e+00, 2.695524e-10, 1.078202e-09, 2.425924e-09, 4.312679e-09, 6.738411e-09, 9.703048e-09, 1.320650e-08, 1.724867e-08, 2.182944e-08, 2.694866e-08, 3.260619e-08, 3.880185e-08, 4.553548e-08, 5.280686e-08, 6.061578e-08, 6.896201e-08, 7.784531e-08, 8.726540e-08, 9.722201e-08, 1.077149e-07, ]))
__TRIALS__.append((1.764788e-01, [0.000000e+00, 2.695524e-10, 1.078202e-09, 2.425924e-09, 4.312679e-09, 6.738411e-09, 9.703048e-09, 1.320650e-08, 1.724867e-08, 2.182944e-08, 2.694866e-08, 3.260619e-08, 3.880185e-08, 4.553548e-08, 5.280686e-08, 6.061578e-08, 6.896201e-08, 7.784531e-08, 8.726540e-08, 9.722201e-08, 1.077149e-07, ]))
__TRIALS__.append((1.754707e-01, [0.000000e+00, 2.695524e-10, 1.078202e-09, 2.425924e-09, 4.312679e-09, 6.738411e-09, 9.703048e-09, 1.320650e-08, 1.724867e-08, 2.182944e-08, 2.694866e-08, 3.260619e-08, 3.880185e-08, 4.553548e-08, 5.280686e-08, 6.061578e-08, 6.896201e-08, 7.784531e-08, 8.726540e-08, 9.722201e-08, 1.077149e-07, ]))
__TRIALS__.append((1.762850e-01, [0.000000e+00, 2.695524e-10, 1.078202e-09, 2.425924e-09, 4.312679e-09, 6.738411e-09, 9.703048e-09, 1.320650e-08, 1.724867e-08, 2.182944e-08, 2.694866e-08, 3.260619e-08, 3.880185e-08, 4.553548e-08, 5.280686e-08, 6.061578e-08, 6.896201e-08, 7.784531e-08, 8.726540e-08, 9.722201e-08, 1.077149e-07, ]))
__TRIALS__.append((1.754379e-01, [0.000000e+00, 2.695524e-10, 1.078202e-09, 2.425924e-09, 4.312679e-09, 6.738411e-09, 9.703048e-09, 1.320650e-08, 1.724867e-08, 2.182944e-08, 2.694866e-08, 3.260619e-08, 3.880185e-08, 4.553548e-08, 5.280686e-08, 6.061578e-08, 6.896201e-08, 7.784531e-08, 8.726540e-08, 9.722201e-08, 1.077149e-07, ]))
__TRIALS__.append((1.754447e-01, [0.000000e+00, 2.695524e-10, 1.078202e-09, 2.425924e-09, 4.312679e-09, 6.738411e-09, 9.703048e-09, 1.320650e-08, 1.724867e-08, 2.182944e-08, 2.694866e-08, 3.260619e-08, 3.880185e-08, 4.553548e-08, 5.280686e-08, 6.061578e-08, 6.896201e-08, 7.784531e-08, 8.726540e-08, 9.722201e-08, 1.077149e-07, ]))
__TRIALS__.append((1.753442e-01, [0.000000e+00, 2.695524e-10, 1.078202e-09, 2.425924e-09, 4.312679e-09, 6.738411e-09, 9.703048e-09, 1.320650e-08, 1.724867e-08, 2.182944e-08, 2.694866e-08, 3.260619e-08, 3.880185e-08, 4.553548e-08, 5.280686e-08, 6.061578e-08, 6.896201e-08, 7.784531e-08, 8.726540e-08, 9.722201e-08, 1.077149e-07, ]))
__TRIALS__.append((1.758067e-01, [0.000000e+00, 2.695524e-10, 1.078202e-09, 2.425924e-09, 4.312679e-09, 6.738411e-09, 9.703048e-09, 1.320650e-08, 1.724867e-08, 2.182944e-08, 2.694866e-08, 3.260619e-08, 3.880185e-08, 4.553548e-08, 5.280686e-08, 6.061578e-08, 6.896201e-08, 7.784531e-08, 8.726540e-08, 9.722201e-08, 1.077149e-07, ]))
__TRIALS__.append((1.754746e-01, [0.000000e+00, 2.695524e-10, 1.078202e-09, 2.425924e-09, 4.312679e-09, 6.738411e-09, 9.703048e-09, 1.320650e-08, 1.724867e-08, 2.182944e-08, 2.694866e-08, 3.260619e-08, 3.880185e-08, 4.553548e-08, 5.280686e-08, 6.061578e-08, 6.896201e-08, 7.784531e-08, 8.726540e-08, 9.722201e-08, 1.077149e-07, ]))


PS:

Read file <main.862693.err> for stderr output of this job.

