# Running __TRIALS__ with ADJUSTED_SAMPLING/DELTA_STOPPING and epsilon=8.000000e-06, comm_size=64, seed=42
__TRIALS__ = [
#   (trial_time, trial_iters, trial_points, trial_error),
    (4.018745e+01, 879648000, 879648000, 7.847186e-07),  # __TRIALS__
    (4.017472e+01, 879648000, 879648000, 6.124145e-06),  # __TRIALS__
    (4.017327e+01, 879648000, 879648000, 7.949248e-06),  # __TRIALS__
    (4.016735e+01, 879648000, 879648000, 3.918612e-06),  # __TRIALS__
    (4.016731e+01, 879648000, 879648000, 4.195052e-06),  # __TRIALS__
    (4.016161e+01, 879648000, 879648000, 1.265361e-06),  # __TRIALS__
    (4.016122e+01, 879648000, 879648000, 1.831525e-05),  # __TRIALS__
    (4.016403e+01, 879648000, 879648000, 1.799281e-05),  # __TRIALS__
    (4.016505e+01, 879648000, 879648000, 8.469726e-06),  # __TRIALS__
    (4.017021e+01, 879648000, 879648000, 1.156705e-05),  # __TRIALS__
]  # __TRIALS__
# Done.
