__PARAMS__ = {'P': 64, 'O': 0, 'L': 3.141593e+00, 'T': 1.000000e-02, 'N': 256, 'K': 20}
=======================
__.world.size = 64;
__.world.rank = 0;

__.nodes.shape = {.x=256, .y=256, .z=256, .t=20};
__.nodes.bound = {.x=3.141593, .y=3.141593, .z=3.141593, .t=0.010000};
__.nodes.steps = {.x=0.012272, .y=0.012272, .z=0.012272, .t=0.000500};

__.param.period = {.x=1, .y=0, .z=0};
__.param.a = {.x=2.000000, .y=1.000000, .z=1.000000, .t=2.449490};
__.param.b = {.x=0.000000, .y=0.000000, .z=0.000000, .t=7.853982};

__.local.rank = 0;
__.local.shape = {.x=4, .y=4, .z=4};
__.local.coord = {.x=0, .y=0, .z=0};

__.block.shape = {.x=66, .y=66, .z=66};
__.block.coord = {.x=0, .y=0, .z=0};
__.block.elems = 287496;

=======================
__.world.size = 64;
__.world.rank = 1;

__.nodes.shape = {.x=256, .y=256, .z=256, .t=20};
__.nodes.bound = {.x=3.141593, .y=3.141593, .z=3.141593, .t=0.010000};
__.nodes.steps = {.x=0.012272, .y=0.012272, .z=0.012272, .t=0.000500};

__.param.period = {.x=1, .y=0, .z=0};
__.param.a = {.x=2.000000, .y=1.000000, .z=1.000000, .t=2.449490};
__.param.b = {.x=0.000000, .y=0.000000, .z=0.000000, .t=7.853982};

__.local.rank = 1;
__.local.shape = {.x=4, .y=4, .z=4};
__.local.coord = {.x=0, .y=0, .z=1};

__.block.shape = {.x=66, .y=66, .z=66};
__.block.coord = {.x=0, .y=0, .z=64};
__.block.elems = 287496;

=======================
__.world.size = 64;
__.world.rank = 2;

__.nodes.shape = {.x=256, .y=256, .z=256, .t=20};
__.nodes.bound = {.x=3.141593, .y=3.141593, .z=3.141593, .t=0.010000};
__.nodes.steps = {.x=0.012272, .y=0.012272, .z=0.012272, .t=0.000500};

__.param.period = {.x=1, .y=0, .z=0};
__.param.a = {.x=2.000000, .y=1.000000, .z=1.000000, .t=2.449490};
__.param.b = {.x=0.000000, .y=0.000000, .z=0.000000, .t=7.853982};

__.local.rank = 2;
__.local.shape = {.x=4, .y=4, .z=4};
__.local.coord = {.x=0, .y=0, .z=2};

__.block.shape = {.x=66, .y=66, .z=66};
__.block.coord = {.x=0, .y=0, .z=128};
__.block.elems = 287496;

=======================
__.world.size = 64;
__.world.rank = 3;

__.nodes.shape = {.x=256, .y=256, .z=256, .t=20};
__.nodes.bound = {.x=3.141593, .y=3.141593, .z=3.141593, .t=0.010000};
__.nodes.steps = {.x=0.012272, .y=0.012272, .z=0.012272, .t=0.000500};

__.param.period = {.x=1, .y=0, .z=0};
__.param.a = {.x=2.000000, .y=1.000000, .z=1.000000, .t=2.449490};
__.param.b = {.x=0.000000, .y=0.000000, .z=0.000000, .t=7.853982};

__.local.rank = 3;
__.local.shape = {.x=4, .y=4, .z=4};
__.local.coord = {.x=0, .y=0, .z=3};

__.block.shape = {.x=66, .y=66, .z=66};
__.block.coord = {.x=0, .y=0, .z=192};
__.block.elems = 287496;

=======================
__.world.size = 64;
__.world.rank = 4;

__.nodes.shape = {.x=256, .y=256, .z=256, .t=20};
__.nodes.bound = {.x=3.141593, .y=3.141593, .z=3.141593, .t=0.010000};
__.nodes.steps = {.x=0.012272, .y=0.012272, .z=0.012272, .t=0.000500};

__.param.period = {.x=1, .y=0, .z=0};
__.param.a = {.x=2.000000, .y=1.000000, .z=1.000000, .t=2.449490};
__.param.b = {.x=0.000000, .y=0.000000, .z=0.000000, .t=7.853982};

__.local.rank = 4;
__.local.shape = {.x=4, .y=4, .z=4};
__.local.coord = {.x=0, .y=1, .z=0};

__.block.shape = {.x=66, .y=66, .z=66};
__.block.coord = {.x=0, .y=64, .z=0};
__.block.elems = 287496;

=======================
__.world.size = 64;
__.world.rank = 5;

__.nodes.shape = {.x=256, .y=256, .z=256, .t=20};
__.nodes.bound = {.x=3.141593, .y=3.141593, .z=3.141593, .t=0.010000};
__.nodes.steps = {.x=0.012272, .y=0.012272, .z=0.012272, .t=0.000500};

__.param.period = {.x=1, .y=0, .z=0};
__.param.a = {.x=2.000000, .y=1.000000, .z=1.000000, .t=2.449490};
__.param.b = {.x=0.000000, .y=0.000000, .z=0.000000, .t=7.853982};

__.local.rank = 5;
__.local.shape = {.x=4, .y=4, .z=4};
__.local.coord = {.x=0, .y=1, .z=1};

__.block.shape = {.x=66, .y=66, .z=66};
__.block.coord = {.x=0, .y=64, .z=64};
__.block.elems = 287496;

=======================
__.world.size = 64;
__.world.rank = 6;

__.nodes.shape = {.x=256, .y=256, .z=256, .t=20};
__.nodes.bound = {.x=3.141593, .y=3.141593, .z=3.141593, .t=0.010000};
__.nodes.steps = {.x=0.012272, .y=0.012272, .z=0.012272, .t=0.000500};

__.param.period = {.x=1, .y=0, .z=0};
__.param.a = {.x=2.000000, .y=1.000000, .z=1.000000, .t=2.449490};
__.param.b = {.x=0.000000, .y=0.000000, .z=0.000000, .t=7.853982};

__.local.rank = 6;
__.local.shape = {.x=4, .y=4, .z=4};
__.local.coord = {.x=0, .y=1, .z=2};

__.block.shape = {.x=66, .y=66, .z=66};
__.block.coord = {.x=0, .y=64, .z=128};
__.block.elems = 287496;

=======================
__.world.size = 64;
__.world.rank = 7;

__.nodes.shape = {.x=256, .y=256, .z=256, .t=20};
__.nodes.bound = {.x=3.141593, .y=3.141593, .z=3.141593, .t=0.010000};
__.nodes.steps = {.x=0.012272, .y=0.012272, .z=0.012272, .t=0.000500};

__.param.period = {.x=1, .y=0, .z=0};
__.param.a = {.x=2.000000, .y=1.000000, .z=1.000000, .t=2.449490};
__.param.b = {.x=0.000000, .y=0.000000, .z=0.000000, .t=7.853982};

__.local.rank = 7;
__.local.shape = {.x=4, .y=4, .z=4};
__.local.coord = {.x=0, .y=1, .z=3};

__.block.shape = {.x=66, .y=66, .z=66};
__.block.coord = {.x=0, .y=64, .z=192};
__.block.elems = 287496;

=======================
__.world.size = 64;
__.world.rank = 8;

__.nodes.shape = {.x=256, .y=256, .z=256, .t=20};
__.nodes.bound = {.x=3.141593, .y=3.141593, .z=3.141593, .t=0.010000};
__.nodes.steps = {.x=0.012272, .y=0.012272, .z=0.012272, .t=0.000500};

__.param.period = {.x=1, .y=0, .z=0};
__.param.a = {.x=2.000000, .y=1.000000, .z=1.000000, .t=2.449490};
__.param.b = {.x=0.000000, .y=0.000000, .z=0.000000, .t=7.853982};

__.local.rank = 8;
__.local.shape = {.x=4, .y=4, .z=4};
__.local.coord = {.x=0, .y=2, .z=0};

__.block.shape = {.x=66, .y=66, .z=66};
__.block.coord = {.x=0, .y=128, .z=0};
__.block.elems = 287496;

=======================
__.world.size = 64;
__.world.rank = 9;

__.nodes.shape = {.x=256, .y=256, .z=256, .t=20};
__.nodes.bound = {.x=3.141593, .y=3.141593, .z=3.141593, .t=0.010000};
__.nodes.steps = {.x=0.012272, .y=0.012272, .z=0.012272, .t=0.000500};

__.param.period = {.x=1, .y=0, .z=0};
__.param.a = {.x=2.000000, .y=1.000000, .z=1.000000, .t=2.449490};
__.param.b = {.x=0.000000, .y=0.000000, .z=0.000000, .t=7.853982};

__.local.rank = 9;
__.local.shape = {.x=4, .y=4, .z=4};
__.local.coord = {.x=0, .y=2, .z=1};

__.block.shape = {.x=66, .y=66, .z=66};
__.block.coord = {.x=0, .y=128, .z=64};
__.block.elems = 287496;

=======================
__.world.size = 64;
__.world.rank = 10;

__.nodes.shape = {.x=256, .y=256, .z=256, .t=20};
__.nodes.bound = {.x=3.141593, .y=3.141593, .z=3.141593, .t=0.010000};
__.nodes.steps = {.x=0.012272, .y=0.012272, .z=0.012272, .t=0.000500};

__.param.period = {.x=1, .y=0, .z=0};
__.param.a = {.x=2.000000, .y=1.000000, .z=1.000000, .t=2.449490};
__.param.b = {.x=0.000000, .y=0.000000, .z=0.000000, .t=7.853982};

__.local.rank = 10;
__.local.shape = {.x=4, .y=4, .z=4};
__.local.coord = {.x=0, .y=2, .z=2};

__.block.shape = {.x=66, .y=66, .z=66};
__.block.coord = {.x=0, .y=128, .z=128};
__.block.elems = 287496;

=======================
__.world.size = 64;
__.world.rank = 11;

__.nodes.shape = {.x=256, .y=256, .z=256, .t=20};
__.nodes.bound = {.x=3.141593, .y=3.141593, .z=3.141593, .t=0.010000};
__.nodes.steps = {.x=0.012272, .y=0.012272, .z=0.012272, .t=0.000500};

__.param.period = {.x=1, .y=0, .z=0};
__.param.a = {.x=2.000000, .y=1.000000, .z=1.000000, .t=2.449490};
__.param.b = {.x=0.000000, .y=0.000000, .z=0.000000, .t=7.853982};

__.local.rank = 11;
__.local.shape = {.x=4, .y=4, .z=4};
__.local.coord = {.x=0, .y=2, .z=3};

__.block.shape = {.x=66, .y=66, .z=66};
__.block.coord = {.x=0, .y=128, .z=192};
__.block.elems = 287496;

=======================
__.world.size = 64;
__.world.rank = 12;

__.nodes.shape = {.x=256, .y=256, .z=256, .t=20};
__.nodes.bound = {.x=3.141593, .y=3.141593, .z=3.141593, .t=0.010000};
__.nodes.steps = {.x=0.012272, .y=0.012272, .z=0.012272, .t=0.000500};

__.param.period = {.x=1, .y=0, .z=0};
__.param.a = {.x=2.000000, .y=1.000000, .z=1.000000, .t=2.449490};
__.param.b = {.x=0.000000, .y=0.000000, .z=0.000000, .t=7.853982};

__.local.rank = 12;
__.local.shape = {.x=4, .y=4, .z=4};
__.local.coord = {.x=0, .y=3, .z=0};

__.block.shape = {.x=66, .y=66, .z=66};
__.block.coord = {.x=0, .y=192, .z=0};
__.block.elems = 287496;

=======================
__.world.size = 64;
__.world.rank = 13;

__.nodes.shape = {.x=256, .y=256, .z=256, .t=20};
__.nodes.bound = {.x=3.141593, .y=3.141593, .z=3.141593, .t=0.010000};
__.nodes.steps = {.x=0.012272, .y=0.012272, .z=0.012272, .t=0.000500};

__.param.period = {.x=1, .y=0, .z=0};
__.param.a = {.x=2.000000, .y=1.000000, .z=1.000000, .t=2.449490};
__.param.b = {.x=0.000000, .y=0.000000, .z=0.000000, .t=7.853982};

__.local.rank = 13;
__.local.shape = {.x=4, .y=4, .z=4};
__.local.coord = {.x=0, .y=3, .z=1};

__.block.shape = {.x=66, .y=66, .z=66};
__.block.coord = {.x=0, .y=192, .z=64};
__.block.elems = 287496;

=======================
__.world.size = 64;
__.world.rank = 14;

__.nodes.shape = {.x=256, .y=256, .z=256, .t=20};
__.nodes.bound = {.x=3.141593, .y=3.141593, .z=3.141593, .t=0.010000};
__.nodes.steps = {.x=0.012272, .y=0.012272, .z=0.012272, .t=0.000500};

__.param.period = {.x=1, .y=0, .z=0};
__.param.a = {.x=2.000000, .y=1.000000, .z=1.000000, .t=2.449490};
__.param.b = {.x=0.000000, .y=0.000000, .z=0.000000, .t=7.853982};

__.local.rank = 14;
__.local.shape = {.x=4, .y=4, .z=4};
__.local.coord = {.x=0, .y=3, .z=2};

__.block.shape = {.x=66, .y=66, .z=66};
__.block.coord = {.x=0, .y=192, .z=128};
__.block.elems = 287496;

=======================
__.world.size = 64;
__.world.rank = 15;

__.nodes.shape = {.x=256, .y=256, .z=256, .t=20};
__.nodes.bound = {.x=3.141593, .y=3.141593, .z=3.141593, .t=0.010000};
__.nodes.steps = {.x=0.012272, .y=0.012272, .z=0.012272, .t=0.000500};

__.param.period = {.x=1, .y=0, .z=0};
__.param.a = {.x=2.000000, .y=1.000000, .z=1.000000, .t=2.449490};
__.param.b = {.x=0.000000, .y=0.000000, .z=0.000000, .t=7.853982};

__.local.rank = 15;
__.local.shape = {.x=4, .y=4, .z=4};
__.local.coord = {.x=0, .y=3, .z=3};

__.block.shape = {.x=66, .y=66, .z=66};
__.block.coord = {.x=0, .y=192, .z=192};
__.block.elems = 287496;

=======================
__.world.size = 64;
__.world.rank = 16;

__.nodes.shape = {.x=256, .y=256, .z=256, .t=20};
__.nodes.bound = {.x=3.141593, .y=3.141593, .z=3.141593, .t=0.010000};
__.nodes.steps = {.x=0.012272, .y=0.012272, .z=0.012272, .t=0.000500};

__.param.period = {.x=1, .y=0, .z=0};
__.param.a = {.x=2.000000, .y=1.000000, .z=1.000000, .t=2.449490};
__.param.b = {.x=0.000000, .y=0.000000, .z=0.000000, .t=7.853982};

__.local.rank = 16;
__.local.shape = {.x=4, .y=4, .z=4};
__.local.coord = {.x=1, .y=0, .z=0};

__.block.shape = {.x=66, .y=66, .z=66};
__.block.coord = {.x=64, .y=0, .z=0};
__.block.elems = 287496;

=======================
__.world.size = 64;
__.world.rank = 17;

__.nodes.shape = {.x=256, .y=256, .z=256, .t=20};
__.nodes.bound = {.x=3.141593, .y=3.141593, .z=3.141593, .t=0.010000};
__.nodes.steps = {.x=0.012272, .y=0.012272, .z=0.012272, .t=0.000500};

__.param.period = {.x=1, .y=0, .z=0};
__.param.a = {.x=2.000000, .y=1.000000, .z=1.000000, .t=2.449490};
__.param.b = {.x=0.000000, .y=0.000000, .z=0.000000, .t=7.853982};

__.local.rank = 17;
__.local.shape = {.x=4, .y=4, .z=4};
__.local.coord = {.x=1, .y=0, .z=1};

__.block.shape = {.x=66, .y=66, .z=66};
__.block.coord = {.x=64, .y=0, .z=64};
__.block.elems = 287496;

=======================
__.world.size = 64;
__.world.rank = 18;

__.nodes.shape = {.x=256, .y=256, .z=256, .t=20};
__.nodes.bound = {.x=3.141593, .y=3.141593, .z=3.141593, .t=0.010000};
__.nodes.steps = {.x=0.012272, .y=0.012272, .z=0.012272, .t=0.000500};

__.param.period = {.x=1, .y=0, .z=0};
__.param.a = {.x=2.000000, .y=1.000000, .z=1.000000, .t=2.449490};
__.param.b = {.x=0.000000, .y=0.000000, .z=0.000000, .t=7.853982};

__.local.rank = 18;
__.local.shape = {.x=4, .y=4, .z=4};
__.local.coord = {.x=1, .y=0, .z=2};

__.block.shape = {.x=66, .y=66, .z=66};
__.block.coord = {.x=64, .y=0, .z=128};
__.block.elems = 287496;

=======================
__.world.size = 64;
__.world.rank = 19;

__.nodes.shape = {.x=256, .y=256, .z=256, .t=20};
__.nodes.bound = {.x=3.141593, .y=3.141593, .z=3.141593, .t=0.010000};
__.nodes.steps = {.x=0.012272, .y=0.012272, .z=0.012272, .t=0.000500};

__.param.period = {.x=1, .y=0, .z=0};
__.param.a = {.x=2.000000, .y=1.000000, .z=1.000000, .t=2.449490};
__.param.b = {.x=0.000000, .y=0.000000, .z=0.000000, .t=7.853982};

__.local.rank = 19;
__.local.shape = {.x=4, .y=4, .z=4};
__.local.coord = {.x=1, .y=0, .z=3};

__.block.shape = {.x=66, .y=66, .z=66};
__.block.coord = {.x=64, .y=0, .z=192};
__.block.elems = 287496;

=======================
__.world.size = 64;
__.world.rank = 20;

__.nodes.shape = {.x=256, .y=256, .z=256, .t=20};
__.nodes.bound = {.x=3.141593, .y=3.141593, .z=3.141593, .t=0.010000};
__.nodes.steps = {.x=0.012272, .y=0.012272, .z=0.012272, .t=0.000500};

__.param.period = {.x=1, .y=0, .z=0};
__.param.a = {.x=2.000000, .y=1.000000, .z=1.000000, .t=2.449490};
__.param.b = {.x=0.000000, .y=0.000000, .z=0.000000, .t=7.853982};

__.local.rank = 20;
__.local.shape = {.x=4, .y=4, .z=4};
__.local.coord = {.x=1, .y=1, .z=0};

__.block.shape = {.x=66, .y=66, .z=66};
__.block.coord = {.x=64, .y=64, .z=0};
__.block.elems = 287496;

=======================
__.world.size = 64;
__.world.rank = 21;

__.nodes.shape = {.x=256, .y=256, .z=256, .t=20};
__.nodes.bound = {.x=3.141593, .y=3.141593, .z=3.141593, .t=0.010000};
__.nodes.steps = {.x=0.012272, .y=0.012272, .z=0.012272, .t=0.000500};

__.param.period = {.x=1, .y=0, .z=0};
__.param.a = {.x=2.000000, .y=1.000000, .z=1.000000, .t=2.449490};
__.param.b = {.x=0.000000, .y=0.000000, .z=0.000000, .t=7.853982};

__.local.rank = 21;
__.local.shape = {.x=4, .y=4, .z=4};
__.local.coord = {.x=1, .y=1, .z=1};

__.block.shape = {.x=66, .y=66, .z=66};
__.block.coord = {.x=64, .y=64, .z=64};
__.block.elems = 287496;

=======================
__.world.size = 64;
__.world.rank = 22;

__.nodes.shape = {.x=256, .y=256, .z=256, .t=20};
__.nodes.bound = {.x=3.141593, .y=3.141593, .z=3.141593, .t=0.010000};
__.nodes.steps = {.x=0.012272, .y=0.012272, .z=0.012272, .t=0.000500};

__.param.period = {.x=1, .y=0, .z=0};
__.param.a = {.x=2.000000, .y=1.000000, .z=1.000000, .t=2.449490};
__.param.b = {.x=0.000000, .y=0.000000, .z=0.000000, .t=7.853982};

__.local.rank = 22;
__.local.shape = {.x=4, .y=4, .z=4};
__.local.coord = {.x=1, .y=1, .z=2};

__.block.shape = {.x=66, .y=66, .z=66};
__.block.coord = {.x=64, .y=64, .z=128};
__.block.elems = 287496;

=======================
__.world.size = 64;
__.world.rank = 23;

__.nodes.shape = {.x=256, .y=256, .z=256, .t=20};
__.nodes.bound = {.x=3.141593, .y=3.141593, .z=3.141593, .t=0.010000};
__.nodes.steps = {.x=0.012272, .y=0.012272, .z=0.012272, .t=0.000500};

__.param.period = {.x=1, .y=0, .z=0};
__.param.a = {.x=2.000000, .y=1.000000, .z=1.000000, .t=2.449490};
__.param.b = {.x=0.000000, .y=0.000000, .z=0.000000, .t=7.853982};

__.local.rank = 23;
__.local.shape = {.x=4, .y=4, .z=4};
__.local.coord = {.x=1, .y=1, .z=3};

__.block.shape = {.x=66, .y=66, .z=66};
__.block.coord = {.x=64, .y=64, .z=192};
__.block.elems = 287496;

=======================
__.world.size = 64;
__.world.rank = 24;

__.nodes.shape = {.x=256, .y=256, .z=256, .t=20};
__.nodes.bound = {.x=3.141593, .y=3.141593, .z=3.141593, .t=0.010000};
__.nodes.steps = {.x=0.012272, .y=0.012272, .z=0.012272, .t=0.000500};

__.param.period = {.x=1, .y=0, .z=0};
__.param.a = {.x=2.000000, .y=1.000000, .z=1.000000, .t=2.449490};
__.param.b = {.x=0.000000, .y=0.000000, .z=0.000000, .t=7.853982};

__.local.rank = 24;
__.local.shape = {.x=4, .y=4, .z=4};
__.local.coord = {.x=1, .y=2, .z=0};

__.block.shape = {.x=66, .y=66, .z=66};
__.block.coord = {.x=64, .y=128, .z=0};
__.block.elems = 287496;

=======================
__.world.size = 64;
__.world.rank = 25;

__.nodes.shape = {.x=256, .y=256, .z=256, .t=20};
__.nodes.bound = {.x=3.141593, .y=3.141593, .z=3.141593, .t=0.010000};
__.nodes.steps = {.x=0.012272, .y=0.012272, .z=0.012272, .t=0.000500};

__.param.period = {.x=1, .y=0, .z=0};
__.param.a = {.x=2.000000, .y=1.000000, .z=1.000000, .t=2.449490};
__.param.b = {.x=0.000000, .y=0.000000, .z=0.000000, .t=7.853982};

__.local.rank = 25;
__.local.shape = {.x=4, .y=4, .z=4};
__.local.coord = {.x=1, .y=2, .z=1};

__.block.shape = {.x=66, .y=66, .z=66};
__.block.coord = {.x=64, .y=128, .z=64};
__.block.elems = 287496;

=======================
__.world.size = 64;
__.world.rank = 26;

__.nodes.shape = {.x=256, .y=256, .z=256, .t=20};
__.nodes.bound = {.x=3.141593, .y=3.141593, .z=3.141593, .t=0.010000};
__.nodes.steps = {.x=0.012272, .y=0.012272, .z=0.012272, .t=0.000500};

__.param.period = {.x=1, .y=0, .z=0};
__.param.a = {.x=2.000000, .y=1.000000, .z=1.000000, .t=2.449490};
__.param.b = {.x=0.000000, .y=0.000000, .z=0.000000, .t=7.853982};

__.local.rank = 26;
__.local.shape = {.x=4, .y=4, .z=4};
__.local.coord = {.x=1, .y=2, .z=2};

__.block.shape = {.x=66, .y=66, .z=66};
__.block.coord = {.x=64, .y=128, .z=128};
__.block.elems = 287496;

=======================
__.world.size = 64;
__.world.rank = 32;

__.nodes.shape = {.x=256, .y=256, .z=256, .t=20};
__.nodes.bound = {.x=3.141593, .y=3.141593, .z=3.141593, .t=0.010000};
__.nodes.steps = {.x=0.012272, .y=0.012272, .z=0.012272, .t=0.000500};

__.param.period = {.x=1, .y=0, .z=0};
__.param.a = {.x=2.000000, .y=1.000000, .z=1.000000, .t=2.449490};
__.param.b = {.x=0.000000, .y=0.000000, .z=0.000000, .t=7.853982};

__.local.rank = 32;
__.local.shape = {.x=4, .y=4, .z=4};
__.local.coord = {.x=2, .y=0, .z=0};

__.block.shape = {.x=66, .y=66, .z=66};
__.block.coord = {.x=128, .y=0, .z=0};
__.block.elems = 287496;

=======================
__.world.size = 64;
__.world.rank = 33;

__.nodes.shape = {.x=256, .y=256, .z=256, .t=20};
__.nodes.bound = {.x=3.141593, .y=3.141593, .z=3.141593, .t=0.010000};
__.nodes.steps = {.x=0.012272, .y=0.012272, .z=0.012272, .t=0.000500};

__.param.period = {.x=1, .y=0, .z=0};
__.param.a = {.x=2.000000, .y=1.000000, .z=1.000000, .t=2.449490};
__.param.b = {.x=0.000000, .y=0.000000, .z=0.000000, .t=7.853982};

__.local.rank = 33;
__.local.shape = {.x=4, .y=4, .z=4};
__.local.coord = {.x=2, .y=0, .z=1};

__.block.shape = {.x=66, .y=66, .z=66};
__.block.coord = {.x=128, .y=0, .z=64};
__.block.elems = 287496;

=======================
__.world.size = 64;
__.world.rank = 34;

__.nodes.shape = {.x=256, .y=256, .z=256, .t=20};
__.nodes.bound = {.x=3.141593, .y=3.141593, .z=3.141593, .t=0.010000};
__.nodes.steps = {.x=0.012272, .y=0.012272, .z=0.012272, .t=0.000500};

__.param.period = {.x=1, .y=0, .z=0};
__.param.a = {.x=2.000000, .y=1.000000, .z=1.000000, .t=2.449490};
__.param.b = {.x=0.000000, .y=0.000000, .z=0.000000, .t=7.853982};

__.local.rank = 34;
__.local.shape = {.x=4, .y=4, .z=4};
__.local.coord = {.x=2, .y=0, .z=2};

__.block.shape = {.x=66, .y=66, .z=66};
__.block.coord = {.x=128, .y=0, .z=128};
__.block.elems = 287496;

=======================
__.world.size = 64;
__.world.rank = 35;

__.nodes.shape = {.x=256, .y=256, .z=256, .t=20};
__.nodes.bound = {.x=3.141593, .y=3.141593, .z=3.141593, .t=0.010000};
__.nodes.steps = {.x=0.012272, .y=0.012272, .z=0.012272, .t=0.000500};

__.param.period = {.x=1, .y=0, .z=0};
__.param.a = {.x=2.000000, .y=1.000000, .z=1.000000, .t=2.449490};
__.param.b = {.x=0.000000, .y=0.000000, .z=0.000000, .t=7.853982};

__.local.rank = 35;
__.local.shape = {.x=4, .y=4, .z=4};
__.local.coord = {.x=2, .y=0, .z=3};

__.block.shape = {.x=66, .y=66, .z=66};
__.block.coord = {.x=128, .y=0, .z=192};
__.block.elems = 287496;

=======================
__.world.size = 64;
__.world.rank = 36;

__.nodes.shape = {.x=256, .y=256, .z=256, .t=20};
__.nodes.bound = {.x=3.141593, .y=3.141593, .z=3.141593, .t=0.010000};
__.nodes.steps = {.x=0.012272, .y=0.012272, .z=0.012272, .t=0.000500};

__.param.period = {.x=1, .y=0, .z=0};
__.param.a = {.x=2.000000, .y=1.000000, .z=1.000000, .t=2.449490};
__.param.b = {.x=0.000000, .y=0.000000, .z=0.000000, .t=7.853982};

__.local.rank = 36;
__.local.shape = {.x=4, .y=4, .z=4};
__.local.coord = {.x=2, .y=1, .z=0};

__.block.shape = {.x=66, .y=66, .z=66};
__.block.coord = {.x=128, .y=64, .z=0};
__.block.elems = 287496;

=======================
__.world.size = 64;
__.world.rank = 37;

__.nodes.shape = {.x=256, .y=256, .z=256, .t=20};
__.nodes.bound = {.x=3.141593, .y=3.141593, .z=3.141593, .t=0.010000};
__.nodes.steps = {.x=0.012272, .y=0.012272, .z=0.012272, .t=0.000500};

__.param.period = {.x=1, .y=0, .z=0};
__.param.a = {.x=2.000000, .y=1.000000, .z=1.000000, .t=2.449490};
__.param.b = {.x=0.000000, .y=0.000000, .z=0.000000, .t=7.853982};

__.local.rank = 37;
__.local.shape = {.x=4, .y=4, .z=4};
__.local.coord = {.x=2, .y=1, .z=1};

__.block.shape = {.x=66, .y=66, .z=66};
__.block.coord = {.x=128, .y=64, .z=64};
__.block.elems = 287496;

=======================
__.world.size = 64;
__.world.rank = 38;

__.nodes.shape = {.x=256, .y=256, .z=256, .t=20};
__.nodes.bound = {.x=3.141593, .y=3.141593, .z=3.141593, .t=0.010000};
__.nodes.steps = {.x=0.012272, .y=0.012272, .z=0.012272, .t=0.000500};

__.param.period = {.x=1, .y=0, .z=0};
__.param.a = {.x=2.000000, .y=1.000000, .z=1.000000, .t=2.449490};
__.param.b = {.x=0.000000, .y=0.000000, .z=0.000000, .t=7.853982};

__.local.rank = 38;
__.local.shape = {.x=4, .y=4, .z=4};
__.local.coord = {.x=2, .y=1, .z=2};

__.block.shape = {.x=66, .y=66, .z=66};
__.block.coord = {.x=128, .y=64, .z=128};
__.block.elems = 287496;

=======================
__.world.size = 64;
__.world.rank = 39;

__.nodes.shape = {.x=256, .y=256, .z=256, .t=20};
__.nodes.bound = {.x=3.141593, .y=3.141593, .z=3.141593, .t=0.010000};
__.nodes.steps = {.x=0.012272, .y=0.012272, .z=0.012272, .t=0.000500};

__.param.period = {.x=1, .y=0, .z=0};
__.param.a = {.x=2.000000, .y=1.000000, .z=1.000000, .t=2.449490};
__.param.b = {.x=0.000000, .y=0.000000, .z=0.000000, .t=7.853982};

__.local.rank = 39;
__.local.shape = {.x=4, .y=4, .z=4};
__.local.coord = {.x=2, .y=1, .z=3};

__.block.shape = {.x=66, .y=66, .z=66};
__.block.coord = {.x=128, .y=64, .z=192};
__.block.elems = 287496;

=======================
__.world.size = 64;
__.world.rank = 40;

__.nodes.shape = {.x=256, .y=256, .z=256, .t=20};
__.nodes.bound = {.x=3.141593, .y=3.141593, .z=3.141593, .t=0.010000};
__.nodes.steps = {.x=0.012272, .y=0.012272, .z=0.012272, .t=0.000500};

__.param.period = {.x=1, .y=0, .z=0};
__.param.a = {.x=2.000000, .y=1.000000, .z=1.000000, .t=2.449490};
__.param.b = {.x=0.000000, .y=0.000000, .z=0.000000, .t=7.853982};

__.local.rank = 40;
__.local.shape = {.x=4, .y=4, .z=4};
__.local.coord = {.x=2, .y=2, .z=0};

__.block.shape = {.x=66, .y=66, .z=66};
__.block.coord = {.x=128, .y=128, .z=0};
__.block.elems = 287496;

=======================
__.world.size = 64;
__.world.rank = 41;

__.nodes.shape = {.x=256, .y=256, .z=256, .t=20};
__.nodes.bound = {.x=3.141593, .y=3.141593, .z=3.141593, .t=0.010000};
__.nodes.steps = {.x=0.012272, .y=0.012272, .z=0.012272, .t=0.000500};

__.param.period = {.x=1, .y=0, .z=0};
__.param.a = {.x=2.000000, .y=1.000000, .z=1.000000, .t=2.449490};
__.param.b = {.x=0.000000, .y=0.000000, .z=0.000000, .t=7.853982};

__.local.rank = 41;
__.local.shape = {.x=4, .y=4, .z=4};
__.local.coord = {.x=2, .y=2, .z=1};

__.block.shape = {.x=66, .y=66, .z=66};
__.block.coord = {.x=128, .y=128, .z=64};
__.block.elems = 287496;

=======================
__.world.size = 64;
__.world.rank = 42;

__.nodes.shape = {.x=256, .y=256, .z=256, .t=20};
__.nodes.bound = {.x=3.141593, .y=3.141593, .z=3.141593, .t=0.010000};
__.nodes.steps = {.x=0.012272, .y=0.012272, .z=0.012272, .t=0.000500};

__.param.period = {.x=1, .y=0, .z=0};
__.param.a = {.x=2.000000, .y=1.000000, .z=1.000000, .t=2.449490};
__.param.b = {.x=0.000000, .y=0.000000, .z=0.000000, .t=7.853982};

__.local.rank = 42;
__.local.shape = {.x=4, .y=4, .z=4};
__.local.coord = {.x=2, .y=2, .z=2};

__.block.shape = {.x=66, .y=66, .z=66};
__.block.coord = {.x=128, .y=128, .z=128};
__.block.elems = 287496;

=======================
__.world.size = 64;
__.world.rank = 43;

__.nodes.shape = {.x=256, .y=256, .z=256, .t=20};
__.nodes.bound = {.x=3.141593, .y=3.141593, .z=3.141593, .t=0.010000};
__.nodes.steps = {.x=0.012272, .y=0.012272, .z=0.012272, .t=0.000500};

__.param.period = {.x=1, .y=0, .z=0};
__.param.a = {.x=2.000000, .y=1.000000, .z=1.000000, .t=2.449490};
__.param.b = {.x=0.000000, .y=0.000000, .z=0.000000, .t=7.853982};

__.local.rank = 43;
__.local.shape = {.x=4, .y=4, .z=4};
__.local.coord = {.x=2, .y=2, .z=3};

__.block.shape = {.x=66, .y=66, .z=66};
__.block.coord = {.x=128, .y=128, .z=192};
__.block.elems = 287496;

=======================
__.world.size = 64;
__.world.rank = 44;

__.nodes.shape = {.x=256, .y=256, .z=256, .t=20};
__.nodes.bound = {.x=3.141593, .y=3.141593, .z=3.141593, .t=0.010000};
__.nodes.steps = {.x=0.012272, .y=0.012272, .z=0.012272, .t=0.000500};

__.param.period = {.x=1, .y=0, .z=0};
__.param.a = {.x=2.000000, .y=1.000000, .z=1.000000, .t=2.449490};
__.param.b = {.x=0.000000, .y=0.000000, .z=0.000000, .t=7.853982};

__.local.rank = 44;
__.local.shape = {.x=4, .y=4, .z=4};
__.local.coord = {.x=2, .y=3, .z=0};

__.block.shape = {.x=66, .y=66, .z=66};
__.block.coord = {.x=128, .y=192, .z=0};
__.block.elems = 287496;

=======================
__.world.size = 64;
__.world.rank = 45;

__.nodes.shape = {.x=256, .y=256, .z=256, .t=20};
__.nodes.bound = {.x=3.141593, .y=3.141593, .z=3.141593, .t=0.010000};
__.nodes.steps = {.x=0.012272, .y=0.012272, .z=0.012272, .t=0.000500};

__.param.period = {.x=1, .y=0, .z=0};
__.param.a = {.x=2.000000, .y=1.000000, .z=1.000000, .t=2.449490};
__.param.b = {.x=0.000000, .y=0.000000, .z=0.000000, .t=7.853982};

__.local.rank = 45;
__.local.shape = {.x=4, .y=4, .z=4};
__.local.coord = {.x=2, .y=3, .z=1};

__.block.shape = {.x=66, .y=66, .z=66};
__.block.coord = {.x=128, .y=192, .z=64};
__.block.elems = 287496;

=======================
__.world.size = 64;
__.world.rank = 46;

__.nodes.shape = {.x=256, .y=256, .z=256, .t=20};
__.nodes.bound = {.x=3.141593, .y=3.141593, .z=3.141593, .t=0.010000};
__.nodes.steps = {.x=0.012272, .y=0.012272, .z=0.012272, .t=0.000500};

__.param.period = {.x=1, .y=0, .z=0};
__.param.a = {.x=2.000000, .y=1.000000, .z=1.000000, .t=2.449490};
__.param.b = {.x=0.000000, .y=0.000000, .z=0.000000, .t=7.853982};

__.local.rank = 46;
__.local.shape = {.x=4, .y=4, .z=4};
__.local.coord = {.x=2, .y=3, .z=2};

__.block.shape = {.x=66, .y=66, .z=66};
__.block.coord = {.x=128, .y=192, .z=128};
__.block.elems = 287496;

=======================
__.world.size = 64;
__.world.rank = 47;

__.nodes.shape = {.x=256, .y=256, .z=256, .t=20};
__.nodes.bound = {.x=3.141593, .y=3.141593, .z=3.141593, .t=0.010000};
__.nodes.steps = {.x=0.012272, .y=0.012272, .z=0.012272, .t=0.000500};

__.param.period = {.x=1, .y=0, .z=0};
__.param.a = {.x=2.000000, .y=1.000000, .z=1.000000, .t=2.449490};
__.param.b = {.x=0.000000, .y=0.000000, .z=0.000000, .t=7.853982};

__.local.rank = 47;
__.local.shape = {.x=4, .y=4, .z=4};
__.local.coord = {.x=2, .y=3, .z=3};

__.block.shape = {.x=66, .y=66, .z=66};
__.block.coord = {.x=128, .y=192, .z=192};
__.block.elems = 287496;

=======================
__.world.size = 64;
__.world.rank = 48;

__.nodes.shape = {.x=256, .y=256, .z=256, .t=20};
__.nodes.bound = {.x=3.141593, .y=3.141593, .z=3.141593, .t=0.010000};
__.nodes.steps = {.x=0.012272, .y=0.012272, .z=0.012272, .t=0.000500};

__.param.period = {.x=1, .y=0, .z=0};
__.param.a = {.x=2.000000, .y=1.000000, .z=1.000000, .t=2.449490};
__.param.b = {.x=0.000000, .y=0.000000, .z=0.000000, .t=7.853982};

__.local.rank = 48;
__.local.shape = {.x=4, .y=4, .z=4};
__.local.coord = {.x=3, .y=0, .z=0};

__.block.shape = {.x=66, .y=66, .z=66};
__.block.coord = {.x=192, .y=0, .z=0};
__.block.elems = 287496;

=======================
=======================
__.world.size = 64;
__.world.size = 64;
__.world.rank = 49;
__.world.rank = 27;


__.nodes.shape = {.x=256, .y=256, .z=256, .t=20};
__.nodes.shape = {.x=256, .y=256, .z=256, .t=20};
__.nodes.bound = {.x=3.141593, .y=3.141593, .z=3.141593, .t=0.010000};
__.nodes.bound = {.x=3.141593, .y=3.141593, .z=3.141593, .t=0.010000};
__.nodes.steps = {.x=0.012272, .y=0.012272, .z=0.012272, .t=0.000500};
__.nodes.steps = {.x=0.012272, .y=0.012272, .z=0.012272, .t=0.000500};


__.param.period = {.x=1, .y=0, .z=0};
__.param.period = {.x=1, .y=0, .z=0};
__.param.a = {.x=2.000000, .y=1.000000, .z=1.000000, .t=2.449490};
__.param.a = {.x=2.000000, .y=1.000000, .z=1.000000, .t=2.449490};
__.param.b = {.x=0.000000, .y=0.000000, .z=0.000000, .t=7.853982};
__.param.b = {.x=0.000000, .y=0.000000, .z=0.000000, .t=7.853982};


__.local.rank = 49;
__.local.rank = 27;
__.local.shape = {.x=4, .y=4, .z=4};
__.local.shape = {.x=4, .y=4, .z=4};
__.local.coord = {.x=3, .y=0, .z=1};
__.local.coord = {.x=1, .y=2, .z=3};


__.block.shape = {.x=66, .y=66, .z=66};
__.block.shape = {.x=66, .y=66, .z=66};
__.block.coord = {.x=192, .y=0, .z=64};
__.block.coord = {.x=64, .y=128, .z=192};
__.block.elems = 287496;
__.block.elems = 287496;


=======================
=======================
__.world.size = 64;
__.world.size = 64;
__.world.rank = 50;
__.world.rank = 28;


__.nodes.shape = {.x=256, .y=256, .z=256, .t=20};
__.nodes.shape = {.x=256, .y=256, .z=256, .t=20};
__.nodes.bound = {.x=3.141593, .y=3.141593, .z=3.141593, .t=0.010000};
__.nodes.bound = {.x=3.141593, .y=3.141593, .z=3.141593, .t=0.010000};
__.nodes.steps = {.x=0.012272, .y=0.012272, .z=0.012272, .t=0.000500};
__.nodes.steps = {.x=0.012272, .y=0.012272, .z=0.012272, .t=0.000500};


__.param.period = {.x=1, .y=0, .z=0};
__.param.period = {.x=1, .y=0, .z=0};
__.param.a = {.x=2.000000, .y=1.000000, .z=1.000000, .t=2.449490};
__.param.a = {.x=2.000000, .y=1.000000, .z=1.000000, .t=2.449490};
__.param.b = {.x=0.000000, .y=0.000000, .z=0.000000, .t=7.853982};
__.param.b = {.x=0.000000, .y=0.000000, .z=0.000000, .t=7.853982};


__.local.rank = 50;
__.local.rank = 28;
__.local.shape = {.x=4, .y=4, .z=4};
__.local.shape = {.x=4, .y=4, .z=4};
__.local.coord = {.x=3, .y=0, .z=2};
__.local.coord = {.x=1, .y=3, .z=0};


__.block.shape = {.x=66, .y=66, .z=66};
__.block.shape = {.x=66, .y=66, .z=66};
__.block.coord = {.x=192, .y=0, .z=128};
__.block.coord = {.x=64, .y=192, .z=0};
__.block.elems = 287496;
__.block.elems = 287496;


=======================
=======================
__.world.size = 64;
__.world.size = 64;
__.world.rank = 51;
__.world.rank = 29;


__.nodes.shape = {.x=256, .y=256, .z=256, .t=20};
__.nodes.shape = {.x=256, .y=256, .z=256, .t=20};
__.nodes.bound = {.x=3.141593, .y=3.141593, .z=3.141593, .t=0.010000};
__.nodes.bound = {.x=3.141593, .y=3.141593, .z=3.141593, .t=0.010000};
__.nodes.steps = {.x=0.012272, .y=0.012272, .z=0.012272, .t=0.000500};
__.nodes.steps = {.x=0.012272, .y=0.012272, .z=0.012272, .t=0.000500};


__.param.period = {.x=1, .y=0, .z=0};
__.param.period = {.x=1, .y=0, .z=0};
__.param.a = {.x=2.000000, .y=1.000000, .z=1.000000, .t=2.449490};
__.param.a = {.x=2.000000, .y=1.000000, .z=1.000000, .t=2.449490};
__.param.b = {.x=0.000000, .y=0.000000, .z=0.000000, .t=7.853982};
__.param.b = {.x=0.000000, .y=0.000000, .z=0.000000, .t=7.853982};


__.local.rank = 51;
__.local.rank = 29;
__.local.shape = {.x=4, .y=4, .z=4};
__.local.shape = {.x=4, .y=4, .z=4};
__.local.coord = {.x=3, .y=0, .z=3};
__.local.coord = {.x=1, .y=3, .z=1};


__.block.shape = {.x=66, .y=66, .z=66};
__.block.shape = {.x=66, .y=66, .z=66};
__.block.coord = {.x=192, .y=0, .z=192};
__.block.coord = {.x=64, .y=192, .z=64};
__.block.elems = 287496;
__.block.elems = 287496;


=======================
=======================
__.world.size = 64;
__.world.size = 64;
__.world.rank = 52;
__.world.rank = 30;


__.nodes.shape = {.x=256, .y=256, .z=256, .t=20};
__.nodes.shape = {.x=256, .y=256, .z=256, .t=20};
__.nodes.bound = {.x=3.141593, .y=3.141593, .z=3.141593, .t=0.010000};
__.nodes.bound = {.x=3.141593, .y=3.141593, .z=3.141593, .t=0.010000};
__.nodes.steps = {.x=0.012272, .y=0.012272, .z=0.012272, .t=0.000500};
__.nodes.steps = {.x=0.012272, .y=0.012272, .z=0.012272, .t=0.000500};


__.param.period = {.x=1, .y=0, .z=0};
__.param.period = {.x=1, .y=0, .z=0};
__.param.a = {.x=2.000000, .y=1.000000, .z=1.000000, .t=2.449490};
__.param.a = {.x=2.000000, .y=1.000000, .z=1.000000, .t=2.449490};
__.param.b = {.x=0.000000, .y=0.000000, .z=0.000000, .t=7.853982};
__.param.b = {.x=0.000000, .y=0.000000, .z=0.000000, .t=7.853982};


__.local.rank = 52;
__.local.rank = 30;
__.local.shape = {.x=4, .y=4, .z=4};
__.local.shape = {.x=4, .y=4, .z=4};
__.local.coord = {.x=3, .y=1, .z=0};
__.local.coord = {.x=1, .y=3, .z=2};


__.block.shape = {.x=66, .y=66, .z=66};
__.block.shape = {.x=66, .y=66, .z=66};
__.block.coord = {.x=192, .y=64, .z=0};
__.block.coord = {.x=64, .y=192, .z=128};
__.block.elems = 287496;
__.block.elems = 287496;


=======================
=======================
__.world.size = 64;
__.world.size = 64;
__.world.rank = 53;
__.world.rank = 31;


__.nodes.shape = {.x=256, .y=256, .z=256, .t=20};
__.nodes.shape = {.x=256, .y=256, .z=256, .t=20};
__.nodes.bound = {.x=3.141593, .y=3.141593, .z=3.141593, .t=0.010000};
__.nodes.bound = {.x=3.141593, .y=3.141593, .z=3.141593, .t=0.010000};
__.nodes.steps = {.x=0.012272, .y=0.012272, .z=0.012272, .t=0.000500};
__.nodes.steps = {.x=0.012272, .y=0.012272, .z=0.012272, .t=0.000500};


__.param.period = {.x=1, .y=0, .z=0};
__.param.period = {.x=1, .y=0, .z=0};
__.param.a = {.x=2.000000, .y=1.000000, .z=1.000000, .t=2.449490};
__.param.a = {.x=2.000000, .y=1.000000, .z=1.000000, .t=2.449490};
__.param.b = {.x=0.000000, .y=0.000000, .z=0.000000, .t=7.853982};
__.param.b = {.x=0.000000, .y=0.000000, .z=0.000000, .t=7.853982};


__.local.rank = 53;
__.local.rank = 31;
__.local.shape = {.x=4, .y=4, .z=4};
__.local.shape = {.x=4, .y=4, .z=4};
__.local.coord = {.x=3, .y=1, .z=1};
__.local.coord = {.x=1, .y=3, .z=3};


__.block.shape = {.x=66, .y=66, .z=66};
__.block.shape = {.x=66, .y=66, .z=66};
__.block.coord = {.x=192, .y=64, .z=64};
__.block.coord = {.x=64, .y=192, .z=192};
__.block.elems = 287496;
__.block.elems = 287496;


=======================
__.world.size = 64;
__.world.rank = 54;

__.nodes.shape = {.x=256, .y=256, .z=256, .t=20};
__.nodes.bound = {.x=3.141593, .y=3.141593, .z=3.141593, .t=0.010000};
__.nodes.steps = {.x=0.012272, .y=0.012272, .z=0.012272, .t=0.000500};

__.param.period = {.x=1, .y=0, .z=0};
__.param.a = {.x=2.000000, .y=1.000000, .z=1.000000, .t=2.449490};
__.param.b = {.x=0.000000, .y=0.000000, .z=0.000000, .t=7.853982};

__.local.rank = 54;
__.local.shape = {.x=4, .y=4, .z=4};
__.local.coord = {.x=3, .y=1, .z=2};

__.block.shape = {.x=66, .y=66, .z=66};
__.block.coord = {.x=192, .y=64, .z=128};
__.block.elems = 287496;

=======================
__.world.size = 64;
__.world.rank = 55;

__.nodes.shape = {.x=256, .y=256, .z=256, .t=20};
__.nodes.bound = {.x=3.141593, .y=3.141593, .z=3.141593, .t=0.010000};
__.nodes.steps = {.x=0.012272, .y=0.012272, .z=0.012272, .t=0.000500};

__.param.period = {.x=1, .y=0, .z=0};
__.param.a = {.x=2.000000, .y=1.000000, .z=1.000000, .t=2.449490};
__.param.b = {.x=0.000000, .y=0.000000, .z=0.000000, .t=7.853982};

__.local.rank = 55;
__.local.shape = {.x=4, .y=4, .z=4};
__.local.coord = {.x=3, .y=1, .z=3};

__.block.shape = {.x=66, .y=66, .z=66};
__.block.coord = {.x=192, .y=64, .z=192};
__.block.elems = 287496;

=======================
__.world.size = 64;
__.world.rank = 56;

__.nodes.shape = {.x=256, .y=256, .z=256, .t=20};
__.nodes.bound = {.x=3.141593, .y=3.141593, .z=3.141593, .t=0.010000};
__.nodes.steps = {.x=0.012272, .y=0.012272, .z=0.012272, .t=0.000500};

__.param.period = {.x=1, .y=0, .z=0};
__.param.a = {.x=2.000000, .y=1.000000, .z=1.000000, .t=2.449490};
__.param.b = {.x=0.000000, .y=0.000000, .z=0.000000, .t=7.853982};

__.local.rank = 56;
__.local.shape = {.x=4, .y=4, .z=4};
__.local.coord = {.x=3, .y=2, .z=0};

__.block.shape = {.x=66, .y=66, .z=66};
__.block.coord = {.x=192, .y=128, .z=0};
__.block.elems = 287496;

=======================
__.world.size = 64;
__.world.rank = 57;

__.nodes.shape = {.x=256, .y=256, .z=256, .t=20};
__.nodes.bound = {.x=3.141593, .y=3.141593, .z=3.141593, .t=0.010000};
__.nodes.steps = {.x=0.012272, .y=0.012272, .z=0.012272, .t=0.000500};

__.param.period = {.x=1, .y=0, .z=0};
__.param.a = {.x=2.000000, .y=1.000000, .z=1.000000, .t=2.449490};
__.param.b = {.x=0.000000, .y=0.000000, .z=0.000000, .t=7.853982};

__.local.rank = 57;
__.local.shape = {.x=4, .y=4, .z=4};
__.local.coord = {.x=3, .y=2, .z=1};

__.block.shape = {.x=66, .y=66, .z=66};
__.block.coord = {.x=192, .y=128, .z=64};
__.block.elems = 287496;

=======================
__.world.size = 64;
__.world.rank = 58;

__.nodes.shape = {.x=256, .y=256, .z=256, .t=20};
__.nodes.bound = {.x=3.141593, .y=3.141593, .z=3.141593, .t=0.010000};
__.nodes.steps = {.x=0.012272, .y=0.012272, .z=0.012272, .t=0.000500};

__.param.period = {.x=1, .y=0, .z=0};
__.param.a = {.x=2.000000, .y=1.000000, .z=1.000000, .t=2.449490};
__.param.b = {.x=0.000000, .y=0.000000, .z=0.000000, .t=7.853982};

__.local.rank = 58;
__.local.shape = {.x=4, .y=4, .z=4};
__.local.coord = {.x=3, .y=2, .z=2};

__.block.shape = {.x=66, .y=66, .z=66};
__.block.coord = {.x=192, .y=128, .z=128};
__.block.elems = 287496;

=======================
__.world.size = 64;
__.world.rank = 59;

__.nodes.shape = {.x=256, .y=256, .z=256, .t=20};
__.nodes.bound = {.x=3.141593, .y=3.141593, .z=3.141593, .t=0.010000};
__.nodes.steps = {.x=0.012272, .y=0.012272, .z=0.012272, .t=0.000500};

__.param.period = {.x=1, .y=0, .z=0};
__.param.a = {.x=2.000000, .y=1.000000, .z=1.000000, .t=2.449490};
__.param.b = {.x=0.000000, .y=0.000000, .z=0.000000, .t=7.853982};

__.local.rank = 59;
__.local.shape = {.x=4, .y=4, .z=4};
__.local.coord = {.x=3, .y=2, .z=3};

__.block.shape = {.x=66, .y=66, .z=66};
__.block.coord = {.x=192, .y=128, .z=192};
__.block.elems = 287496;

=======================
__.world.size = 64;
__.world.rank = 60;

__.nodes.shape = {.x=256, .y=256, .z=256, .t=20};
__.nodes.bound = {.x=3.141593, .y=3.141593, .z=3.141593, .t=0.010000};
__.nodes.steps = {.x=0.012272, .y=0.012272, .z=0.012272, .t=0.000500};

__.param.period = {.x=1, .y=0, .z=0};
__.param.a = {.x=2.000000, .y=1.000000, .z=1.000000, .t=2.449490};
__.param.b = {.x=0.000000, .y=0.000000, .z=0.000000, .t=7.853982};

__.local.rank = 60;
__.local.shape = {.x=4, .y=4, .z=4};
__.local.coord = {.x=3, .y=3, .z=0};

__.block.shape = {.x=66, .y=66, .z=66};
__.block.coord = {.x=192, .y=192, .z=0};
__.block.elems = 287496;

=======================
__.world.size = 64;
__.world.rank = 61;

__.nodes.shape = {.x=256, .y=256, .z=256, .t=20};
__.nodes.bound = {.x=3.141593, .y=3.141593, .z=3.141593, .t=0.010000};
__.nodes.steps = {.x=0.012272, .y=0.012272, .z=0.012272, .t=0.000500};

__.param.period = {.x=1, .y=0, .z=0};
__.param.a = {.x=2.000000, .y=1.000000, .z=1.000000, .t=2.449490};
__.param.b = {.x=0.000000, .y=0.000000, .z=0.000000, .t=7.853982};

__.local.rank = 61;
__.local.shape = {.x=4, .y=4, .z=4};
__.local.coord = {.x=3, .y=3, .z=1};

__.block.shape = {.x=66, .y=66, .z=66};
__.block.coord = {.x=192, .y=192, .z=64};
__.block.elems = 287496;

=======================
__.world.size = 64;
__.world.rank = 62;

__.nodes.shape = {.x=256, .y=256, .z=256, .t=20};
__.nodes.bound = {.x=3.141593, .y=3.141593, .z=3.141593, .t=0.010000};
__.nodes.steps = {.x=0.012272, .y=0.012272, .z=0.012272, .t=0.000500};

__.param.period = {.x=1, .y=0, .z=0};
__.param.a = {.x=2.000000, .y=1.000000, .z=1.000000, .t=2.449490};
__.param.b = {.x=0.000000, .y=0.000000, .z=0.000000, .t=7.853982};

__.local.rank = 62;
__.local.shape = {.x=4, .y=4, .z=4};
__.local.coord = {.x=3, .y=3, .z=2};

__.block.shape = {.x=66, .y=66, .z=66};
__.block.coord = {.x=192, .y=192, .z=128};
__.block.elems = 287496;

=======================
__.world.size = 64;
__.world.rank = 63;

__.nodes.shape = {.x=256, .y=256, .z=256, .t=20};
__.nodes.bound = {.x=3.141593, .y=3.141593, .z=3.141593, .t=0.010000};
__.nodes.steps = {.x=0.012272, .y=0.012272, .z=0.012272, .t=0.000500};

__.param.period = {.x=1, .y=0, .z=0};
__.param.a = {.x=2.000000, .y=1.000000, .z=1.000000, .t=2.449490};
__.param.b = {.x=0.000000, .y=0.000000, .z=0.000000, .t=7.853982};

__.local.rank = 63;
__.local.shape = {.x=4, .y=4, .z=4};
__.local.coord = {.x=3, .y=3, .z=3};

__.block.shape = {.x=66, .y=66, .z=66};
__.block.coord = {.x=192, .y=192, .z=192};
__.block.elems = 287496;

__TRIALS__.append((8.023315e+00, [0.000000e+00, 2.814293e-11, 1.125714e-10, 2.532855e-10, 4.502845e-10, 7.035680e-10, 1.013135e-09, 1.378985e-09, 1.801117e-09, 2.279529e-09, 2.814220e-09, 3.405188e-09, 4.052432e-09, 4.755950e-09, 5.515739e-09, 6.331797e-09, 7.204122e-09, 8.132712e-09, 9.117562e-09, 1.015867e-08, 1.125604e-08, ]))
__TRIALS__.append((8.027376e+00, [0.000000e+00, 2.814293e-11, 1.125714e-10, 2.532855e-10, 4.502845e-10, 7.035680e-10, 1.013135e-09, 1.378985e-09, 1.801117e-09, 2.279529e-09, 2.814220e-09, 3.405188e-09, 4.052432e-09, 4.755950e-09, 5.515739e-09, 6.331797e-09, 7.204122e-09, 8.132712e-09, 9.117562e-09, 1.015867e-08, 1.125604e-08, ]))
__TRIALS__.append((8.027242e+00, [0.000000e+00, 2.814293e-11, 1.125714e-10, 2.532855e-10, 4.502845e-10, 7.035680e-10, 1.013135e-09, 1.378985e-09, 1.801117e-09, 2.279529e-09, 2.814220e-09, 3.405188e-09, 4.052432e-09, 4.755950e-09, 5.515739e-09, 6.331797e-09, 7.204122e-09, 8.132712e-09, 9.117562e-09, 1.015867e-08, 1.125604e-08, ]))
__TRIALS__.append((8.027303e+00, [0.000000e+00, 2.814293e-11, 1.125714e-10, 2.532855e-10, 4.502845e-10, 7.035680e-10, 1.013135e-09, 1.378985e-09, 1.801117e-09, 2.279529e-09, 2.814220e-09, 3.405188e-09, 4.052432e-09, 4.755950e-09, 5.515739e-09, 6.331797e-09, 7.204122e-09, 8.132712e-09, 9.117562e-09, 1.015867e-08, 1.125604e-08, ]))
__TRIALS__.append((8.027182e+00, [0.000000e+00, 2.814293e-11, 1.125714e-10, 2.532855e-10, 4.502845e-10, 7.035680e-10, 1.013135e-09, 1.378985e-09, 1.801117e-09, 2.279529e-09, 2.814220e-09, 3.405188e-09, 4.052432e-09, 4.755950e-09, 5.515739e-09, 6.331797e-09, 7.204122e-09, 8.132712e-09, 9.117562e-09, 1.015867e-08, 1.125604e-08, ]))
__TRIALS__.append((8.027359e+00, [0.000000e+00, 2.814293e-11, 1.125714e-10, 2.532855e-10, 4.502845e-10, 7.035680e-10, 1.013135e-09, 1.378985e-09, 1.801117e-09, 2.279529e-09, 2.814220e-09, 3.405188e-09, 4.052432e-09, 4.755950e-09, 5.515739e-09, 6.331797e-09, 7.204122e-09, 8.132712e-09, 9.117562e-09, 1.015867e-08, 1.125604e-08, ]))
__TRIALS__.append((8.027238e+00, [0.000000e+00, 2.814293e-11, 1.125714e-10, 2.532855e-10, 4.502845e-10, 7.035680e-10, 1.013135e-09, 1.378985e-09, 1.801117e-09, 2.279529e-09, 2.814220e-09, 3.405188e-09, 4.052432e-09, 4.755950e-09, 5.515739e-09, 6.331797e-09, 7.204122e-09, 8.132712e-09, 9.117562e-09, 1.015867e-08, 1.125604e-08, ]))
__TRIALS__.append((8.027195e+00, [0.000000e+00, 2.814293e-11, 1.125714e-10, 2.532855e-10, 4.502845e-10, 7.035680e-10, 1.013135e-09, 1.378985e-09, 1.801117e-09, 2.279529e-09, 2.814220e-09, 3.405188e-09, 4.052432e-09, 4.755950e-09, 5.515739e-09, 6.331797e-09, 7.204122e-09, 8.132712e-09, 9.117562e-09, 1.015867e-08, 1.125604e-08, ]))
__TRIALS__.append((8.027322e+00, [0.000000e+00, 2.814293e-11, 1.125714e-10, 2.532855e-10, 4.502845e-10, 7.035680e-10, 1.013135e-09, 1.378985e-09, 1.801117e-09, 2.279529e-09, 2.814220e-09, 3.405188e-09, 4.052432e-09, 4.755950e-09, 5.515739e-09, 6.331797e-09, 7.204122e-09, 8.132712e-09, 9.117562e-09, 1.015867e-08, 1.125604e-08, ]))
__TRIALS__.append((8.027247e+00, [0.000000e+00, 2.814293e-11, 1.125714e-10, 2.532855e-10, 4.502845e-10, 7.035680e-10, 1.013135e-09, 1.378985e-09, 1.801117e-09, 2.279529e-09, 2.814220e-09, 3.405188e-09, 4.052432e-09, 4.755950e-09, 5.515739e-09, 6.331797e-09, 7.204122e-09, 8.132712e-09, 9.117562e-09, 1.015867e-08, 1.125604e-08, ]))
