Sender: LSF System <lsfadmin@polus-c2-ib.bmc.hpc.cs.msu.ru>
Subject: Job 836944: <# this file was automaticly created by mpisubmit.pl script for edu-cmc-skmodel21-622-16 #;source /polusfs/setenv/setup.SMPI;#BSUB -n 40;#BSUB -W 00:15;#BSUB -o main.%J.out;#BSUB -e main.%J.err;OMP_NUM_THREADS=1 mpiexec main 3.141592653589793 0.01 128 20> in cluster <MSUCluster> Done

Job <# this file was automaticly created by mpisubmit.pl script for edu-cmc-skmodel21-622-16 #;source /polusfs/setenv/setup.SMPI;#BSUB -n 40;#BSUB -W 00:15;#BSUB -o main.%J.out;#BSUB -e main.%J.err;OMP_NUM_THREADS=1 mpiexec main 3.141592653589793 0.01 128 20> was submitted from host <polus-ib.bmc.hpc.cs.msu.ru> by user <edu-cmc-skmodel21-622-16> in cluster <MSUCluster> at Mon Dec 13 23:21:58 2021
Job was executed on host(s) <19*polus-c2-ib.bmc.hpc.cs.msu.ru>, in queue <short>, as user <edu-cmc-skmodel21-622-16> in cluster <MSUCluster> at Mon Dec 13 23:22:01 2021
                            <20*polus-c4-ib.bmc.hpc.cs.msu.ru>
                            <1*polus-c1-ib.bmc.hpc.cs.msu.ru>
</home_edu/edu-cmc-skmodel21-622/edu-cmc-skmodel21-622-16> was used as the home directory.
</home_edu/edu-cmc-skmodel21-622/edu-cmc-skmodel21-622-16/solution> was used as the working directory.
Started at Mon Dec 13 23:22:01 2021
Terminated at Mon Dec 13 23:22:04 2021
Results reported at Mon Dec 13 23:22:04 2021

Your job looked like:

------------------------------------------------------------
# LSBATCH: User input
# this file was automaticly created by mpisubmit.pl script for edu-cmc-skmodel21-622-16 #
source /polusfs/setenv/setup.SMPI
#BSUB -n 40
#BSUB -W 00:15
#BSUB -o main.%J.out
#BSUB -e main.%J.err
OMP_NUM_THREADS=1 mpiexec main 3.141592653589793 0.01 128 20

------------------------------------------------------------

Successfully completed.

Resource usage summary:

    CPU time :                                   30.60 sec.
    Max Memory :                                 1045 MB
    Average Memory :                             697.00 MB
    Total Requested Memory :                     -
    Delta Memory :                               -
    Max Swap :                                   -
    Max Processes :                              23
    Max Threads :                                66
    Run time :                                   2 sec.
    Turnaround time :                            6 sec.

The output (if any) follows:

__PARAMS__ = {'P': 40, 'O': 0, 'L': 3.141593e+00, 'T': 1.000000e-02, 'N': 128, 'K': 20}
=======================
__.world.size = 40;
__.world.rank = 11;

__.nodes.shape = {.x=128, .y=128, .z=128, .t=20};
__.nodes.bound = {.x=3.141593, .y=3.141593, .z=3.141593, .t=0.010000};
__.nodes.steps = {.x=0.024544, .y=0.024544, .z=0.024544, .t=0.000500};

__.param.period = {.x=1, .y=0, .z=0};
__.param.a = {.x=2.000000, .y=1.000000, .z=1.000000, .t=2.449490};
__.param.b = {.x=0.000000, .y=0.000000, .z=0.000000, .t=7.853982};

__.local.rank = 11;
__.local.shape = {.x=5, .y=4, .z=2};
__.local.coord = {.x=1, .y=1, .z=1};

__.block.shape = {.x=28, .y=34, .z=66};
__.block.coord = {.x=26, .y=32, .z=64};
__.block.elems = 62832;

=======================
__.world.size = 40;
__.world.rank = 12;

__.nodes.shape = {.x=128, .y=128, .z=128, .t=20};
__.nodes.bound = {.x=3.141593, .y=3.141593, .z=3.141593, .t=0.010000};
__.nodes.steps = {.x=0.024544, .y=0.024544, .z=0.024544, .t=0.000500};

__.param.period = {.x=1, .y=0, .z=0};
__.param.a = {.x=2.000000, .y=1.000000, .z=1.000000, .t=2.449490};
__.param.b = {.x=0.000000, .y=0.000000, .z=0.000000, .t=7.853982};

__.local.rank = 12;
__.local.shape = {.x=5, .y=4, .z=2};
__.local.coord = {.x=1, .y=2, .z=0};

__.block.shape = {.x=28, .y=34, .z=66};
__.block.coord = {.x=26, .y=64, .z=0};
__.block.elems = 62832;

=======================
__.world.size = 40;
__.world.rank = 13;

__.nodes.shape = {.x=128, .y=128, .z=128, .t=20};
__.nodes.bound = {.x=3.141593, .y=3.141593, .z=3.141593, .t=0.010000};
__.nodes.steps = {.x=0.024544, .y=0.024544, .z=0.024544, .t=0.000500};

__.param.period = {.x=1, .y=0, .z=0};
__.param.a = {.x=2.000000, .y=1.000000, .z=1.000000, .t=2.449490};
__.param.b = {.x=0.000000, .y=0.000000, .z=0.000000, .t=7.853982};

__.local.rank = 13;
__.local.shape = {.x=5, .y=4, .z=2};
__.local.coord = {.x=1, .y=2, .z=1};

__.block.shape = {.x=28, .y=34, .z=66};
__.block.coord = {.x=26, .y=64, .z=64};
__.block.elems = 62832;

=======================
__.world.size = 40;
__.world.rank = 14;

__.nodes.shape = {.x=128, .y=128, .z=128, .t=20};
__.nodes.bound = {.x=3.141593, .y=3.141593, .z=3.141593, .t=0.010000};
__.nodes.steps = {.x=0.024544, .y=0.024544, .z=0.024544, .t=0.000500};

__.param.period = {.x=1, .y=0, .z=0};
__.param.a = {.x=2.000000, .y=1.000000, .z=1.000000, .t=2.449490};
__.param.b = {.x=0.000000, .y=0.000000, .z=0.000000, .t=7.853982};

__.local.rank = 14;
__.local.shape = {.x=5, .y=4, .z=2};
__.local.coord = {.x=1, .y=3, .z=0};

__.block.shape = {.x=28, .y=34, .z=66};
__.block.coord = {.x=26, .y=96, .z=0};
__.block.elems = 62832;

=======================
__.world.size = 40;
__.world.rank = 15;

__.nodes.shape = {.x=128, .y=128, .z=128, .t=20};
__.nodes.bound = {.x=3.141593, .y=3.141593, .z=3.141593, .t=0.010000};
__.nodes.steps = {.x=0.024544, .y=0.024544, .z=0.024544, .t=0.000500};

__.param.period = {.x=1, .y=0, .z=0};
__.param.a = {.x=2.000000, .y=1.000000, .z=1.000000, .t=2.449490};
__.param.b = {.x=0.000000, .y=0.000000, .z=0.000000, .t=7.853982};

__.local.rank = 15;
__.local.shape = {.x=5, .y=4, .z=2};
__.local.coord = {.x=1, .y=3, .z=1};

__.block.shape = {.x=28, .y=34, .z=66};
__.block.coord = {.x=26, .y=96, .z=64};
__.block.elems = 62832;

=======================
__.world.size = 40;
__.world.rank = 16;

__.nodes.shape = {.x=128, .y=128, .z=128, .t=20};
__.nodes.bound = {.x=3.141593, .y=3.141593, .z=3.141593, .t=0.010000};
__.nodes.steps = {.x=0.024544, .y=0.024544, .z=0.024544, .t=0.000500};

__.param.period = {.x=1, .y=0, .z=0};
__.param.a = {.x=2.000000, .y=1.000000, .z=1.000000, .t=2.449490};
__.param.b = {.x=0.000000, .y=0.000000, .z=0.000000, .t=7.853982};

__.local.rank = 16;
__.local.shape = {.x=5, .y=4, .z=2};
__.local.coord = {.x=2, .y=0, .z=0};

__.block.shape = {.x=28, .y=34, .z=66};
__.block.coord = {.x=52, .y=0, .z=0};
__.block.elems = 62832;

=======================
__.world.size = 40;
__.world.rank = 17;

__.nodes.shape = {.x=128, .y=128, .z=128, .t=20};
__.nodes.bound = {.x=3.141593, .y=3.141593, .z=3.141593, .t=0.010000};
__.nodes.steps = {.x=0.024544, .y=0.024544, .z=0.024544, .t=0.000500};

__.param.period = {.x=1, .y=0, .z=0};
__.param.a = {.x=2.000000, .y=1.000000, .z=1.000000, .t=2.449490};
__.param.b = {.x=0.000000, .y=0.000000, .z=0.000000, .t=7.853982};

__.local.rank = 17;
__.local.shape = {.x=5, .y=4, .z=2};
__.local.coord = {.x=2, .y=0, .z=1};

__.block.shape = {.x=28, .y=34, .z=66};
__.block.coord = {.x=52, .y=0, .z=64};
__.block.elems = 62832;

=======================
__.world.size = 40;
__.world.rank = 18;

__.nodes.shape = {.x=128, .y=128, .z=128, .t=20};
__.nodes.bound = {.x=3.141593, .y=3.141593, .z=3.141593, .t=0.010000};
__.nodes.steps = {.x=0.024544, .y=0.024544, .z=0.024544, .t=0.000500};

__.param.period = {.x=1, .y=0, .z=0};
__.param.a = {.x=2.000000, .y=1.000000, .z=1.000000, .t=2.449490};
__.param.b = {.x=0.000000, .y=0.000000, .z=0.000000, .t=7.853982};

__.local.rank = 18;
__.local.shape = {.x=5, .y=4, .z=2};
__.local.coord = {.x=2, .y=1, .z=0};

__.block.shape = {.x=28, .y=34, .z=66};
__.block.coord = {.x=52, .y=32, .z=0};
__.block.elems = 62832;

=======================
__.world.size = 40;
__.world.rank = 0;

__.nodes.shape = {.x=128, .y=128, .z=128, .t=20};
__.nodes.bound = {.x=3.141593, .y=3.141593, .z=3.141593, .t=0.010000};
__.nodes.steps = {.x=0.024544, .y=0.024544, .z=0.024544, .t=0.000500};

__.param.period = {.x=1, .y=0, .z=0};
__.param.a = {.x=2.000000, .y=1.000000, .z=1.000000, .t=2.449490};
__.param.b = {.x=0.000000, .y=0.000000, .z=0.000000, .t=7.853982};

__.local.rank = 0;
__.local.shape = {.x=5, .y=4, .z=2};
__.local.coord = {.x=0, .y=0, .z=0};

__.block.shape = {.x=28, .y=34, .z=66};
__.block.coord = {.x=0, .y=0, .z=0};
__.block.elems = 62832;

=======================
__.world.size = 40;
__.world.rank = 1;

__.nodes.shape = {.x=128, .y=128, .z=128, .t=20};
__.nodes.bound = {.x=3.141593, .y=3.141593, .z=3.141593, .t=0.010000};
__.nodes.steps = {.x=0.024544, .y=0.024544, .z=0.024544, .t=0.000500};

__.param.period = {.x=1, .y=0, .z=0};
__.param.a = {.x=2.000000, .y=1.000000, .z=1.000000, .t=2.449490};
__.param.b = {.x=0.000000, .y=0.000000, .z=0.000000, .t=7.853982};

__.local.rank = 1;
__.local.shape = {.x=5, .y=4, .z=2};
__.local.coord = {.x=0, .y=0, .z=1};

__.block.shape = {.x=28, .y=34, .z=66};
__.block.coord = {.x=0, .y=0, .z=64};
__.block.elems = 62832;

=======================
__.world.size = 40;
__.world.rank = 2;

__.nodes.shape = {.x=128, .y=128, .z=128, .t=20};
__.nodes.bound = {.x=3.141593, .y=3.141593, .z=3.141593, .t=0.010000};
__.nodes.steps = {.x=0.024544, .y=0.024544, .z=0.024544, .t=0.000500};

__.param.period = {.x=1, .y=0, .z=0};
__.param.a = {.x=2.000000, .y=1.000000, .z=1.000000, .t=2.449490};
__.param.b = {.x=0.000000, .y=0.000000, .z=0.000000, .t=7.853982};

__.local.rank = 2;
__.local.shape = {.x=5, .y=4, .z=2};
__.local.coord = {.x=0, .y=1, .z=0};

__.block.shape = {.x=28, .y=34, .z=66};
__.block.coord = {.x=0, .y=32, .z=0};
__.block.elems = 62832;

=======================
__.world.size = 40;
__.world.rank = 3;

__.nodes.shape = {.x=128, .y=128, .z=128, .t=20};
__.nodes.bound = {.x=3.141593, .y=3.141593, .z=3.141593, .t=0.010000};
__.nodes.steps = {.x=0.024544, .y=0.024544, .z=0.024544, .t=0.000500};

__.param.period = {.x=1, .y=0, .z=0};
__.param.a = {.x=2.000000, .y=1.000000, .z=1.000000, .t=2.449490};
__.param.b = {.x=0.000000, .y=0.000000, .z=0.000000, .t=7.853982};

__.local.rank = 3;
__.local.shape = {.x=5, .y=4, .z=2};
__.local.coord = {.x=0, .y=1, .z=1};

__.block.shape = {.x=28, .y=34, .z=66};
__.block.coord = {.x=0, .y=32, .z=64};
__.block.elems = 62832;

=======================
__.world.size = 40;
__.world.rank = 4;

__.nodes.shape = {.x=128, .y=128, .z=128, .t=20};
__.nodes.bound = {.x=3.141593, .y=3.141593, .z=3.141593, .t=0.010000};
__.nodes.steps = {.x=0.024544, .y=0.024544, .z=0.024544, .t=0.000500};

__.param.period = {.x=1, .y=0, .z=0};
__.param.a = {.x=2.000000, .y=1.000000, .z=1.000000, .t=2.449490};
__.param.b = {.x=0.000000, .y=0.000000, .z=0.000000, .t=7.853982};

__.local.rank = 4;
__.local.shape = {.x=5, .y=4, .z=2};
__.local.coord = {.x=0, .y=2, .z=0};

__.block.shape = {.x=28, .y=34, .z=66};
__.block.coord = {.x=0, .y=64, .z=0};
__.block.elems = 62832;

=======================
__.world.size = 40;
__.world.rank = 5;

__.nodes.shape = {.x=128, .y=128, .z=128, .t=20};
__.nodes.bound = {.x=3.141593, .y=3.141593, .z=3.141593, .t=0.010000};
__.nodes.steps = {.x=0.024544, .y=0.024544, .z=0.024544, .t=0.000500};

__.param.period = {.x=1, .y=0, .z=0};
__.param.a = {.x=2.000000, .y=1.000000, .z=1.000000, .t=2.449490};
__.param.b = {.x=0.000000, .y=0.000000, .z=0.000000, .t=7.853982};

__.local.rank = 5;
__.local.shape = {.x=5, .y=4, .z=2};
__.local.coord = {.x=0, .y=2, .z=1};

__.block.shape = {.x=28, .y=34, .z=66};
__.block.coord = {.x=0, .y=64, .z=64};
__.block.elems = 62832;

=======================
__.world.size = 40;
__.world.rank = 6;

__.nodes.shape = {.x=128, .y=128, .z=128, .t=20};
__.nodes.bound = {.x=3.141593, .y=3.141593, .z=3.141593, .t=0.010000};
__.nodes.steps = {.x=0.024544, .y=0.024544, .z=0.024544, .t=0.000500};

__.param.period = {.x=1, .y=0, .z=0};
__.param.a = {.x=2.000000, .y=1.000000, .z=1.000000, .t=2.449490};
__.param.b = {.x=0.000000, .y=0.000000, .z=0.000000, .t=7.853982};

__.local.rank = 6;
__.local.shape = {.x=5, .y=4, .z=2};
__.local.coord = {.x=0, .y=3, .z=0};

__.block.shape = {.x=28, .y=34, .z=66};
__.block.coord = {.x=0, .y=96, .z=0};
__.block.elems = 62832;

=======================
__.world.size = 40;
__.world.rank = 7;

__.nodes.shape = {.x=128, .y=128, .z=128, .t=20};
__.nodes.bound = {.x=3.141593, .y=3.141593, .z=3.141593, .t=0.010000};
__.nodes.steps = {.x=0.024544, .y=0.024544, .z=0.024544, .t=0.000500};

__.param.period = {.x=1, .y=0, .z=0};
__.param.a = {.x=2.000000, .y=1.000000, .z=1.000000, .t=2.449490};
__.param.b = {.x=0.000000, .y=0.000000, .z=0.000000, .t=7.853982};

__.local.rank = 7;
__.local.shape = {.x=5, .y=4, .z=2};
__.local.coord = {.x=0, .y=3, .z=1};

__.block.shape = {.x=28, .y=34, .z=66};
__.block.coord = {.x=0, .y=96, .z=64};
__.block.elems = 62832;

=======================
__.world.size = 40;
__.world.rank = 8;

__.nodes.shape = {.x=128, .y=128, .z=128, .t=20};
__.nodes.bound = {.x=3.141593, .y=3.141593, .z=3.141593, .t=0.010000};
__.nodes.steps = {.x=0.024544, .y=0.024544, .z=0.024544, .t=0.000500};

__.param.period = {.x=1, .y=0, .z=0};
__.param.a = {.x=2.000000, .y=1.000000, .z=1.000000, .t=2.449490};
__.param.b = {.x=0.000000, .y=0.000000, .z=0.000000, .t=7.853982};

__.local.rank = 8;
__.local.shape = {.x=5, .y=4, .z=2};
__.local.coord = {.x=1, .y=0, .z=0};

__.block.shape = {.x=28, .y=34, .z=66};
__.block.coord = {.x=26, .y=0, .z=0};
__.block.elems = 62832;

=======================
__.world.size = 40;
__.world.rank = 9;

__.nodes.shape = {.x=128, .y=128, .z=128, .t=20};
__.nodes.bound = {.x=3.141593, .y=3.141593, .z=3.141593, .t=0.010000};
__.nodes.steps = {.x=0.024544, .y=0.024544, .z=0.024544, .t=0.000500};

__.param.period = {.x=1, .y=0, .z=0};
__.param.a = {.x=2.000000, .y=1.000000, .z=1.000000, .t=2.449490};
__.param.b = {.x=0.000000, .y=0.000000, .z=0.000000, .t=7.853982};

__.local.rank = 9;
__.local.shape = {.x=5, .y=4, .z=2};
__.local.coord = {.x=1, .y=0, .z=1};

__.block.shape = {.x=28, .y=34, .z=66};
__.block.coord = {.x=26, .y=0, .z=64};
__.block.elems = 62832;

=======================
__.world.size = 40;
__.world.rank = 10;

__.nodes.shape = {.x=128, .y=128, .z=128, .t=20};
__.nodes.bound = {.x=3.141593, .y=3.141593, .z=3.141593, .t=0.010000};
__.nodes.steps = {.x=0.024544, .y=0.024544, .z=0.024544, .t=0.000500};

__.param.period = {.x=1, .y=0, .z=0};
__.param.a = {.x=2.000000, .y=1.000000, .z=1.000000, .t=2.449490};
__.param.b = {.x=0.000000, .y=0.000000, .z=0.000000, .t=7.853982};

__.local.rank = 10;
__.local.shape = {.x=5, .y=4, .z=2};
__.local.coord = {.x=1, .y=1, .z=0};

__.block.shape = {.x=28, .y=34, .z=66};
__.block.coord = {.x=26, .y=32, .z=0};
__.block.elems = 62832;

=======================
__.world.size = 40;
__.world.rank = 39;

__.nodes.shape = {.x=128, .y=128, .z=128, .t=20};
__.nodes.bound = {.x=3.141593, .y=3.141593, .z=3.141593, .t=0.010000};
__.nodes.steps = {.x=0.024544, .y=0.024544, .z=0.024544, .t=0.000500};

__.param.period = {.x=1, .y=0, .z=0};
__.param.a = {.x=2.000000, .y=1.000000, .z=1.000000, .t=2.449490};
__.param.b = {.x=0.000000, .y=0.000000, .z=0.000000, .t=7.853982};

__.local.rank = 39;
__.local.shape = {.x=5, .y=4, .z=2};
__.local.coord = {.x=4, .y=3, .z=1};

__.block.shape = {.x=26, .y=34, .z=66};
__.block.coord = {.x=104, .y=96, .z=64};
__.block.elems = 58344;

=======================
__.world.size = 40;
__.world.rank = 34;

__.nodes.shape = {.x=128, .y=128, .z=128, .t=20};
__.nodes.bound = {.x=3.141593, .y=3.141593, .z=3.141593, .t=0.010000};
__.nodes.steps = {.x=0.024544, .y=0.024544, .z=0.024544, .t=0.000500};

__.param.period = {.x=1, .y=0, .z=0};
__.param.a = {.x=2.000000, .y=1.000000, .z=1.000000, .t=2.449490};
__.param.b = {.x=0.000000, .y=0.000000, .z=0.000000, .t=7.853982};

__.local.rank = 34;
__.local.shape = {.x=5, .y=4, .z=2};
__.local.coord = {.x=4, .y=1, .z=0};

__.block.shape = {.x=26, .y=34, .z=66};
__.block.coord = {.x=104, .y=32, .z=0};
__.block.elems = 58344;

=======================
__.world.size = 40;
__.world.rank = 35;

__.nodes.shape = {.x=128, .y=128, .z=128, .t=20};
__.nodes.bound = {.x=3.141593, .y=3.141593, .z=3.141593, .t=0.010000};
__.nodes.steps = {.x=0.024544, .y=0.024544, .z=0.024544, .t=0.000500};

__.param.period = {.x=1, .y=0, .z=0};
__.param.a = {.x=2.000000, .y=1.000000, .z=1.000000, .t=2.449490};
__.param.b = {.x=0.000000, .y=0.000000, .z=0.000000, .t=7.853982};

__.local.rank = 35;
__.local.shape = {.x=5, .y=4, .z=2};
__.local.coord = {.x=4, .y=1, .z=1};

__.block.shape = {.x=26, .y=34, .z=66};
__.block.coord = {.x=104, .y=32, .z=64};
__.block.elems = 58344;

=======================
__.world.size = 40;
__.world.rank = 36;

__.nodes.shape = {.x=128, .y=128, .z=128, .t=20};
__.nodes.bound = {.x=3.141593, .y=3.141593, .z=3.141593, .t=0.010000};
__.nodes.steps = {.x=0.024544, .y=0.024544, .z=0.024544, .t=0.000500};

__.param.period = {.x=1, .y=0, .z=0};
__.param.a = {.x=2.000000, .y=1.000000, .z=1.000000, .t=2.449490};
__.param.b = {.x=0.000000, .y=0.000000, .z=0.000000, .t=7.853982};

__.local.rank = 36;
__.local.shape = {.x=5, .y=4, .z=2};
__.local.coord = {.x=4, .y=2, .z=0};

__.block.shape = {.x=26, .y=34, .z=66};
__.block.coord = {.x=104, .y=64, .z=0};
__.block.elems = 58344;

=======================
__.world.size = 40;
__.world.rank = 37;

__.nodes.shape = {.x=128, .y=128, .z=128, .t=20};
__.nodes.bound = {.x=3.141593, .y=3.141593, .z=3.141593, .t=0.010000};
__.nodes.steps = {.x=0.024544, .y=0.024544, .z=0.024544, .t=0.000500};

__.param.period = {.x=1, .y=0, .z=0};
__.param.a = {.x=2.000000, .y=1.000000, .z=1.000000, .t=2.449490};
__.param.b = {.x=0.000000, .y=0.000000, .z=0.000000, .t=7.853982};

__.local.rank = 37;
__.local.shape = {.x=5, .y=4, .z=2};
__.local.coord = {.x=4, .y=2, .z=1};

__.block.shape = {.x=26, .y=34, .z=66};
__.block.coord = {.x=104, .y=64, .z=64};
__.block.elems = 58344;

=======================
__.world.size = 40;
__.world.rank = 38;

__.nodes.shape = {.x=128, .y=128, .z=128, .t=20};
__.nodes.bound = {.x=3.141593, .y=3.141593, .z=3.141593, .t=0.010000};
__.nodes.steps = {.x=0.024544, .y=0.024544, .z=0.024544, .t=0.000500};

__.param.period = {.x=1, .y=0, .z=0};
__.param.a = {.x=2.000000, .y=1.000000, .z=1.000000, .t=2.449490};
__.param.b = {.x=0.000000, .y=0.000000, .z=0.000000, .t=7.853982};

__.local.rank = 38;
__.local.shape = {.x=5, .y=4, .z=2};
__.local.coord = {.x=4, .y=3, .z=0};

__.block.shape = {.x=26, .y=34, .z=66};
__.block.coord = {.x=104, .y=96, .z=0};
__.block.elems = 58344;

=======================
__.world.size = 40;
__.world.rank = 19;

__.nodes.shape = {.x=128, .y=128, .z=128, .t=20};
__.nodes.bound = {.x=3.141593, .y=3.141593, .z=3.141593, .t=0.010000};
__.nodes.steps = {.x=0.024544, .y=0.024544, .z=0.024544, .t=0.000500};

__.param.period = {.x=1, .y=0, .z=0};
__.param.a = {.x=2.000000, .y=1.000000, .z=1.000000, .t=2.449490};
__.param.b = {.x=0.000000, .y=0.000000, .z=0.000000, .t=7.853982};

__.local.rank = 19;
__.local.shape = {.x=5, .y=4, .z=2};
__.local.coord = {.x=2, .y=1, .z=1};

__.block.shape = {.x=28, .y=34, .z=66};
__.block.coord = {.x=52, .y=32, .z=64};
__.block.elems = 62832;

=======================
__.world.size = 40;
__.world.rank = 20;

__.nodes.shape = {.x=128, .y=128, .z=128, .t=20};
__.nodes.bound = {.x=3.141593, .y=3.141593, .z=3.141593, .t=0.010000};
__.nodes.steps = {.x=0.024544, .y=0.024544, .z=0.024544, .t=0.000500};

__.param.period = {.x=1, .y=0, .z=0};
__.param.a = {.x=2.000000, .y=1.000000, .z=1.000000, .t=2.449490};
__.param.b = {.x=0.000000, .y=0.000000, .z=0.000000, .t=7.853982};

__.local.rank = 20;
__.local.shape = {.x=5, .y=4, .z=2};
__.local.coord = {.x=2, .y=2, .z=0};

__.block.shape = {.x=28, .y=34, .z=66};
__.block.coord = {.x=52, .y=64, .z=0};
__.block.elems = 62832;

=======================
__.world.size = 40;
__.world.rank = 21;

__.nodes.shape = {.x=128, .y=128, .z=128, .t=20};
__.nodes.bound = {.x=3.141593, .y=3.141593, .z=3.141593, .t=0.010000};
__.nodes.steps = {.x=0.024544, .y=0.024544, .z=0.024544, .t=0.000500};

__.param.period = {.x=1, .y=0, .z=0};
__.param.a = {.x=2.000000, .y=1.000000, .z=1.000000, .t=2.449490};
__.param.b = {.x=0.000000, .y=0.000000, .z=0.000000, .t=7.853982};

__.local.rank = 21;
__.local.shape = {.x=5, .y=4, .z=2};
__.local.coord = {.x=2, .y=2, .z=1};

__.block.shape = {.x=28, .y=34, .z=66};
__.block.coord = {.x=52, .y=64, .z=64};
__.block.elems = 62832;

=======================
__.world.size = 40;
__.world.rank = 22;

__.nodes.shape = {.x=128, .y=128, .z=128, .t=20};
__.nodes.bound = {.x=3.141593, .y=3.141593, .z=3.141593, .t=0.010000};
__.nodes.steps = {.x=0.024544, .y=0.024544, .z=0.024544, .t=0.000500};

__.param.period = {.x=1, .y=0, .z=0};
__.param.a = {.x=2.000000, .y=1.000000, .z=1.000000, .t=2.449490};
__.param.b = {.x=0.000000, .y=0.000000, .z=0.000000, .t=7.853982};

__.local.rank = 22;
__.local.shape = {.x=5, .y=4, .z=2};
__.local.coord = {.x=2, .y=3, .z=0};

__.block.shape = {.x=28, .y=34, .z=66};
__.block.coord = {.x=52, .y=96, .z=0};
__.block.elems = 62832;

=======================
__.world.size = 40;
__.world.rank = 23;

__.nodes.shape = {.x=128, .y=128, .z=128, .t=20};
__.nodes.bound = {.x=3.141593, .y=3.141593, .z=3.141593, .t=0.010000};
__.nodes.steps = {.x=0.024544, .y=0.024544, .z=0.024544, .t=0.000500};

__.param.period = {.x=1, .y=0, .z=0};
__.param.a = {.x=2.000000, .y=1.000000, .z=1.000000, .t=2.449490};
__.param.b = {.x=0.000000, .y=0.000000, .z=0.000000, .t=7.853982};

__.local.rank = 23;
__.local.shape = {.x=5, .y=4, .z=2};
__.local.coord = {.x=2, .y=3, .z=1};

__.block.shape = {.x=28, .y=34, .z=66};
__.block.coord = {.x=52, .y=96, .z=64};
__.block.elems = 62832;

=======================
__.world.size = 40;
__.world.rank = 24;

__.nodes.shape = {.x=128, .y=128, .z=128, .t=20};
__.nodes.bound = {.x=3.141593, .y=3.141593, .z=3.141593, .t=0.010000};
__.nodes.steps = {.x=0.024544, .y=0.024544, .z=0.024544, .t=0.000500};

__.param.period = {.x=1, .y=0, .z=0};
__.param.a = {.x=2.000000, .y=1.000000, .z=1.000000, .t=2.449490};
__.param.b = {.x=0.000000, .y=0.000000, .z=0.000000, .t=7.853982};

__.local.rank = 24;
__.local.shape = {.x=5, .y=4, .z=2};
__.local.coord = {.x=3, .y=0, .z=0};

__.block.shape = {.x=28, .y=34, .z=66};
__.block.coord = {.x=78, .y=0, .z=0};
__.block.elems = 62832;

=======================
__.world.size = 40;
__.world.rank = 25;

__.nodes.shape = {.x=128, .y=128, .z=128, .t=20};
__.nodes.bound = {.x=3.141593, .y=3.141593, .z=3.141593, .t=0.010000};
__.nodes.steps = {.x=0.024544, .y=0.024544, .z=0.024544, .t=0.000500};

__.param.period = {.x=1, .y=0, .z=0};
__.param.a = {.x=2.000000, .y=1.000000, .z=1.000000, .t=2.449490};
__.param.b = {.x=0.000000, .y=0.000000, .z=0.000000, .t=7.853982};

__.local.rank = 25;
__.local.shape = {.x=5, .y=4, .z=2};
__.local.coord = {.x=3, .y=0, .z=1};

__.block.shape = {.x=28, .y=34, .z=66};
__.block.coord = {.x=78, .y=0, .z=64};
__.block.elems = 62832;

=======================
__.world.size = 40;
__.world.rank = 26;

__.nodes.shape = {.x=128, .y=128, .z=128, .t=20};
__.nodes.bound = {.x=3.141593, .y=3.141593, .z=3.141593, .t=0.010000};
__.nodes.steps = {.x=0.024544, .y=0.024544, .z=0.024544, .t=0.000500};

__.param.period = {.x=1, .y=0, .z=0};
__.param.a = {.x=2.000000, .y=1.000000, .z=1.000000, .t=2.449490};
__.param.b = {.x=0.000000, .y=0.000000, .z=0.000000, .t=7.853982};

__.local.rank = 26;
__.local.shape = {.x=5, .y=4, .z=2};
__.local.coord = {.x=3, .y=1, .z=0};

__.block.shape = {.x=28, .y=34, .z=66};
__.block.coord = {.x=78, .y=32, .z=0};
__.block.elems = 62832;

=======================
__.world.size = 40;
__.world.rank = 27;

__.nodes.shape = {.x=128, .y=128, .z=128, .t=20};
__.nodes.bound = {.x=3.141593, .y=3.141593, .z=3.141593, .t=0.010000};
__.nodes.steps = {.x=0.024544, .y=0.024544, .z=0.024544, .t=0.000500};

__.param.period = {.x=1, .y=0, .z=0};
__.param.a = {.x=2.000000, .y=1.000000, .z=1.000000, .t=2.449490};
__.param.b = {.x=0.000000, .y=0.000000, .z=0.000000, .t=7.853982};

__.local.rank = 27;
__.local.shape = {.x=5, .y=4, .z=2};
__.local.coord = {.x=3, .y=1, .z=1};

__.block.shape = {.x=28, .y=34, .z=66};
__.block.coord = {.x=78, .y=32, .z=64};
__.block.elems = 62832;

=======================
__.world.size = 40;
__.world.rank = 28;

__.nodes.shape = {.x=128, .y=128, .z=128, .t=20};
__.nodes.bound = {.x=3.141593, .y=3.141593, .z=3.141593, .t=0.010000};
__.nodes.steps = {.x=0.024544, .y=0.024544, .z=0.024544, .t=0.000500};

__.param.period = {.x=1, .y=0, .z=0};
__.param.a = {.x=2.000000, .y=1.000000, .z=1.000000, .t=2.449490};
__.param.b = {.x=0.000000, .y=0.000000, .z=0.000000, .t=7.853982};

__.local.rank = 28;
__.local.shape = {.x=5, .y=4, .z=2};
__.local.coord = {.x=3, .y=2, .z=0};

__.block.shape = {.x=28, .y=34, .z=66};
__.block.coord = {.x=78, .y=64, .z=0};
__.block.elems = 62832;

=======================
__.world.size = 40;
__.world.rank = 29;

__.nodes.shape = {.x=128, .y=128, .z=128, .t=20};
__.nodes.bound = {.x=3.141593, .y=3.141593, .z=3.141593, .t=0.010000};
__.nodes.steps = {.x=0.024544, .y=0.024544, .z=0.024544, .t=0.000500};

__.param.period = {.x=1, .y=0, .z=0};
__.param.a = {.x=2.000000, .y=1.000000, .z=1.000000, .t=2.449490};
__.param.b = {.x=0.000000, .y=0.000000, .z=0.000000, .t=7.853982};

__.local.rank = 29;
__.local.shape = {.x=5, .y=4, .z=2};
__.local.coord = {.x=3, .y=2, .z=1};

__.block.shape = {.x=28, .y=34, .z=66};
__.block.coord = {.x=78, .y=64, .z=64};
__.block.elems = 62832;

=======================
__.world.size = 40;
__.world.rank = 30;

__.nodes.shape = {.x=128, .y=128, .z=128, .t=20};
__.nodes.bound = {.x=3.141593, .y=3.141593, .z=3.141593, .t=0.010000};
__.nodes.steps = {.x=0.024544, .y=0.024544, .z=0.024544, .t=0.000500};

__.param.period = {.x=1, .y=0, .z=0};
__.param.a = {.x=2.000000, .y=1.000000, .z=1.000000, .t=2.449490};
__.param.b = {.x=0.000000, .y=0.000000, .z=0.000000, .t=7.853982};

__.local.rank = 30;
__.local.shape = {.x=5, .y=4, .z=2};
__.local.coord = {.x=3, .y=3, .z=0};

__.block.shape = {.x=28, .y=34, .z=66};
__.block.coord = {.x=78, .y=96, .z=0};
__.block.elems = 62832;

=======================
__.world.size = 40;
__.world.rank = 31;

__.nodes.shape = {.x=128, .y=128, .z=128, .t=20};
__.nodes.bound = {.x=3.141593, .y=3.141593, .z=3.141593, .t=0.010000};
__.nodes.steps = {.x=0.024544, .y=0.024544, .z=0.024544, .t=0.000500};

__.param.period = {.x=1, .y=0, .z=0};
__.param.a = {.x=2.000000, .y=1.000000, .z=1.000000, .t=2.449490};
__.param.b = {.x=0.000000, .y=0.000000, .z=0.000000, .t=7.853982};

__.local.rank = 31;
__.local.shape = {.x=5, .y=4, .z=2};
__.local.coord = {.x=3, .y=3, .z=1};

__.block.shape = {.x=28, .y=34, .z=66};
__.block.coord = {.x=78, .y=96, .z=64};
__.block.elems = 62832;

=======================
__.world.size = 40;
__.world.rank = 32;

__.nodes.shape = {.x=128, .y=128, .z=128, .t=20};
__.nodes.bound = {.x=3.141593, .y=3.141593, .z=3.141593, .t=0.010000};
__.nodes.steps = {.x=0.024544, .y=0.024544, .z=0.024544, .t=0.000500};

__.param.period = {.x=1, .y=0, .z=0};
__.param.a = {.x=2.000000, .y=1.000000, .z=1.000000, .t=2.449490};
__.param.b = {.x=0.000000, .y=0.000000, .z=0.000000, .t=7.853982};

__.local.rank = 32;
__.local.shape = {.x=5, .y=4, .z=2};
__.local.coord = {.x=4, .y=0, .z=0};

__.block.shape = {.x=26, .y=34, .z=66};
__.block.coord = {.x=104, .y=0, .z=0};
__.block.elems = 58344;

=======================
__.world.size = 40;
__.world.rank = 33;

__.nodes.shape = {.x=128, .y=128, .z=128, .t=20};
__.nodes.bound = {.x=3.141593, .y=3.141593, .z=3.141593, .t=0.010000};
__.nodes.steps = {.x=0.024544, .y=0.024544, .z=0.024544, .t=0.000500};

__.param.period = {.x=1, .y=0, .z=0};
__.param.a = {.x=2.000000, .y=1.000000, .z=1.000000, .t=2.449490};
__.param.b = {.x=0.000000, .y=0.000000, .z=0.000000, .t=7.853982};

__.local.rank = 33;
__.local.shape = {.x=5, .y=4, .z=2};
__.local.coord = {.x=4, .y=0, .z=1};

__.block.shape = {.x=26, .y=34, .z=66};
__.block.coord = {.x=104, .y=0, .z=64};
__.block.elems = 58344;

__TRIALS__.append((1.226366e-01, [0.000000e+00, 1.128466e-10, 4.513859e-10, 1.015617e-09, 1.805538e-09, 2.821147e-09, 4.062441e-09, 5.529415e-09, 7.222067e-09, 9.140389e-09, 1.128438e-08, 1.365403e-08, 1.624933e-08, 1.907027e-08, 2.211685e-08, 2.538906e-08, 2.888688e-08, 3.261031e-08, 3.655934e-08, 4.073395e-08, 4.513413e-08, ]))
__TRIALS__.append((1.067641e-01, [0.000000e+00, 1.128466e-10, 4.513859e-10, 1.015617e-09, 1.805538e-09, 2.821147e-09, 4.062441e-09, 5.529415e-09, 7.222067e-09, 9.140389e-09, 1.128438e-08, 1.365403e-08, 1.624933e-08, 1.907027e-08, 2.211685e-08, 2.538906e-08, 2.888688e-08, 3.261031e-08, 3.655934e-08, 4.073395e-08, 4.513413e-08, ]))
__TRIALS__.append((8.712673e-02, [0.000000e+00, 1.128466e-10, 4.513859e-10, 1.015617e-09, 1.805538e-09, 2.821147e-09, 4.062441e-09, 5.529415e-09, 7.222067e-09, 9.140389e-09, 1.128438e-08, 1.365403e-08, 1.624933e-08, 1.907027e-08, 2.211685e-08, 2.538906e-08, 2.888688e-08, 3.261031e-08, 3.655934e-08, 4.073395e-08, 4.513413e-08, ]))
__TRIALS__.append((4.487526e-02, [0.000000e+00, 1.128466e-10, 4.513859e-10, 1.015617e-09, 1.805538e-09, 2.821147e-09, 4.062441e-09, 5.529415e-09, 7.222067e-09, 9.140389e-09, 1.128438e-08, 1.365403e-08, 1.624933e-08, 1.907027e-08, 2.211685e-08, 2.538906e-08, 2.888688e-08, 3.261031e-08, 3.655934e-08, 4.073395e-08, 4.513413e-08, ]))
__TRIALS__.append((4.496383e-02, [0.000000e+00, 1.128466e-10, 4.513859e-10, 1.015617e-09, 1.805538e-09, 2.821147e-09, 4.062441e-09, 5.529415e-09, 7.222067e-09, 9.140389e-09, 1.128438e-08, 1.365403e-08, 1.624933e-08, 1.907027e-08, 2.211685e-08, 2.538906e-08, 2.888688e-08, 3.261031e-08, 3.655934e-08, 4.073395e-08, 4.513413e-08, ]))
__TRIALS__.append((4.498094e-02, [0.000000e+00, 1.128466e-10, 4.513859e-10, 1.015617e-09, 1.805538e-09, 2.821147e-09, 4.062441e-09, 5.529415e-09, 7.222067e-09, 9.140389e-09, 1.128438e-08, 1.365403e-08, 1.624933e-08, 1.907027e-08, 2.211685e-08, 2.538906e-08, 2.888688e-08, 3.261031e-08, 3.655934e-08, 4.073395e-08, 4.513413e-08, ]))
__TRIALS__.append((4.507306e-02, [0.000000e+00, 1.128466e-10, 4.513859e-10, 1.015617e-09, 1.805538e-09, 2.821147e-09, 4.062441e-09, 5.529415e-09, 7.222067e-09, 9.140389e-09, 1.128438e-08, 1.365403e-08, 1.624933e-08, 1.907027e-08, 2.211685e-08, 2.538906e-08, 2.888688e-08, 3.261031e-08, 3.655934e-08, 4.073395e-08, 4.513413e-08, ]))
__TRIALS__.append((4.522220e-02, [0.000000e+00, 1.128466e-10, 4.513859e-10, 1.015617e-09, 1.805538e-09, 2.821147e-09, 4.062441e-09, 5.529415e-09, 7.222067e-09, 9.140389e-09, 1.128438e-08, 1.365403e-08, 1.624933e-08, 1.907027e-08, 2.211685e-08, 2.538906e-08, 2.888688e-08, 3.261031e-08, 3.655934e-08, 4.073395e-08, 4.513413e-08, ]))
__TRIALS__.append((4.478713e-02, [0.000000e+00, 1.128466e-10, 4.513859e-10, 1.015617e-09, 1.805538e-09, 2.821147e-09, 4.062441e-09, 5.529415e-09, 7.222067e-09, 9.140389e-09, 1.128438e-08, 1.365403e-08, 1.624933e-08, 1.907027e-08, 2.211685e-08, 2.538906e-08, 2.888688e-08, 3.261031e-08, 3.655934e-08, 4.073395e-08, 4.513413e-08, ]))
__TRIALS__.append((4.526285e-02, [0.000000e+00, 1.128466e-10, 4.513859e-10, 1.015617e-09, 1.805538e-09, 2.821147e-09, 4.062441e-09, 5.529415e-09, 7.222067e-09, 9.140389e-09, 1.128438e-08, 1.365403e-08, 1.624933e-08, 1.907027e-08, 2.211685e-08, 2.538906e-08, 2.888688e-08, 3.261031e-08, 3.655934e-08, 4.073395e-08, 4.513413e-08, ]))


PS:

Read file <main.836944.err> for stderr output of this job.

