# Running __TRIALS__ with FILTERED_SAMPLING/DELTA_STOPPING and epsilon=8.000000e-06, comm_size=16, seed=42
__TRIALS__ = [
#   (trial_time, trial_iters, trial_points, trial_error),
    (2.149645e+02, 3360000000, 879656740, 1.493033e-07),  # __TRIALS__
    (2.149263e+02, 3360000000, 879670538, 1.640810e-05),  # __TRIALS__
    (2.149291e+02, 3360000000, 879623859, 1.375324e-05),  # __TRIALS__
    (2.149242e+02, 3360000000, 879704306, 3.557701e-05),  # __TRIALS__
