# Running __TRIALS__ with FILTERED_SAMPLING/ERROR_STOPPING and epsilon=8.000000e-06, comm_size=64, seed=42
__TRIALS__ = [
#   (trial_time, trial_iters, trial_points, trial_error),
    (3.146933e+00, 155426880, 40690823, 7.648485e-06),  # __TRIALS__
    (2.154698e-02, 1048320, 274334, 3.632670e-06),  # __TRIALS__
    (1.253909e-01, 6182400, 1617967, 1.771025e-06),  # __TRIALS__
    (2.936402e-02, 1444800, 378125, 5.108101e-06),  # __TRIALS__
    (4.377807e-02, 2150400, 563060, 1.188716e-06),  # __TRIALS__
    (2.909725e-02, 1431360, 375270, 3.240223e-06),  # __TRIALS__
    (1.960843e-01, 9670080, 2531306, 3.865158e-06),  # __TRIALS__
    (2.333053e-02, 1142400, 299520, 1.094445e-06),  # __TRIALS__
    (2.541420e-03, 120960, 31683, 5.118046e-06),  # __TRIALS__
    (6.575306e-02, 3232320, 846820, 5.889376e-06),  # __TRIALS__
]  # __TRIALS__
# Done.
