Sender: LSF System <lsfadmin@polus-c2-ib.bmc.hpc.cs.msu.ru>
Subject: Job 798527: <# this file was automaticly created by mpisubmit.pl script for edu-cmc-skmodel21-622-16 #;source /polusfs/setenv/setup.SMPI;#BSUB -n 4;#BSUB -W 00:15;#BSUB -o main_adjusted_delta.%J.out;#BSUB -e main_adjusted_delta.%J.err;OMP_NUM_THREADS=1 mpiexec main_adjusted_delta 3.0e-5 42> in cluster <MSUCluster> Done

Job <# this file was automaticly created by mpisubmit.pl script for edu-cmc-skmodel21-622-16 #;source /polusfs/setenv/setup.SMPI;#BSUB -n 4;#BSUB -W 00:15;#BSUB -o main_adjusted_delta.%J.out;#BSUB -e main_adjusted_delta.%J.err;OMP_NUM_THREADS=1 mpiexec main_adjusted_delta 3.0e-5 42> was submitted from host <polus-ib.bmc.hpc.cs.msu.ru> by user <edu-cmc-skmodel21-622-16> in cluster <MSUCluster> at Sun Nov  7 10:44:42 2021
Job was executed on host(s) <4*polus-c2-ib.bmc.hpc.cs.msu.ru>, in queue <short>, as user <edu-cmc-skmodel21-622-16> in cluster <MSUCluster> at Sun Nov  7 10:44:43 2021
</home_edu/edu-cmc-skmodel21-622/edu-cmc-skmodel21-622-16> was used as the home directory.
</home_edu/edu-cmc-skmodel21-622/edu-cmc-skmodel21-622-16/solution> was used as the working directory.
Started at Sun Nov  7 10:44:43 2021
Terminated at Sun Nov  7 10:46:57 2021
Results reported at Sun Nov  7 10:46:57 2021

Your job looked like:

------------------------------------------------------------
# LSBATCH: User input
# this file was automaticly created by mpisubmit.pl script for edu-cmc-skmodel21-622-16 #
source /polusfs/setenv/setup.SMPI
#BSUB -n 4
#BSUB -W 00:15
#BSUB -o main_adjusted_delta.%J.out
#BSUB -e main_adjusted_delta.%J.err
OMP_NUM_THREADS=1 mpiexec main_adjusted_delta 3.0e-5 42

------------------------------------------------------------

Successfully completed.

Resource usage summary:

    CPU time :                                   532.06 sec.
    Max Memory :                                 226 MB
    Average Memory :                             214.75 MB
    Total Requested Memory :                     -
    Delta Memory :                               -
    Max Swap :                                   -
    Max Processes :                              8
    Max Threads :                                21
    Run time :                                   138 sec.
    Turnaround time :                            135 sec.

The output (if any) follows:

# Running __TRIALS__ with ADJUSTED_SAMPLING/DELTA_STOPPING and epsilon=3.000000e-05, comm_size=4, seed=42
__TRIALS__ = [
#   (trial_time, trial_iters, trial_points, trial_error),
    (1.306951e+01, 234575040, 234575040, 5.406046e-07),  # __TRIALS__
    (1.327942e+01, 234575040, 234575040, 1.898157e-05),  # __TRIALS__
    (1.331351e+01, 234575040, 234575040, 7.016918e-06),  # __TRIALS__
    (1.346387e+01, 234575040, 234575040, 1.897926e-05),  # __TRIALS__
    (1.337526e+01, 234575040, 234575040, 2.959050e-05),  # __TRIALS__
    (1.349040e+01, 234575040, 234575040, 4.550198e-07),  # __TRIALS__
    (1.334054e+01, 234575040, 234575040, 1.495107e-05),  # __TRIALS__
    (1.336714e+01, 234575040, 234575040, 2.397216e-05),  # __TRIALS__
    (1.319753e+01, 234575040, 234575040, 6.303085e-06),  # __TRIALS__
    (1.296930e+01, 234575040, 234575040, 1.124080e-05),  # __TRIALS__
]  # __TRIALS__
# Done.


PS:

Read file <main_adjusted_delta.798527.err> for stderr output of this job.

