# Running __TRIALS__ with FILTERED_SAMPLING/DELTA_STOPPING and epsilon=1.000000e-04, comm_size=64, seed=42
__TRIALS__ = [
#   (trial_time, trial_iters, trial_points, trial_error),
    (5.369158e+00, 268800000, 70374968, 1.864715e-05),  # __TRIALS__
    (5.362189e+00, 268800000, 70362680, 5.816788e-05),  # __TRIALS__
    (5.362475e+00, 268800000, 70363539, 6.552755e-05),  # __TRIALS__
    (5.361383e+00, 268800000, 70371916, 7.004109e-05),  # __TRIALS__
    (5.359845e+00, 268800000, 70374690, 5.869097e-05),  # __TRIALS__
    (5.359054e+00, 268800000, 70381818, 8.728231e-05),  # __TRIALS__
    (5.361116e+00, 268800000, 70362258, 1.143488e-04),  # __TRIALS__
    (5.360247e+00, 268800000, 70376790, 3.982003e-05),  # __TRIALS__
    (5.360271e+00, 268800000, 70367356, 6.025374e-05),  # __TRIALS__
    (5.359685e+00, 268800000, 70370050, 4.050333e-05),  # __TRIALS__
]  # __TRIALS__
# Done.
