# Running __TRIALS__ with ADJUSTED_SAMPLING/DELTA_STOPPING and epsilon=1.000000e-04, comm_size=4, seed=42
__TRIALS__ = [
#   (trial_time, trial_iters, trial_points, trial_error),
    (3.831579e+01, 70371840, 70371840, 3.476176e-06),  # __TRIALS__
    (3.831545e+01, 70371840, 70371840, 2.186574e-05),  # __TRIALS__
    (3.831807e+01, 70371840, 70371840, 1.584375e-05),  # __TRIALS__
    (3.831581e+01, 70371840, 70371840, 1.649525e-05),  # __TRIALS__
    (3.831554e+01, 70371840, 70371840, 4.468906e-05),  # __TRIALS__
    (3.831497e+01, 70371840, 70371840, 1.906383e-05),  # __TRIALS__
    (3.831568e+01, 70371840, 70371840, 3.316541e-05),  # __TRIALS__
    (3.831542e+01, 70371840, 70371840, 1.419755e-05),  # __TRIALS__
    (3.831635e+01, 70371840, 70371840, 2.852245e-06),  # __TRIALS__
    (3.831600e+01, 70371840, 70371840, 1.567046e-05),  # __TRIALS__
]  # __TRIALS__
# Done.
