Sender: LSF System <lsfadmin@polus-c4-ib.bmc.hpc.cs.msu.ru>
Subject: Job 798536: <# this file was automaticly created by mpisubmit.pl script for edu-cmc-skmodel21-622-16 #;source /polusfs/setenv/setup.SMPI;#BSUB -n 16;#BSUB -W 00:15;#BSUB -o main_adjusted_delta.%J.out;#BSUB -e main_adjusted_delta.%J.err;OMP_NUM_THREADS=1 mpiexec main_adjusted_delta 3.0e-5 42> in cluster <MSUCluster> Done

Job <# this file was automaticly created by mpisubmit.pl script for edu-cmc-skmodel21-622-16 #;source /polusfs/setenv/setup.SMPI;#BSUB -n 16;#BSUB -W 00:15;#BSUB -o main_adjusted_delta.%J.out;#BSUB -e main_adjusted_delta.%J.err;OMP_NUM_THREADS=1 mpiexec main_adjusted_delta 3.0e-5 42> was submitted from host <polus-ib.bmc.hpc.cs.msu.ru> by user <edu-cmc-skmodel21-622-16> in cluster <MSUCluster> at Sun Nov  7 10:46:53 2021
Job was executed on host(s) <8*polus-c4-ib.bmc.hpc.cs.msu.ru>, in queue <short>, as user <edu-cmc-skmodel21-622-16> in cluster <MSUCluster> at Sun Nov  7 10:46:57 2021
                            <8*polus-c2-ib.bmc.hpc.cs.msu.ru>
</home_edu/edu-cmc-skmodel21-622/edu-cmc-skmodel21-622-16> was used as the home directory.
</home_edu/edu-cmc-skmodel21-622/edu-cmc-skmodel21-622-16/solution> was used as the working directory.
Started at Sun Nov  7 10:46:57 2021
Terminated at Sun Nov  7 10:47:40 2021
Results reported at Sun Nov  7 10:47:40 2021

Your job looked like:

------------------------------------------------------------
# LSBATCH: User input
# this file was automaticly created by mpisubmit.pl script for edu-cmc-skmodel21-622-16 #
source /polusfs/setenv/setup.SMPI
#BSUB -n 16
#BSUB -W 00:15
#BSUB -o main_adjusted_delta.%J.out
#BSUB -e main_adjusted_delta.%J.err
OMP_NUM_THREADS=1 mpiexec main_adjusted_delta 3.0e-5 42

------------------------------------------------------------

Successfully completed.

Resource usage summary:

    CPU time :                                   653.60 sec.
    Max Memory :                                 438 MB
    Average Memory :                             383.38 MB
    Total Requested Memory :                     -
    Delta Memory :                               -
    Max Swap :                                   -
    Max Processes :                              12
    Max Threads :                                33
    Run time :                                   47 sec.
    Turnaround time :                            47 sec.

The output (if any) follows:

# Running __TRIALS__ with ADJUSTED_SAMPLING/DELTA_STOPPING and epsilon=3.000000e-05, comm_size=16, seed=42
__TRIALS__ = [
#   (trial_time, trial_iters, trial_points, trial_error),
    (4.269591e+00, 234575040, 234575040, 2.730332e-06),  # __TRIALS__
    (3.750511e+00, 234575040, 234575040, 1.584907e-05),  # __TRIALS__
    (3.883482e+00, 234575040, 234575040, 2.569648e-05),  # __TRIALS__
    (3.961802e+00, 234575040, 234575040, 1.461900e-06),  # __TRIALS__
    (4.136233e+00, 234575040, 234575040, 2.088791e-05),  # __TRIALS__
    (4.093839e+00, 234575040, 234575040, 1.881852e-05),  # __TRIALS__
    (4.253848e+00, 234575040, 234575040, 1.231604e-05),  # __TRIALS__
    (4.445781e+00, 234575040, 234575040, 8.088301e-06),  # __TRIALS__
    (4.083925e+00, 234575040, 234575040, 1.071197e-05),  # __TRIALS__
    (3.881033e+00, 234575040, 234575040, 2.302030e-05),  # __TRIALS__
]  # __TRIALS__
# Done.


PS:

Read file <main_adjusted_delta.798536.err> for stderr output of this job.

