# Running __TRIALS__ with FILTERED_SAMPLING/DELTA_STOPPING and epsilon=2.000000e-05, comm_size=32, seed=42
__TRIALS__ = [
#   (trial_time, trial_iters, trial_points, trial_error),
    (4.753630e+01, 1344000000, 351858902, 1.708686e-05),  # __TRIALS__
    (4.753841e+01, 1344000000, 351888412, 3.266511e-05),  # __TRIALS__
    (4.753857e+01, 1344000000, 351838608, 2.911690e-05),  # __TRIALS__
    (4.753812e+01, 1344000000, 351856335, 2.243765e-05),  # __TRIALS__
    (4.753857e+01, 1344000000, 351841898, 1.202284e-06),  # __TRIALS__
    (4.754040e+01, 1344000000, 351861019, 8.809655e-07),  # __TRIALS__
    (4.753954e+01, 1344000000, 351833552, 3.807750e-05),  # __TRIALS__
    (4.753815e+01, 1344000000, 351867033, 2.265255e-05),  # __TRIALS__
    (4.753895e+01, 1344000000, 351846540, 3.384018e-05),  # __TRIALS__
    (4.753937e+01, 1344000000, 351864824, 7.771154e-06),  # __TRIALS__
]  # __TRIALS__
# Done.
