__PARAMS__ = {'P': 64, 'O': 0, 'L': 1.000000e+00, 'T': 1.000000e-02, 'N': 128, 'K': 20}
=======================
=======================
__.world.size = 64;
__.world.size = 64;
__.world.rank = 32;
__.world.rank = 0;


__.nodes.shape = {.x=128, .y=128, .z=128, .t=20};
__.nodes.shape = {.x=128, .y=128, .z=128, .t=20};
__.nodes.bound = {.x=1.000000, .y=1.000000, .z=1.000000, .t=0.010000};
__.nodes.bound = {.x=1.000000, .y=1.000000, .z=1.000000, .t=0.010000};
__.nodes.steps = {.x=0.007812, .y=0.007812, .z=0.007812, .t=0.000500};
__.nodes.steps = {.x=0.007812, .y=0.007812, .z=0.007812, .t=0.000500};


__.param.period = {.x=1, .y=0, .z=0};
__.param.period = {.x=1, .y=0, .z=0};
__.param.a = {.x=6.283185, .y=3.141593, .z=3.141593, .t=7.695299};
__.param.b = {.x=0.000000, .y=0.000000, .z=0.000000, .t=7.853982};

__.local.rank = 0;
__.param.a = {.x=6.283185, .y=3.141593, .z=3.141593, .t=7.695299};
__.local.shape = {.x=4, .y=4, .z=4};
__.param.b = {.x=0.000000, .y=0.000000, .z=0.000000, .t=7.853982};
__.local.coord = {.x=0, .y=0, .z=0};


__.local.rank = 32;
__.block.shape = {.x=34, .y=34, .z=34};
__.local.shape = {.x=4, .y=4, .z=4};
__.block.coord = {.x=0, .y=0, .z=0};
__.local.coord = {.x=2, .y=0, .z=0};
__.block.elems = 39304;


__.block.shape = {.x=34, .y=34, .z=34};
=======================
__.block.coord = {.x=64, .y=0, .z=0};
__.world.size = 64;
__.block.elems = 39304;
__.world.rank = 1;


=======================
__.nodes.shape = {.x=128, .y=128, .z=128, .t=20};
__.world.size = 64;
__.nodes.bound = {.x=1.000000, .y=1.000000, .z=1.000000, .t=0.010000};
__.world.rank = 33;
__.nodes.steps = {.x=0.007812, .y=0.007812, .z=0.007812, .t=0.000500};


__.nodes.shape = {.x=128, .y=128, .z=128, .t=20};
__.param.period = {.x=1, .y=0, .z=0};
__.nodes.bound = {.x=1.000000, .y=1.000000, .z=1.000000, .t=0.010000};
__.param.a = {.x=6.283185, .y=3.141593, .z=3.141593, .t=7.695299};
__.nodes.steps = {.x=0.007812, .y=0.007812, .z=0.007812, .t=0.000500};
__.param.b = {.x=0.000000, .y=0.000000, .z=0.000000, .t=7.853982};


__.param.period = {.x=1, .y=0, .z=0};
__.local.rank = 1;
__.param.a = {.x=6.283185, .y=3.141593, .z=3.141593, .t=7.695299};
__.local.shape = {.x=4, .y=4, .z=4};
__.param.b = {.x=0.000000, .y=0.000000, .z=0.000000, .t=7.853982};
__.local.coord = {.x=0, .y=0, .z=1};


__.local.rank = 33;
__.block.shape = {.x=34, .y=34, .z=34};
__.local.shape = {.x=4, .y=4, .z=4};
__.block.coord = {.x=0, .y=0, .z=32};
__.local.coord = {.x=2, .y=0, .z=1};
__.block.elems = 39304;


__.block.shape = {.x=34, .y=34, .z=34};
=======================
__.block.coord = {.x=64, .y=0, .z=32};
__.world.size = 64;
__.block.elems = 39304;
__.world.rank = 2;


=======================
__.nodes.shape = {.x=128, .y=128, .z=128, .t=20};
__.world.size = 64;
__.nodes.bound = {.x=1.000000, .y=1.000000, .z=1.000000, .t=0.010000};
__.world.rank = 34;
__.nodes.steps = {.x=0.007812, .y=0.007812, .z=0.007812, .t=0.000500};


__.nodes.shape = {.x=128, .y=128, .z=128, .t=20};
__.param.period = {.x=1, .y=0, .z=0};
__.nodes.bound = {.x=1.000000, .y=1.000000, .z=1.000000, .t=0.010000};
__.param.a = {.x=6.283185, .y=3.141593, .z=3.141593, .t=7.695299};
__.nodes.steps = {.x=0.007812, .y=0.007812, .z=0.007812, .t=0.000500};
__.param.b = {.x=0.000000, .y=0.000000, .z=0.000000, .t=7.853982};


__.param.period = {.x=1, .y=0, .z=0};
__.local.rank = 2;
__.param.a = {.x=6.283185, .y=3.141593, .z=3.141593, .t=7.695299};
__.local.shape = {.x=4, .y=4, .z=4};
__.param.b = {.x=0.000000, .y=0.000000, .z=0.000000, .t=7.853982};
__.local.coord = {.x=0, .y=0, .z=2};


__.local.rank = 34;
__.block.shape = {.x=34, .y=34, .z=34};
__.local.shape = {.x=4, .y=4, .z=4};
__.block.coord = {.x=0, .y=0, .z=64};
__.local.coord = {.x=2, .y=0, .z=2};
__.block.elems = 39304;


__.block.shape = {.x=34, .y=34, .z=34};
=======================
__.block.coord = {.x=64, .y=0, .z=64};
__.world.size = 64;
__.block.elems = 39304;
__.world.rank = 3;


=======================
__.nodes.shape = {.x=128, .y=128, .z=128, .t=20};
__.world.size = 64;
__.nodes.bound = {.x=1.000000, .y=1.000000, .z=1.000000, .t=0.010000};
__.world.rank = 35;
__.nodes.steps = {.x=0.007812, .y=0.007812, .z=0.007812, .t=0.000500};


__.nodes.shape = {.x=128, .y=128, .z=128, .t=20};
__.param.period = {.x=1, .y=0, .z=0};
__.nodes.bound = {.x=1.000000, .y=1.000000, .z=1.000000, .t=0.010000};
__.param.a = {.x=6.283185, .y=3.141593, .z=3.141593, .t=7.695299};
__.nodes.steps = {.x=0.007812, .y=0.007812, .z=0.007812, .t=0.000500};
__.param.b = {.x=0.000000, .y=0.000000, .z=0.000000, .t=7.853982};


__.param.period = {.x=1, .y=0, .z=0};
__.local.rank = 3;
__.param.a = {.x=6.283185, .y=3.141593, .z=3.141593, .t=7.695299};
__.local.shape = {.x=4, .y=4, .z=4};
__.local.coord = {.x=0, .y=0, .z=3};

__.block.shape = {.x=34, .y=34, .z=34};
__.param.b = {.x=0.000000, .y=0.000000, .z=0.000000, .t=7.853982};
__.block.coord = {.x=0, .y=0, .z=96};

__.block.elems = 39304;
__.local.rank = 35;

__.local.shape = {.x=4, .y=4, .z=4};
=======================
__.local.coord = {.x=2, .y=0, .z=3};
__.world.size = 64;

__.world.rank = 4;
__.block.shape = {.x=34, .y=34, .z=34};

__.block.coord = {.x=64, .y=0, .z=96};
__.nodes.shape = {.x=128, .y=128, .z=128, .t=20};
__.block.elems = 39304;
__.nodes.bound = {.x=1.000000, .y=1.000000, .z=1.000000, .t=0.010000};

__.nodes.steps = {.x=0.007812, .y=0.007812, .z=0.007812, .t=0.000500};
=======================

__.world.size = 64;
__.param.period = {.x=1, .y=0, .z=0};
__.world.rank = 36;
__.param.a = {.x=6.283185, .y=3.141593, .z=3.141593, .t=7.695299};

__.param.b = {.x=0.000000, .y=0.000000, .z=0.000000, .t=7.853982};
__.nodes.shape = {.x=128, .y=128, .z=128, .t=20};

__.nodes.bound = {.x=1.000000, .y=1.000000, .z=1.000000, .t=0.010000};
__.local.rank = 4;
__.nodes.steps = {.x=0.007812, .y=0.007812, .z=0.007812, .t=0.000500};
__.local.shape = {.x=4, .y=4, .z=4};

__.local.coord = {.x=0, .y=1, .z=0};
__.param.period = {.x=1, .y=0, .z=0};

__.param.a = {.x=6.283185, .y=3.141593, .z=3.141593, .t=7.695299};
__.block.shape = {.x=34, .y=34, .z=34};
__.param.b = {.x=0.000000, .y=0.000000, .z=0.000000, .t=7.853982};
__.block.coord = {.x=0, .y=32, .z=0};

__.block.elems = 39304;
__.local.rank = 36;

__.local.shape = {.x=4, .y=4, .z=4};
=======================
__.local.coord = {.x=2, .y=1, .z=0};
__.world.size = 64;

__.world.rank = 5;
__.block.shape = {.x=34, .y=34, .z=34};

__.block.coord = {.x=64, .y=32, .z=0};
__.nodes.shape = {.x=128, .y=128, .z=128, .t=20};
__.block.elems = 39304;
__.nodes.bound = {.x=1.000000, .y=1.000000, .z=1.000000, .t=0.010000};

__.nodes.steps = {.x=0.007812, .y=0.007812, .z=0.007812, .t=0.000500};
=======================

__.world.size = 64;
__.param.period = {.x=1, .y=0, .z=0};
__.world.rank = 37;
__.param.a = {.x=6.283185, .y=3.141593, .z=3.141593, .t=7.695299};

__.param.b = {.x=0.000000, .y=0.000000, .z=0.000000, .t=7.853982};
__.nodes.shape = {.x=128, .y=128, .z=128, .t=20};

__.nodes.bound = {.x=1.000000, .y=1.000000, .z=1.000000, .t=0.010000};
__.local.rank = 5;
__.nodes.steps = {.x=0.007812, .y=0.007812, .z=0.007812, .t=0.000500};
__.local.shape = {.x=4, .y=4, .z=4};

__.local.coord = {.x=0, .y=1, .z=1};
__.param.period = {.x=1, .y=0, .z=0};

__.param.a = {.x=6.283185, .y=3.141593, .z=3.141593, .t=7.695299};
__.block.shape = {.x=34, .y=34, .z=34};
__.param.b = {.x=0.000000, .y=0.000000, .z=0.000000, .t=7.853982};
__.block.coord = {.x=0, .y=32, .z=32};

__.block.elems = 39304;
__.local.rank = 37;

__.local.shape = {.x=4, .y=4, .z=4};
=======================
__.local.coord = {.x=2, .y=1, .z=1};
__.world.size = 64;

__.world.rank = 6;
__.block.shape = {.x=34, .y=34, .z=34};

__.block.coord = {.x=64, .y=32, .z=32};
__.nodes.shape = {.x=128, .y=128, .z=128, .t=20};
__.block.elems = 39304;
__.nodes.bound = {.x=1.000000, .y=1.000000, .z=1.000000, .t=0.010000};

__.nodes.steps = {.x=0.007812, .y=0.007812, .z=0.007812, .t=0.000500};
=======================

__.world.size = 64;
__.param.period = {.x=1, .y=0, .z=0};
__.world.rank = 38;
__.param.a = {.x=6.283185, .y=3.141593, .z=3.141593, .t=7.695299};
__.param.b = {.x=0.000000, .y=0.000000, .z=0.000000, .t=7.853982};

__.local.rank = 6;
__.local.shape = {.x=4, .y=4, .z=4};

__.local.coord = {.x=0, .y=1, .z=2};
__.nodes.shape = {.x=128, .y=128, .z=128, .t=20};

__.nodes.bound = {.x=1.000000, .y=1.000000, .z=1.000000, .t=0.010000};
__.block.shape = {.x=34, .y=34, .z=34};
__.nodes.steps = {.x=0.007812, .y=0.007812, .z=0.007812, .t=0.000500};
__.block.coord = {.x=0, .y=32, .z=64};

__.block.elems = 39304;
__.param.period = {.x=1, .y=0, .z=0};

__.param.a = {.x=6.283185, .y=3.141593, .z=3.141593, .t=7.695299};
=======================
__.param.b = {.x=0.000000, .y=0.000000, .z=0.000000, .t=7.853982};
__.world.size = 64;

__.world.rank = 7;
__.local.rank = 38;

__.local.shape = {.x=4, .y=4, .z=4};
__.nodes.shape = {.x=128, .y=128, .z=128, .t=20};
__.local.coord = {.x=2, .y=1, .z=2};
__.nodes.bound = {.x=1.000000, .y=1.000000, .z=1.000000, .t=0.010000};

__.nodes.steps = {.x=0.007812, .y=0.007812, .z=0.007812, .t=0.000500};
__.block.shape = {.x=34, .y=34, .z=34};

__.block.coord = {.x=64, .y=32, .z=64};
__.param.period = {.x=1, .y=0, .z=0};
__.block.elems = 39304;
__.param.a = {.x=6.283185, .y=3.141593, .z=3.141593, .t=7.695299};

__.param.b = {.x=0.000000, .y=0.000000, .z=0.000000, .t=7.853982};
=======================

__.world.size = 64;
__.local.rank = 7;
__.world.rank = 39;
__.local.shape = {.x=4, .y=4, .z=4};

__.local.coord = {.x=0, .y=1, .z=3};
__.nodes.shape = {.x=128, .y=128, .z=128, .t=20};

__.nodes.bound = {.x=1.000000, .y=1.000000, .z=1.000000, .t=0.010000};
__.block.shape = {.x=34, .y=34, .z=34};
__.nodes.steps = {.x=0.007812, .y=0.007812, .z=0.007812, .t=0.000500};
__.block.coord = {.x=0, .y=32, .z=96};

__.block.elems = 39304;
__.param.period = {.x=1, .y=0, .z=0};

__.param.a = {.x=6.283185, .y=3.141593, .z=3.141593, .t=7.695299};
=======================
__.param.b = {.x=0.000000, .y=0.000000, .z=0.000000, .t=7.853982};
__.world.size = 64;

__.world.rank = 8;
__.local.rank = 39;

__.local.shape = {.x=4, .y=4, .z=4};
__.nodes.shape = {.x=128, .y=128, .z=128, .t=20};
__.local.coord = {.x=2, .y=1, .z=3};
__.nodes.bound = {.x=1.000000, .y=1.000000, .z=1.000000, .t=0.010000};

__.nodes.steps = {.x=0.007812, .y=0.007812, .z=0.007812, .t=0.000500};
__.block.shape = {.x=34, .y=34, .z=34};

__.block.coord = {.x=64, .y=32, .z=96};
__.param.period = {.x=1, .y=0, .z=0};
__.block.elems = 39304;
__.param.a = {.x=6.283185, .y=3.141593, .z=3.141593, .t=7.695299};

__.param.b = {.x=0.000000, .y=0.000000, .z=0.000000, .t=7.853982};
=======================

__.world.size = 64;
__.local.rank = 8;
__.world.rank = 40;
__.local.shape = {.x=4, .y=4, .z=4};

__.local.coord = {.x=0, .y=2, .z=0};
__.nodes.shape = {.x=128, .y=128, .z=128, .t=20};

__.nodes.bound = {.x=1.000000, .y=1.000000, .z=1.000000, .t=0.010000};
__.block.shape = {.x=34, .y=34, .z=34};
__.nodes.steps = {.x=0.007812, .y=0.007812, .z=0.007812, .t=0.000500};
__.block.coord = {.x=0, .y=64, .z=0};

__.block.elems = 39304;
__.param.period = {.x=1, .y=0, .z=0};

__.param.a = {.x=6.283185, .y=3.141593, .z=3.141593, .t=7.695299};
=======================
__.world.size = 64;
__.world.rank = 9;

__.param.b = {.x=0.000000, .y=0.000000, .z=0.000000, .t=7.853982};
__.nodes.shape = {.x=128, .y=128, .z=128, .t=20};

__.nodes.bound = {.x=1.000000, .y=1.000000, .z=1.000000, .t=0.010000};
__.local.rank = 40;
__.nodes.steps = {.x=0.007812, .y=0.007812, .z=0.007812, .t=0.000500};
__.local.shape = {.x=4, .y=4, .z=4};

__.local.coord = {.x=2, .y=2, .z=0};
__.param.period = {.x=1, .y=0, .z=0};

__.param.a = {.x=6.283185, .y=3.141593, .z=3.141593, .t=7.695299};
__.block.shape = {.x=34, .y=34, .z=34};
__.param.b = {.x=0.000000, .y=0.000000, .z=0.000000, .t=7.853982};
__.block.coord = {.x=64, .y=64, .z=0};

__.block.elems = 39304;
__.local.rank = 9;

__.local.shape = {.x=4, .y=4, .z=4};
=======================
__.local.coord = {.x=0, .y=2, .z=1};
__.world.size = 64;

__.world.rank = 41;
__.block.shape = {.x=34, .y=34, .z=34};

__.block.coord = {.x=0, .y=64, .z=32};
__.nodes.shape = {.x=128, .y=128, .z=128, .t=20};
__.block.elems = 39304;
__.nodes.bound = {.x=1.000000, .y=1.000000, .z=1.000000, .t=0.010000};

__.nodes.steps = {.x=0.007812, .y=0.007812, .z=0.007812, .t=0.000500};
=======================

__.world.size = 64;
__.param.period = {.x=1, .y=0, .z=0};
__.world.rank = 10;
__.param.a = {.x=6.283185, .y=3.141593, .z=3.141593, .t=7.695299};

__.param.b = {.x=0.000000, .y=0.000000, .z=0.000000, .t=7.853982};
__.nodes.shape = {.x=128, .y=128, .z=128, .t=20};

__.nodes.bound = {.x=1.000000, .y=1.000000, .z=1.000000, .t=0.010000};
__.local.rank = 41;
__.nodes.steps = {.x=0.007812, .y=0.007812, .z=0.007812, .t=0.000500};
__.local.shape = {.x=4, .y=4, .z=4};

__.local.coord = {.x=2, .y=2, .z=1};
__.param.period = {.x=1, .y=0, .z=0};

__.param.a = {.x=6.283185, .y=3.141593, .z=3.141593, .t=7.695299};
__.block.shape = {.x=34, .y=34, .z=34};
__.param.b = {.x=0.000000, .y=0.000000, .z=0.000000, .t=7.853982};
__.block.coord = {.x=64, .y=64, .z=32};

__.block.elems = 39304;
__.local.rank = 10;

__.local.shape = {.x=4, .y=4, .z=4};
=======================
__.local.coord = {.x=0, .y=2, .z=2};
__.world.size = 64;

__.world.rank = 42;
__.block.shape = {.x=34, .y=34, .z=34};

__.block.coord = {.x=0, .y=64, .z=64};
__.nodes.shape = {.x=128, .y=128, .z=128, .t=20};
__.block.elems = 39304;
__.nodes.bound = {.x=1.000000, .y=1.000000, .z=1.000000, .t=0.010000};

__.nodes.steps = {.x=0.007812, .y=0.007812, .z=0.007812, .t=0.000500};
=======================

__.world.size = 64;
__.param.period = {.x=1, .y=0, .z=0};
__.world.rank = 11;
__.param.a = {.x=6.283185, .y=3.141593, .z=3.141593, .t=7.695299};

__.param.b = {.x=0.000000, .y=0.000000, .z=0.000000, .t=7.853982};
__.nodes.shape = {.x=128, .y=128, .z=128, .t=20};

__.nodes.bound = {.x=1.000000, .y=1.000000, .z=1.000000, .t=0.010000};
__.local.rank = 42;
__.nodes.steps = {.x=0.007812, .y=0.007812, .z=0.007812, .t=0.000500};
__.local.shape = {.x=4, .y=4, .z=4};

__.local.coord = {.x=2, .y=2, .z=2};
__.param.period = {.x=1, .y=0, .z=0};

__.param.a = {.x=6.283185, .y=3.141593, .z=3.141593, .t=7.695299};
__.block.shape = {.x=34, .y=34, .z=34};
__.param.b = {.x=0.000000, .y=0.000000, .z=0.000000, .t=7.853982};
__.block.coord = {.x=64, .y=64, .z=64};

__.block.elems = 39304;
__.local.rank = 11;

__.local.shape = {.x=4, .y=4, .z=4};
=======================
__.local.coord = {.x=0, .y=2, .z=3};
__.world.size = 64;

__.world.rank = 43;
__.block.shape = {.x=34, .y=34, .z=34};

__.block.coord = {.x=0, .y=64, .z=96};
__.nodes.shape = {.x=128, .y=128, .z=128, .t=20};
__.block.elems = 39304;
__.nodes.bound = {.x=1.000000, .y=1.000000, .z=1.000000, .t=0.010000};

__.nodes.steps = {.x=0.007812, .y=0.007812, .z=0.007812, .t=0.000500};
=======================

__.world.size = 64;
__.param.period = {.x=1, .y=0, .z=0};
__.world.rank = 12;
__.param.a = {.x=6.283185, .y=3.141593, .z=3.141593, .t=7.695299};

__.param.b = {.x=0.000000, .y=0.000000, .z=0.000000, .t=7.853982};
__.nodes.shape = {.x=128, .y=128, .z=128, .t=20};

__.nodes.bound = {.x=1.000000, .y=1.000000, .z=1.000000, .t=0.010000};
__.local.rank = 43;
__.nodes.steps = {.x=0.007812, .y=0.007812, .z=0.007812, .t=0.000500};
__.local.shape = {.x=4, .y=4, .z=4};

__.local.coord = {.x=2, .y=2, .z=3};
__.param.period = {.x=1, .y=0, .z=0};

__.param.a = {.x=6.283185, .y=3.141593, .z=3.141593, .t=7.695299};
__.block.shape = {.x=34, .y=34, .z=34};
__.param.b = {.x=0.000000, .y=0.000000, .z=0.000000, .t=7.853982};
__.block.coord = {.x=64, .y=64, .z=96};

__.block.elems = 39304;
__.local.rank = 12;

__.local.shape = {.x=4, .y=4, .z=4};
=======================
__.local.coord = {.x=0, .y=3, .z=0};
__.world.size = 64;

__.world.rank = 44;
__.block.shape = {.x=34, .y=34, .z=34};

__.block.coord = {.x=0, .y=96, .z=0};
__.nodes.shape = {.x=128, .y=128, .z=128, .t=20};
__.block.elems = 39304;
__.nodes.bound = {.x=1.000000, .y=1.000000, .z=1.000000, .t=0.010000};

__.nodes.steps = {.x=0.007812, .y=0.007812, .z=0.007812, .t=0.000500};
=======================

__.world.size = 64;
__.param.period = {.x=1, .y=0, .z=0};
__.world.rank = 13;
__.param.a = {.x=6.283185, .y=3.141593, .z=3.141593, .t=7.695299};

__.param.b = {.x=0.000000, .y=0.000000, .z=0.000000, .t=7.853982};
__.nodes.shape = {.x=128, .y=128, .z=128, .t=20};

__.nodes.bound = {.x=1.000000, .y=1.000000, .z=1.000000, .t=0.010000};
__.local.rank = 44;
__.nodes.steps = {.x=0.007812, .y=0.007812, .z=0.007812, .t=0.000500};
__.local.shape = {.x=4, .y=4, .z=4};

__.local.coord = {.x=2, .y=3, .z=0};
__.param.period = {.x=1, .y=0, .z=0};

__.param.a = {.x=6.283185, .y=3.141593, .z=3.141593, .t=7.695299};
__.block.shape = {.x=34, .y=34, .z=34};
__.param.b = {.x=0.000000, .y=0.000000, .z=0.000000, .t=7.853982};
__.block.coord = {.x=64, .y=96, .z=0};

__.block.elems = 39304;
__.local.rank = 13;

__.local.shape = {.x=4, .y=4, .z=4};
=======================
__.local.coord = {.x=0, .y=3, .z=1};
__.world.size = 64;

__.world.rank = 45;
__.block.shape = {.x=34, .y=34, .z=34};

__.block.coord = {.x=0, .y=96, .z=32};
__.nodes.shape = {.x=128, .y=128, .z=128, .t=20};
__.block.elems = 39304;
__.nodes.bound = {.x=1.000000, .y=1.000000, .z=1.000000, .t=0.010000};

__.nodes.steps = {.x=0.007812, .y=0.007812, .z=0.007812, .t=0.000500};
=======================

__.world.size = 64;
__.param.period = {.x=1, .y=0, .z=0};
__.world.rank = 14;
__.param.a = {.x=6.283185, .y=3.141593, .z=3.141593, .t=7.695299};

__.param.b = {.x=0.000000, .y=0.000000, .z=0.000000, .t=7.853982};
__.nodes.shape = {.x=128, .y=128, .z=128, .t=20};

__.nodes.bound = {.x=1.000000, .y=1.000000, .z=1.000000, .t=0.010000};
__.local.rank = 45;
__.nodes.steps = {.x=0.007812, .y=0.007812, .z=0.007812, .t=0.000500};
__.local.shape = {.x=4, .y=4, .z=4};

__.local.coord = {.x=2, .y=3, .z=1};
__.param.period = {.x=1, .y=0, .z=0};

__.param.a = {.x=6.283185, .y=3.141593, .z=3.141593, .t=7.695299};
__.block.shape = {.x=34, .y=34, .z=34};
__.param.b = {.x=0.000000, .y=0.000000, .z=0.000000, .t=7.853982};
__.block.coord = {.x=64, .y=96, .z=32};

__.block.elems = 39304;
__.local.rank = 14;

__.local.shape = {.x=4, .y=4, .z=4};
__.local.coord = {.x=0, .y=3, .z=2};

__.block.shape = {.x=34, .y=34, .z=34};
__.block.coord = {.x=0, .y=96, .z=64};
=======================
__.block.elems = 39304;
__.world.size = 64;

__.world.rank = 46;
=======================

__.world.size = 64;
__.nodes.shape = {.x=128, .y=128, .z=128, .t=20};
__.world.rank = 15;
__.nodes.bound = {.x=1.000000, .y=1.000000, .z=1.000000, .t=0.010000};

__.nodes.steps = {.x=0.007812, .y=0.007812, .z=0.007812, .t=0.000500};
__.nodes.shape = {.x=128, .y=128, .z=128, .t=20};

__.nodes.bound = {.x=1.000000, .y=1.000000, .z=1.000000, .t=0.010000};
__.param.period = {.x=1, .y=0, .z=0};
__.nodes.steps = {.x=0.007812, .y=0.007812, .z=0.007812, .t=0.000500};
__.param.a = {.x=6.283185, .y=3.141593, .z=3.141593, .t=7.695299};

__.param.b = {.x=0.000000, .y=0.000000, .z=0.000000, .t=7.853982};
__.param.period = {.x=1, .y=0, .z=0};

__.param.a = {.x=6.283185, .y=3.141593, .z=3.141593, .t=7.695299};
__.local.rank = 46;
__.param.b = {.x=0.000000, .y=0.000000, .z=0.000000, .t=7.853982};
__.local.shape = {.x=4, .y=4, .z=4};

__.local.coord = {.x=2, .y=3, .z=2};
__.local.rank = 15;

__.local.shape = {.x=4, .y=4, .z=4};
__.block.shape = {.x=34, .y=34, .z=34};
__.local.coord = {.x=0, .y=3, .z=3};
__.block.coord = {.x=64, .y=96, .z=64};

__.block.elems = 39304;
__.block.shape = {.x=34, .y=34, .z=34};

__.block.coord = {.x=0, .y=96, .z=96};
=======================
__.block.elems = 39304;
__.world.size = 64;

__.world.rank = 47;
=======================

__.world.size = 64;
__.nodes.shape = {.x=128, .y=128, .z=128, .t=20};
__.world.rank = 16;

__.nodes.shape = {.x=128, .y=128, .z=128, .t=20};
__.nodes.bound = {.x=1.000000, .y=1.000000, .z=1.000000, .t=0.010000};
__.nodes.bound = {.x=1.000000, .y=1.000000, .z=1.000000, .t=0.010000};
__.nodes.steps = {.x=0.007812, .y=0.007812, .z=0.007812, .t=0.000500};
__.nodes.steps = {.x=0.007812, .y=0.007812, .z=0.007812, .t=0.000500};


__.param.period = {.x=1, .y=0, .z=0};
__.param.period = {.x=1, .y=0, .z=0};
__.param.a = {.x=6.283185, .y=3.141593, .z=3.141593, .t=7.695299};
__.param.a = {.x=6.283185, .y=3.141593, .z=3.141593, .t=7.695299};
__.param.b = {.x=0.000000, .y=0.000000, .z=0.000000, .t=7.853982};
__.param.b = {.x=0.000000, .y=0.000000, .z=0.000000, .t=7.853982};


__.local.rank = 16;
__.local.rank = 47;
__.local.shape = {.x=4, .y=4, .z=4};
__.local.shape = {.x=4, .y=4, .z=4};
__.local.coord = {.x=1, .y=0, .z=0};
__.local.coord = {.x=2, .y=3, .z=3};


__.block.shape = {.x=34, .y=34, .z=34};
__.block.shape = {.x=34, .y=34, .z=34};
__.block.coord = {.x=32, .y=0, .z=0};
__.block.coord = {.x=64, .y=96, .z=96};
__.block.elems = 39304;
__.block.elems = 39304;


=======================
=======================
__.world.size = 64;
__.world.size = 64;
__.world.rank = 17;
__.world.rank = 48;


__.nodes.shape = {.x=128, .y=128, .z=128, .t=20};
__.nodes.shape = {.x=128, .y=128, .z=128, .t=20};
__.nodes.bound = {.x=1.000000, .y=1.000000, .z=1.000000, .t=0.010000};
__.nodes.bound = {.x=1.000000, .y=1.000000, .z=1.000000, .t=0.010000};
__.nodes.steps = {.x=0.007812, .y=0.007812, .z=0.007812, .t=0.000500};
__.nodes.steps = {.x=0.007812, .y=0.007812, .z=0.007812, .t=0.000500};


__.param.period = {.x=1, .y=0, .z=0};
__.param.period = {.x=1, .y=0, .z=0};
__.param.a = {.x=6.283185, .y=3.141593, .z=3.141593, .t=7.695299};
__.param.a = {.x=6.283185, .y=3.141593, .z=3.141593, .t=7.695299};
__.param.b = {.x=0.000000, .y=0.000000, .z=0.000000, .t=7.853982};
__.param.b = {.x=0.000000, .y=0.000000, .z=0.000000, .t=7.853982};


__.local.rank = 17;
__.local.rank = 48;
__.local.shape = {.x=4, .y=4, .z=4};
__.local.shape = {.x=4, .y=4, .z=4};
__.local.coord = {.x=1, .y=0, .z=1};
__.local.coord = {.x=3, .y=0, .z=0};


__.block.shape = {.x=34, .y=34, .z=34};
__.block.shape = {.x=34, .y=34, .z=34};
__.block.coord = {.x=32, .y=0, .z=32};
__.block.coord = {.x=96, .y=0, .z=0};
__.block.elems = 39304;
__.block.elems = 39304;


=======================
=======================
__.world.size = 64;
__.world.size = 64;
__.world.rank = 18;
__.world.rank = 49;


__.nodes.shape = {.x=128, .y=128, .z=128, .t=20};
__.nodes.shape = {.x=128, .y=128, .z=128, .t=20};
__.nodes.bound = {.x=1.000000, .y=1.000000, .z=1.000000, .t=0.010000};
__.nodes.bound = {.x=1.000000, .y=1.000000, .z=1.000000, .t=0.010000};
__.nodes.steps = {.x=0.007812, .y=0.007812, .z=0.007812, .t=0.000500};
__.nodes.steps = {.x=0.007812, .y=0.007812, .z=0.007812, .t=0.000500};


__.param.period = {.x=1, .y=0, .z=0};
__.param.period = {.x=1, .y=0, .z=0};
__.param.a = {.x=6.283185, .y=3.141593, .z=3.141593, .t=7.695299};
__.param.a = {.x=6.283185, .y=3.141593, .z=3.141593, .t=7.695299};
__.param.b = {.x=0.000000, .y=0.000000, .z=0.000000, .t=7.853982};
__.param.b = {.x=0.000000, .y=0.000000, .z=0.000000, .t=7.853982};


__.local.rank = 18;
__.local.rank = 49;
__.local.shape = {.x=4, .y=4, .z=4};
__.local.shape = {.x=4, .y=4, .z=4};
__.local.coord = {.x=1, .y=0, .z=2};
__.local.coord = {.x=3, .y=0, .z=1};


__.block.shape = {.x=34, .y=34, .z=34};
__.block.shape = {.x=34, .y=34, .z=34};
__.block.coord = {.x=32, .y=0, .z=64};
__.block.coord = {.x=96, .y=0, .z=32};
__.block.elems = 39304;
__.block.elems = 39304;


=======================
__.world.size = 64;
__.world.rank = 19;

=======================
__.nodes.shape = {.x=128, .y=128, .z=128, .t=20};
__.world.size = 64;
__.nodes.bound = {.x=1.000000, .y=1.000000, .z=1.000000, .t=0.010000};
__.world.rank = 50;
__.nodes.steps = {.x=0.007812, .y=0.007812, .z=0.007812, .t=0.000500};


__.nodes.shape = {.x=128, .y=128, .z=128, .t=20};
__.param.period = {.x=1, .y=0, .z=0};
__.nodes.bound = {.x=1.000000, .y=1.000000, .z=1.000000, .t=0.010000};
__.param.a = {.x=6.283185, .y=3.141593, .z=3.141593, .t=7.695299};
__.nodes.steps = {.x=0.007812, .y=0.007812, .z=0.007812, .t=0.000500};
__.param.b = {.x=0.000000, .y=0.000000, .z=0.000000, .t=7.853982};


__.param.period = {.x=1, .y=0, .z=0};
__.local.rank = 19;
__.param.a = {.x=6.283185, .y=3.141593, .z=3.141593, .t=7.695299};
__.local.shape = {.x=4, .y=4, .z=4};
__.param.b = {.x=0.000000, .y=0.000000, .z=0.000000, .t=7.853982};
__.local.coord = {.x=1, .y=0, .z=3};


__.local.rank = 50;
__.block.shape = {.x=34, .y=34, .z=34};
__.local.shape = {.x=4, .y=4, .z=4};
__.block.coord = {.x=32, .y=0, .z=96};
__.local.coord = {.x=3, .y=0, .z=2};
__.block.elems = 39304;


__.block.shape = {.x=34, .y=34, .z=34};
=======================
__.block.coord = {.x=96, .y=0, .z=64};
__.world.size = 64;
__.block.elems = 39304;
__.world.rank = 20;


=======================
__.nodes.shape = {.x=128, .y=128, .z=128, .t=20};
__.world.size = 64;
__.nodes.bound = {.x=1.000000, .y=1.000000, .z=1.000000, .t=0.010000};
__.world.rank = 51;
__.nodes.steps = {.x=0.007812, .y=0.007812, .z=0.007812, .t=0.000500};


__.nodes.shape = {.x=128, .y=128, .z=128, .t=20};
__.param.period = {.x=1, .y=0, .z=0};
__.nodes.bound = {.x=1.000000, .y=1.000000, .z=1.000000, .t=0.010000};
__.param.a = {.x=6.283185, .y=3.141593, .z=3.141593, .t=7.695299};
__.param.b = {.x=0.000000, .y=0.000000, .z=0.000000, .t=7.853982};

__.local.rank = 20;
__.nodes.steps = {.x=0.007812, .y=0.007812, .z=0.007812, .t=0.000500};
__.local.shape = {.x=4, .y=4, .z=4};

__.local.coord = {.x=1, .y=1, .z=0};
__.param.period = {.x=1, .y=0, .z=0};

__.param.a = {.x=6.283185, .y=3.141593, .z=3.141593, .t=7.695299};
__.block.shape = {.x=34, .y=34, .z=34};
__.param.b = {.x=0.000000, .y=0.000000, .z=0.000000, .t=7.853982};
__.block.coord = {.x=32, .y=32, .z=0};

__.block.elems = 39304;
__.local.rank = 51;

__.local.shape = {.x=4, .y=4, .z=4};
=======================
__.local.coord = {.x=3, .y=0, .z=3};
__.world.size = 64;

__.world.rank = 21;
__.block.shape = {.x=34, .y=34, .z=34};

__.block.coord = {.x=96, .y=0, .z=96};
__.nodes.shape = {.x=128, .y=128, .z=128, .t=20};
__.block.elems = 39304;
__.nodes.bound = {.x=1.000000, .y=1.000000, .z=1.000000, .t=0.010000};

__.nodes.steps = {.x=0.007812, .y=0.007812, .z=0.007812, .t=0.000500};

__.param.period = {.x=1, .y=0, .z=0};
=======================
__.param.a = {.x=6.283185, .y=3.141593, .z=3.141593, .t=7.695299};
__.world.size = 64;
__.param.b = {.x=0.000000, .y=0.000000, .z=0.000000, .t=7.853982};
__.world.rank = 52;


__.local.rank = 21;
__.nodes.shape = {.x=128, .y=128, .z=128, .t=20};
__.local.shape = {.x=4, .y=4, .z=4};
__.nodes.bound = {.x=1.000000, .y=1.000000, .z=1.000000, .t=0.010000};
__.local.coord = {.x=1, .y=1, .z=1};
__.nodes.steps = {.x=0.007812, .y=0.007812, .z=0.007812, .t=0.000500};


__.block.shape = {.x=34, .y=34, .z=34};
__.param.period = {.x=1, .y=0, .z=0};
__.block.coord = {.x=32, .y=32, .z=32};
__.param.a = {.x=6.283185, .y=3.141593, .z=3.141593, .t=7.695299};
__.block.elems = 39304;

=======================
__.world.size = 64;
__.param.b = {.x=0.000000, .y=0.000000, .z=0.000000, .t=7.853982};
__.world.rank = 22;


__.local.rank = 52;
__.nodes.shape = {.x=128, .y=128, .z=128, .t=20};
__.local.shape = {.x=4, .y=4, .z=4};
__.nodes.bound = {.x=1.000000, .y=1.000000, .z=1.000000, .t=0.010000};
__.local.coord = {.x=3, .y=1, .z=0};
__.nodes.steps = {.x=0.007812, .y=0.007812, .z=0.007812, .t=0.000500};


__.block.shape = {.x=34, .y=34, .z=34};
__.param.period = {.x=1, .y=0, .z=0};
__.block.coord = {.x=96, .y=32, .z=0};
__.param.a = {.x=6.283185, .y=3.141593, .z=3.141593, .t=7.695299};
__.block.elems = 39304;
__.param.b = {.x=0.000000, .y=0.000000, .z=0.000000, .t=7.853982};


__.local.rank = 22;
__.local.shape = {.x=4, .y=4, .z=4};
__.local.coord = {.x=1, .y=1, .z=2};
=======================

__.world.size = 64;
__.block.shape = {.x=34, .y=34, .z=34};
__.world.rank = 53;
__.block.coord = {.x=32, .y=32, .z=64};

__.block.elems = 39304;
__.nodes.shape = {.x=128, .y=128, .z=128, .t=20};

__.nodes.bound = {.x=1.000000, .y=1.000000, .z=1.000000, .t=0.010000};
=======================
__.nodes.steps = {.x=0.007812, .y=0.007812, .z=0.007812, .t=0.000500};
__.world.size = 64;
__.world.rank = 23;


__.nodes.shape = {.x=128, .y=128, .z=128, .t=20};
__.param.period = {.x=1, .y=0, .z=0};
__.nodes.bound = {.x=1.000000, .y=1.000000, .z=1.000000, .t=0.010000};
__.param.a = {.x=6.283185, .y=3.141593, .z=3.141593, .t=7.695299};
__.nodes.steps = {.x=0.007812, .y=0.007812, .z=0.007812, .t=0.000500};
__.param.b = {.x=0.000000, .y=0.000000, .z=0.000000, .t=7.853982};


__.param.period = {.x=1, .y=0, .z=0};
__.local.rank = 53;
__.param.a = {.x=6.283185, .y=3.141593, .z=3.141593, .t=7.695299};
__.local.shape = {.x=4, .y=4, .z=4};
__.param.b = {.x=0.000000, .y=0.000000, .z=0.000000, .t=7.853982};
__.local.coord = {.x=3, .y=1, .z=1};

__.local.rank = 23;
__.local.shape = {.x=4, .y=4, .z=4};

__.local.coord = {.x=1, .y=1, .z=3};
__.block.shape = {.x=34, .y=34, .z=34};

__.block.coord = {.x=96, .y=32, .z=32};
__.block.shape = {.x=34, .y=34, .z=34};
__.block.elems = 39304;
__.block.coord = {.x=32, .y=32, .z=96};

__.block.elems = 39304;

=======================
__.world.size = 64;
=======================
__.world.rank = 24;
__.world.size = 64;

__.world.rank = 54;
__.nodes.shape = {.x=128, .y=128, .z=128, .t=20};

__.nodes.bound = {.x=1.000000, .y=1.000000, .z=1.000000, .t=0.010000};
__.nodes.shape = {.x=128, .y=128, .z=128, .t=20};
__.nodes.steps = {.x=0.007812, .y=0.007812, .z=0.007812, .t=0.000500};

__.param.period = {.x=1, .y=0, .z=0};
__.param.a = {.x=6.283185, .y=3.141593, .z=3.141593, .t=7.695299};
__.nodes.bound = {.x=1.000000, .y=1.000000, .z=1.000000, .t=0.010000};
__.param.b = {.x=0.000000, .y=0.000000, .z=0.000000, .t=7.853982};
__.nodes.steps = {.x=0.007812, .y=0.007812, .z=0.007812, .t=0.000500};


__.local.rank = 24;
__.param.period = {.x=1, .y=0, .z=0};
__.local.shape = {.x=4, .y=4, .z=4};
__.param.a = {.x=6.283185, .y=3.141593, .z=3.141593, .t=7.695299};
__.local.coord = {.x=1, .y=2, .z=0};
__.param.b = {.x=0.000000, .y=0.000000, .z=0.000000, .t=7.853982};


__.block.shape = {.x=34, .y=34, .z=34};
__.block.coord = {.x=32, .y=64, .z=0};
__.block.elems = 39304;
__.local.rank = 54;

__.local.shape = {.x=4, .y=4, .z=4};
=======================
__.local.coord = {.x=3, .y=1, .z=2};
__.world.size = 64;

__.world.rank = 25;
__.block.shape = {.x=34, .y=34, .z=34};

__.block.coord = {.x=96, .y=32, .z=64};
__.nodes.shape = {.x=128, .y=128, .z=128, .t=20};
__.block.elems = 39304;
__.nodes.bound = {.x=1.000000, .y=1.000000, .z=1.000000, .t=0.010000};

__.nodes.steps = {.x=0.007812, .y=0.007812, .z=0.007812, .t=0.000500};

__.param.period = {.x=1, .y=0, .z=0};
=======================
__.param.a = {.x=6.283185, .y=3.141593, .z=3.141593, .t=7.695299};
__.world.size = 64;
__.param.b = {.x=0.000000, .y=0.000000, .z=0.000000, .t=7.853982};
__.world.rank = 55;


__.local.rank = 25;
__.nodes.shape = {.x=128, .y=128, .z=128, .t=20};
__.local.shape = {.x=4, .y=4, .z=4};
__.local.coord = {.x=1, .y=2, .z=1};

__.block.shape = {.x=34, .y=34, .z=34};
__.nodes.bound = {.x=1.000000, .y=1.000000, .z=1.000000, .t=0.010000};
__.block.coord = {.x=32, .y=64, .z=32};
__.nodes.steps = {.x=0.007812, .y=0.007812, .z=0.007812, .t=0.000500};
__.block.elems = 39304;


__.param.period = {.x=1, .y=0, .z=0};
=======================
__.param.a = {.x=6.283185, .y=3.141593, .z=3.141593, .t=7.695299};
__.world.size = 64;
__.param.b = {.x=0.000000, .y=0.000000, .z=0.000000, .t=7.853982};
__.world.rank = 26;


__.nodes.shape = {.x=128, .y=128, .z=128, .t=20};
__.nodes.bound = {.x=1.000000, .y=1.000000, .z=1.000000, .t=0.010000};
__.local.rank = 55;
__.nodes.steps = {.x=0.007812, .y=0.007812, .z=0.007812, .t=0.000500};
__.local.shape = {.x=4, .y=4, .z=4};

__.local.coord = {.x=3, .y=1, .z=3};
__.param.period = {.x=1, .y=0, .z=0};

__.param.a = {.x=6.283185, .y=3.141593, .z=3.141593, .t=7.695299};
__.block.shape = {.x=34, .y=34, .z=34};
__.param.b = {.x=0.000000, .y=0.000000, .z=0.000000, .t=7.853982};
__.block.coord = {.x=96, .y=32, .z=96};

__.block.elems = 39304;
__.local.rank = 26;

__.local.shape = {.x=4, .y=4, .z=4};
__.local.coord = {.x=1, .y=2, .z=2};

=======================
__.block.shape = {.x=34, .y=34, .z=34};
__.world.size = 64;
__.block.coord = {.x=32, .y=64, .z=64};
__.world.rank = 56;
__.block.elems = 39304;


__.nodes.shape = {.x=128, .y=128, .z=128, .t=20};
=======================
__.world.size = 64;
__.world.rank = 27;
__.nodes.bound = {.x=1.000000, .y=1.000000, .z=1.000000, .t=0.010000};

__.nodes.steps = {.x=0.007812, .y=0.007812, .z=0.007812, .t=0.000500};
__.nodes.shape = {.x=128, .y=128, .z=128, .t=20};

__.nodes.bound = {.x=1.000000, .y=1.000000, .z=1.000000, .t=0.010000};
__.param.period = {.x=1, .y=0, .z=0};
__.nodes.steps = {.x=0.007812, .y=0.007812, .z=0.007812, .t=0.000500};
__.param.a = {.x=6.283185, .y=3.141593, .z=3.141593, .t=7.695299};

__.param.b = {.x=0.000000, .y=0.000000, .z=0.000000, .t=7.853982};
__.param.period = {.x=1, .y=0, .z=0};
__.param.a = {.x=6.283185, .y=3.141593, .z=3.141593, .t=7.695299};
__.param.b = {.x=0.000000, .y=0.000000, .z=0.000000, .t=7.853982};


__.local.rank = 56;
__.local.rank = 27;
__.local.shape = {.x=4, .y=4, .z=4};
__.local.shape = {.x=4, .y=4, .z=4};
__.local.coord = {.x=3, .y=2, .z=0};
__.local.coord = {.x=1, .y=2, .z=3};


__.block.shape = {.x=34, .y=34, .z=34};
__.block.shape = {.x=34, .y=34, .z=34};
__.block.coord = {.x=96, .y=64, .z=0};
__.block.coord = {.x=32, .y=64, .z=96};
__.block.elems = 39304;
__.block.elems = 39304;


=======================
=======================
__.world.size = 64;
__.world.size = 64;
__.world.rank = 57;
__.world.rank = 28;


__.nodes.shape = {.x=128, .y=128, .z=128, .t=20};
__.nodes.bound = {.x=1.000000, .y=1.000000, .z=1.000000, .t=0.010000};
__.nodes.steps = {.x=0.007812, .y=0.007812, .z=0.007812, .t=0.000500};
__.nodes.shape = {.x=128, .y=128, .z=128, .t=20};

__.nodes.bound = {.x=1.000000, .y=1.000000, .z=1.000000, .t=0.010000};
__.param.period = {.x=1, .y=0, .z=0};
__.nodes.steps = {.x=0.007812, .y=0.007812, .z=0.007812, .t=0.000500};
__.param.a = {.x=6.283185, .y=3.141593, .z=3.141593, .t=7.695299};

__.param.b = {.x=0.000000, .y=0.000000, .z=0.000000, .t=7.853982};
__.param.period = {.x=1, .y=0, .z=0};

__.param.a = {.x=6.283185, .y=3.141593, .z=3.141593, .t=7.695299};
__.local.rank = 28;
__.param.b = {.x=0.000000, .y=0.000000, .z=0.000000, .t=7.853982};
__.local.shape = {.x=4, .y=4, .z=4};
__.local.coord = {.x=1, .y=3, .z=0};


__.block.shape = {.x=34, .y=34, .z=34};
__.local.rank = 57;
__.block.coord = {.x=32, .y=96, .z=0};
__.local.shape = {.x=4, .y=4, .z=4};
__.block.elems = 39304;
__.local.coord = {.x=3, .y=2, .z=1};


=======================
__.block.shape = {.x=34, .y=34, .z=34};
__.world.size = 64;
__.block.coord = {.x=96, .y=64, .z=32};
__.world.rank = 29;
__.block.elems = 39304;


__.nodes.shape = {.x=128, .y=128, .z=128, .t=20};
__.nodes.bound = {.x=1.000000, .y=1.000000, .z=1.000000, .t=0.010000};
__.nodes.steps = {.x=0.007812, .y=0.007812, .z=0.007812, .t=0.000500};
=======================

__.world.size = 64;
__.param.period = {.x=1, .y=0, .z=0};
__.world.rank = 58;
__.param.a = {.x=6.283185, .y=3.141593, .z=3.141593, .t=7.695299};

__.param.b = {.x=0.000000, .y=0.000000, .z=0.000000, .t=7.853982};
__.nodes.shape = {.x=128, .y=128, .z=128, .t=20};

__.local.rank = 29;
__.local.shape = {.x=4, .y=4, .z=4};
__.nodes.bound = {.x=1.000000, .y=1.000000, .z=1.000000, .t=0.010000};
__.local.coord = {.x=1, .y=3, .z=1};
__.nodes.steps = {.x=0.007812, .y=0.007812, .z=0.007812, .t=0.000500};


__.block.shape = {.x=34, .y=34, .z=34};
__.param.period = {.x=1, .y=0, .z=0};
__.block.coord = {.x=32, .y=96, .z=32};
__.param.a = {.x=6.283185, .y=3.141593, .z=3.141593, .t=7.695299};
__.block.elems = 39304;
__.param.b = {.x=0.000000, .y=0.000000, .z=0.000000, .t=7.853982};

=======================
__.world.size = 64;

__.world.rank = 30;
__.local.rank = 58;

__.local.shape = {.x=4, .y=4, .z=4};
__.nodes.shape = {.x=128, .y=128, .z=128, .t=20};
__.local.coord = {.x=3, .y=2, .z=2};
__.nodes.bound = {.x=1.000000, .y=1.000000, .z=1.000000, .t=0.010000};

__.nodes.steps = {.x=0.007812, .y=0.007812, .z=0.007812, .t=0.000500};
__.block.shape = {.x=34, .y=34, .z=34};

__.block.coord = {.x=96, .y=64, .z=64};
__.param.period = {.x=1, .y=0, .z=0};
__.param.a = {.x=6.283185, .y=3.141593, .z=3.141593, .t=7.695299};
__.param.b = {.x=0.000000, .y=0.000000, .z=0.000000, .t=7.853982};
__.block.elems = 39304;


__.local.rank = 30;
=======================
__.local.shape = {.x=4, .y=4, .z=4};
__.world.size = 64;
__.local.coord = {.x=1, .y=3, .z=2};
__.world.rank = 59;


__.block.shape = {.x=34, .y=34, .z=34};
__.nodes.shape = {.x=128, .y=128, .z=128, .t=20};
__.block.coord = {.x=32, .y=96, .z=64};
__.nodes.bound = {.x=1.000000, .y=1.000000, .z=1.000000, .t=0.010000};
__.block.elems = 39304;

=======================
__.nodes.steps = {.x=0.007812, .y=0.007812, .z=0.007812, .t=0.000500};
__.world.size = 64;

__.world.rank = 31;
__.param.period = {.x=1, .y=0, .z=0};

__.param.a = {.x=6.283185, .y=3.141593, .z=3.141593, .t=7.695299};
__.nodes.shape = {.x=128, .y=128, .z=128, .t=20};
__.param.b = {.x=0.000000, .y=0.000000, .z=0.000000, .t=7.853982};
__.nodes.bound = {.x=1.000000, .y=1.000000, .z=1.000000, .t=0.010000};
__.nodes.steps = {.x=0.007812, .y=0.007812, .z=0.007812, .t=0.000500};


__.param.period = {.x=1, .y=0, .z=0};
__.local.rank = 59;
__.param.a = {.x=6.283185, .y=3.141593, .z=3.141593, .t=7.695299};
__.local.shape = {.x=4, .y=4, .z=4};
__.param.b = {.x=0.000000, .y=0.000000, .z=0.000000, .t=7.853982};
__.local.coord = {.x=3, .y=2, .z=3};


__.local.rank = 31;
__.block.shape = {.x=34, .y=34, .z=34};
__.local.shape = {.x=4, .y=4, .z=4};
__.local.coord = {.x=1, .y=3, .z=3};

__.block.coord = {.x=96, .y=64, .z=96};
__.block.shape = {.x=34, .y=34, .z=34};
__.block.elems = 39304;

=======================
__.world.size = 64;
__.world.rank = 60;

__.nodes.shape = {.x=128, .y=128, .z=128, .t=20};
__.nodes.bound = {.x=1.000000, .y=1.000000, .z=1.000000, .t=0.010000};
__.nodes.steps = {.x=0.007812, .y=0.007812, .z=0.007812, .t=0.000500};

__.param.period = {.x=1, .y=0, .z=0};
__.param.a = {.x=6.283185, .y=3.141593, .z=3.141593, .t=7.695299};
__.param.b = {.x=0.000000, .y=0.000000, .z=0.000000, .t=7.853982};

__.local.rank = 60;
__.local.shape = {.x=4, .y=4, .z=4};
__.local.coord = {.x=3, .y=3, .z=0};

__.block.shape = {.x=34, .y=34, .z=34};
__.block.coord = {.x=96, .y=96, .z=0};
__.block.elems = 39304;
__.block.coord = {.x=32, .y=96, .z=96};

__.block.elems = 39304;

=======================
__.world.size = 64;
__.world.rank = 61;

__.nodes.shape = {.x=128, .y=128, .z=128, .t=20};
__.nodes.bound = {.x=1.000000, .y=1.000000, .z=1.000000, .t=0.010000};
__.nodes.steps = {.x=0.007812, .y=0.007812, .z=0.007812, .t=0.000500};

__.param.period = {.x=1, .y=0, .z=0};
__.param.a = {.x=6.283185, .y=3.141593, .z=3.141593, .t=7.695299};
__.param.b = {.x=0.000000, .y=0.000000, .z=0.000000, .t=7.853982};

__.local.rank = 61;
__.local.shape = {.x=4, .y=4, .z=4};
__.local.coord = {.x=3, .y=3, .z=1};

__.block.shape = {.x=34, .y=34, .z=34};
__.block.coord = {.x=96, .y=96, .z=32};
__.block.elems = 39304;

=======================
__.world.size = 64;
__.world.rank = 62;

__.nodes.shape = {.x=128, .y=128, .z=128, .t=20};
__.nodes.bound = {.x=1.000000, .y=1.000000, .z=1.000000, .t=0.010000};
__.nodes.steps = {.x=0.007812, .y=0.007812, .z=0.007812, .t=0.000500};

__.param.period = {.x=1, .y=0, .z=0};
__.param.a = {.x=6.283185, .y=3.141593, .z=3.141593, .t=7.695299};
__.param.b = {.x=0.000000, .y=0.000000, .z=0.000000, .t=7.853982};

__.local.rank = 62;
__.local.shape = {.x=4, .y=4, .z=4};
__.local.coord = {.x=3, .y=3, .z=2};

__.block.shape = {.x=34, .y=34, .z=34};
__.block.coord = {.x=96, .y=96, .z=64};
__.block.elems = 39304;

=======================
__.world.size = 64;
__.world.rank = 63;

__.nodes.shape = {.x=128, .y=128, .z=128, .t=20};
__.nodes.bound = {.x=1.000000, .y=1.000000, .z=1.000000, .t=0.010000};
__.nodes.steps = {.x=0.007812, .y=0.007812, .z=0.007812, .t=0.000500};

__.param.period = {.x=1, .y=0, .z=0};
__.param.a = {.x=6.283185, .y=3.141593, .z=3.141593, .t=7.695299};
__.param.b = {.x=0.000000, .y=0.000000, .z=0.000000, .t=7.853982};

__.local.rank = 63;
__.local.shape = {.x=4, .y=4, .z=4};
__.local.coord = {.x=3, .y=3, .z=3};

__.block.shape = {.x=34, .y=34, .z=34};
__.block.coord = {.x=96, .y=96, .z=96};
__.block.elems = 39304;

__TRIALS__.append((1.041879e+00, [0.000000e+00, 1.105544e-09, 4.422145e-09, 9.949703e-09, 1.768806e-08, 2.763697e-08, 3.979616e-08, 5.416526e-08, 7.074384e-08, 8.953142e-08, 1.105274e-07, 1.337313e-07, 1.591422e-07, 1.867596e-07, 2.165825e-07, 2.486100e-07, 2.828413e-07, 3.192754e-07, 3.579110e-07, 3.987471e-07, 4.417826e-07, ]))
__TRIALS__.append((1.042280e+00, [0.000000e+00, 1.105544e-09, 4.422145e-09, 9.949703e-09, 1.768806e-08, 2.763697e-08, 3.979616e-08, 5.416526e-08, 7.074384e-08, 8.953142e-08, 1.105274e-07, 1.337313e-07, 1.591422e-07, 1.867596e-07, 2.165825e-07, 2.486100e-07, 2.828413e-07, 3.192754e-07, 3.579110e-07, 3.987471e-07, 4.417826e-07, ]))
__TRIALS__.append((1.042260e+00, [0.000000e+00, 1.105544e-09, 4.422145e-09, 9.949703e-09, 1.768806e-08, 2.763697e-08, 3.979616e-08, 5.416526e-08, 7.074384e-08, 8.953142e-08, 1.105274e-07, 1.337313e-07, 1.591422e-07, 1.867596e-07, 2.165825e-07, 2.486100e-07, 2.828413e-07, 3.192754e-07, 3.579110e-07, 3.987471e-07, 4.417826e-07, ]))
__TRIALS__.append((1.042256e+00, [0.000000e+00, 1.105544e-09, 4.422145e-09, 9.949703e-09, 1.768806e-08, 2.763697e-08, 3.979616e-08, 5.416526e-08, 7.074384e-08, 8.953142e-08, 1.105274e-07, 1.337313e-07, 1.591422e-07, 1.867596e-07, 2.165825e-07, 2.486100e-07, 2.828413e-07, 3.192754e-07, 3.579110e-07, 3.987471e-07, 4.417826e-07, ]))
__TRIALS__.append((1.042267e+00, [0.000000e+00, 1.105544e-09, 4.422145e-09, 9.949703e-09, 1.768806e-08, 2.763697e-08, 3.979616e-08, 5.416526e-08, 7.074384e-08, 8.953142e-08, 1.105274e-07, 1.337313e-07, 1.591422e-07, 1.867596e-07, 2.165825e-07, 2.486100e-07, 2.828413e-07, 3.192754e-07, 3.579110e-07, 3.987471e-07, 4.417826e-07, ]))
__TRIALS__.append((1.042257e+00, [0.000000e+00, 1.105544e-09, 4.422145e-09, 9.949703e-09, 1.768806e-08, 2.763697e-08, 3.979616e-08, 5.416526e-08, 7.074384e-08, 8.953142e-08, 1.105274e-07, 1.337313e-07, 1.591422e-07, 1.867596e-07, 2.165825e-07, 2.486100e-07, 2.828413e-07, 3.192754e-07, 3.579110e-07, 3.987471e-07, 4.417826e-07, ]))
__TRIALS__.append((1.042257e+00, [0.000000e+00, 1.105544e-09, 4.422145e-09, 9.949703e-09, 1.768806e-08, 2.763697e-08, 3.979616e-08, 5.416526e-08, 7.074384e-08, 8.953142e-08, 1.105274e-07, 1.337313e-07, 1.591422e-07, 1.867596e-07, 2.165825e-07, 2.486100e-07, 2.828413e-07, 3.192754e-07, 3.579110e-07, 3.987471e-07, 4.417826e-07, ]))
__TRIALS__.append((1.042268e+00, [0.000000e+00, 1.105544e-09, 4.422145e-09, 9.949703e-09, 1.768806e-08, 2.763697e-08, 3.979616e-08, 5.416526e-08, 7.074384e-08, 8.953142e-08, 1.105274e-07, 1.337313e-07, 1.591422e-07, 1.867596e-07, 2.165825e-07, 2.486100e-07, 2.828413e-07, 3.192754e-07, 3.579110e-07, 3.987471e-07, 4.417826e-07, ]))
__TRIALS__.append((1.042267e+00, [0.000000e+00, 1.105544e-09, 4.422145e-09, 9.949703e-09, 1.768806e-08, 2.763697e-08, 3.979616e-08, 5.416526e-08, 7.074384e-08, 8.953142e-08, 1.105274e-07, 1.337313e-07, 1.591422e-07, 1.867596e-07, 2.165825e-07, 2.486100e-07, 2.828413e-07, 3.192754e-07, 3.579110e-07, 3.987471e-07, 4.417826e-07, ]))
__TRIALS__.append((1.042261e+00, [0.000000e+00, 1.105544e-09, 4.422145e-09, 9.949703e-09, 1.768806e-08, 2.763697e-08, 3.979616e-08, 5.416526e-08, 7.074384e-08, 8.953142e-08, 1.105274e-07, 1.337313e-07, 1.591422e-07, 1.867596e-07, 2.165825e-07, 2.486100e-07, 2.828413e-07, 3.192754e-07, 3.579110e-07, 3.987471e-07, 4.417826e-07, ]))
