Sender: LSF System <lsfadmin@polus-c1-ib.bmc.hpc.cs.msu.ru>
Subject: Job 798503: <# this file was automaticly created by mpisubmit.pl script for edu-cmc-skmodel21-622-16 #;source /polusfs/setenv/setup.SMPI;#BSUB -n 16;#BSUB -W 00:15;#BSUB -o main_filtered_delta.%J.out;#BSUB -e main_filtered_delta.%J.err;OMP_NUM_THREADS=1 mpiexec main_filtered_delta 3.0e-5 42> in cluster <MSUCluster> Done

Job <# this file was automaticly created by mpisubmit.pl script for edu-cmc-skmodel21-622-16 #;source /polusfs/setenv/setup.SMPI;#BSUB -n 16;#BSUB -W 00:15;#BSUB -o main_filtered_delta.%J.out;#BSUB -e main_filtered_delta.%J.err;OMP_NUM_THREADS=1 mpiexec main_filtered_delta 3.0e-5 42> was submitted from host <polus-ib.bmc.hpc.cs.msu.ru> by user <edu-cmc-skmodel21-622-16> in cluster <MSUCluster> at Sun Nov  7 07:17:44 2021
Job was executed on host(s) <16*polus-c1-ib.bmc.hpc.cs.msu.ru>, in queue <short>, as user <edu-cmc-skmodel21-622-16> in cluster <MSUCluster> at Sun Nov  7 07:17:45 2021
</home_edu/edu-cmc-skmodel21-622/edu-cmc-skmodel21-622-16> was used as the home directory.
</home_edu/edu-cmc-skmodel21-622/edu-cmc-skmodel21-622-16/solution> was used as the working directory.
Started at Sun Nov  7 07:17:45 2021
Terminated at Sun Nov  7 07:18:48 2021
Results reported at Sun Nov  7 07:18:48 2021

Your job looked like:

------------------------------------------------------------
# LSBATCH: User input
# this file was automaticly created by mpisubmit.pl script for edu-cmc-skmodel21-622-16 #
source /polusfs/setenv/setup.SMPI
#BSUB -n 16
#BSUB -W 00:15
#BSUB -o main_filtered_delta.%J.out
#BSUB -e main_filtered_delta.%J.err
OMP_NUM_THREADS=1 mpiexec main_filtered_delta 3.0e-5 42

------------------------------------------------------------

Successfully completed.

Resource usage summary:

    CPU time :                                   973.05 sec.
    Max Memory :                                 857 MB
    Average Memory :                             779.18 MB
    Total Requested Memory :                     -
    Delta Memory :                               -
    Max Swap :                                   -
    Max Processes :                              20
    Max Threads :                                57
    Run time :                                   64 sec.
    Turnaround time :                            64 sec.

The output (if any) follows:

# Running __TRIALS__ with FILTERED_SAMPLING/DELTA_STOPPING and epsilon=3.000000e-05, comm_size=16, seed=42
__TRIALS__ = [
#   (trial_time, trial_iters, trial_points, trial_error),
    (6.229524e+00, 896004480, 234587945, 4.906686e-05),  # __TRIALS__
    (6.073083e+00, 896004480, 234594275, 2.869213e-05),  # __TRIALS__
    (6.036868e+00, 896004480, 234568271, 4.616023e-05),  # __TRIALS__
    (6.086882e+00, 896004480, 234560428, 3.330064e-05),  # __TRIALS__
    (6.096948e+00, 896004480, 234575393, 1.260690e-05),  # __TRIALS__
    (6.033424e+00, 896004480, 234575922, 2.833033e-05),  # __TRIALS__
    (6.065060e+00, 896004480, 234580370, 4.171723e-06),  # __TRIALS__
    (6.020194e+00, 896004480, 234567756, 5.141631e-07),  # __TRIALS__
    (6.021956e+00, 896004480, 234568844, 8.418889e-06),  # __TRIALS__
    (6.054590e+00, 896004480, 234553513, 5.489920e-05),  # __TRIALS__
]  # __TRIALS__
# Done.


PS:

Read file <main_filtered_delta.798503.err> for stderr output of this job.

