# Running __TRIALS__ with FILTERED_SAMPLING/DELTA_STOPPING and epsilon=2.000000e-05, comm_size=1, seed=42
__TRIALS__ = [
#   (trial_time, trial_iters, trial_points, trial_error),
    (1.333422e+03, 1344000000, 351856400, 1.932038e-05),  # __TRIALS__
    (1.333419e+03, 1344000000, 351880085, 2.413036e-05),  # __TRIALS__
    (1.333419e+03, 1344000000, 351872259, 2.574166e-05),  # __TRIALS__
    (1.333419e+03, 1344000000, 351871332, 3.641803e-05),  # __TRIALS__
    (1.333414e+03, 1344000000, 351840439, 3.451570e-05),  # __TRIALS__
