Sender: LSF System <lsfadmin@polus-c4-ib.bmc.hpc.cs.msu.ru>
Subject: Job 805244: <# this file was automaticly created by mpisubmit.pl script for edu-cmc-skmodel21-622-16 #;source /polusfs/setenv/setup.SMPI;#BSUB -n 64;#BSUB -W 00:15;#BSUB -o main_adjusted_delta.%J.out;#BSUB -e main_adjusted_delta.%J.err;OMP_NUM_THREADS=1 mpiexec main_adjusted_delta 3.0e-5 42> in cluster <MSUCluster> Done

Job <# this file was automaticly created by mpisubmit.pl script for edu-cmc-skmodel21-622-16 #;source /polusfs/setenv/setup.SMPI;#BSUB -n 64;#BSUB -W 00:15;#BSUB -o main_adjusted_delta.%J.out;#BSUB -e main_adjusted_delta.%J.err;OMP_NUM_THREADS=1 mpiexec main_adjusted_delta 3.0e-5 42> was submitted from host <polus-ib.bmc.hpc.cs.msu.ru> by user <edu-cmc-skmodel21-622-16> in cluster <MSUCluster> at Mon Nov  8 23:34:15 2021
Job was executed on host(s) <20*polus-c4-ib.bmc.hpc.cs.msu.ru>, in queue <short>, as user <edu-cmc-skmodel21-622-16> in cluster <MSUCluster> at Mon Nov  8 23:34:48 2021
                            <20*polus-c1-ib.bmc.hpc.cs.msu.ru>
                            <20*polus-c2-ib.bmc.hpc.cs.msu.ru>
                            <4*polus-c3-ib.bmc.hpc.cs.msu.ru>
</home_edu/edu-cmc-skmodel21-622/edu-cmc-skmodel21-622-16> was used as the home directory.
</home_edu/edu-cmc-skmodel21-622/edu-cmc-skmodel21-622-16/solution> was used as the working directory.
Started at Mon Nov  8 23:34:48 2021
Terminated at Mon Nov  8 23:35:04 2021
Results reported at Mon Nov  8 23:35:04 2021

Your job looked like:

------------------------------------------------------------
# LSBATCH: User input
# this file was automaticly created by mpisubmit.pl script for edu-cmc-skmodel21-622-16 #
source /polusfs/setenv/setup.SMPI
#BSUB -n 64
#BSUB -W 00:15
#BSUB -o main_adjusted_delta.%J.out
#BSUB -e main_adjusted_delta.%J.err
OMP_NUM_THREADS=1 mpiexec main_adjusted_delta 3.0e-5 42

------------------------------------------------------------

Successfully completed.

Resource usage summary:

    CPU time :                                   851.83 sec.
    Max Memory :                                 1100 MB
    Average Memory :                             825.25 MB
    Total Requested Memory :                     -
    Delta Memory :                               -
    Max Swap :                                   -
    Max Processes :                              24
    Max Threads :                                69
    Run time :                                   16 sec.
    Turnaround time :                            49 sec.

The output (if any) follows:

# Running __TRIALS__ with ADJUSTED_SAMPLING/DELTA_STOPPING and epsilon=3.000000e-05, comm_size=64, seed=42
__TRIALS__ = [
#   (trial_time, trial_iters, trial_points, trial_error),
    (1.462627e+00, 234575040, 234575040, 1.838657e-05),  # __TRIALS__
    (1.409154e+00, 234575040, 234575040, 2.573174e-06),  # __TRIALS__
    (1.253582e+00, 234575040, 234575040, 2.144209e-05),  # __TRIALS__
    (1.275708e+00, 234575040, 234575040, 9.498583e-07),  # __TRIALS__
    (1.364010e+00, 234575040, 234575040, 1.431746e-05),  # __TRIALS__
    (1.238779e+00, 234575040, 234575040, 8.235908e-06),  # __TRIALS__
    (1.221310e+00, 234575040, 234575040, 1.361760e-05),  # __TRIALS__
    (1.280102e+00, 234575040, 234575040, 1.419691e-05),  # __TRIALS__
    (1.286673e+00, 234575040, 234575040, 2.023007e-05),  # __TRIALS__
    (1.329379e+00, 234575040, 234575040, 1.720628e-06),  # __TRIALS__
]  # __TRIALS__
# Done.


PS:

Read file <main_adjusted_delta.805244.err> for stderr output of this job.

