Sender: LSF System <lsfadmin@polus-c2-ib.bmc.hpc.cs.msu.ru>
Subject: Job 836946: <# this file was automaticly created by mpisubmit.pl script for edu-cmc-skmodel21-622-16 #;source /polusfs/setenv/setup.SMPI;#BSUB -n 40;#BSUB -W 00:15;#BSUB -o main.%J.out;#BSUB -e main.%J.err;OMP_NUM_THREADS=1 mpiexec main 3.141592653589793 0.01 256 20> in cluster <MSUCluster> Done

Job <# this file was automaticly created by mpisubmit.pl script for edu-cmc-skmodel21-622-16 #;source /polusfs/setenv/setup.SMPI;#BSUB -n 40;#BSUB -W 00:15;#BSUB -o main.%J.out;#BSUB -e main.%J.err;OMP_NUM_THREADS=1 mpiexec main 3.141592653589793 0.01 256 20> was submitted from host <polus-ib.bmc.hpc.cs.msu.ru> by user <edu-cmc-skmodel21-622-16> in cluster <MSUCluster> at Mon Dec 13 23:21:58 2021
Job was executed on host(s) <19*polus-c2-ib.bmc.hpc.cs.msu.ru>, in queue <short>, as user <edu-cmc-skmodel21-622-16> in cluster <MSUCluster> at Mon Dec 13 23:22:09 2021
                            <20*polus-c4-ib.bmc.hpc.cs.msu.ru>
                            <1*polus-c1-ib.bmc.hpc.cs.msu.ru>
</home_edu/edu-cmc-skmodel21-622/edu-cmc-skmodel21-622-16> was used as the home directory.
</home_edu/edu-cmc-skmodel21-622/edu-cmc-skmodel21-622-16/solution> was used as the working directory.
Started at Mon Dec 13 23:22:09 2021
Terminated at Mon Dec 13 23:22:15 2021
Results reported at Mon Dec 13 23:22:15 2021

Your job looked like:

------------------------------------------------------------
# LSBATCH: User input
# this file was automaticly created by mpisubmit.pl script for edu-cmc-skmodel21-622-16 #
source /polusfs/setenv/setup.SMPI
#BSUB -n 40
#BSUB -W 00:15
#BSUB -o main.%J.out
#BSUB -e main.%J.err
OMP_NUM_THREADS=1 mpiexec main 3.141592653589793 0.01 256 20

------------------------------------------------------------

Successfully completed.

Resource usage summary:

    CPU time :                                   155.16 sec.
    Max Memory :                                 1169 MB
    Average Memory :                             779.67 MB
    Total Requested Memory :                     -
    Delta Memory :                               -
    Max Swap :                                   -
    Max Processes :                              23
    Max Threads :                                66
    Run time :                                   6 sec.
    Turnaround time :                            17 sec.

The output (if any) follows:

__PARAMS__ = {'P': 40, 'O': 0, 'L': 3.141593e+00, 'T': 1.000000e-02, 'N': 256, 'K': 20}
=======================
__.world.size = 40;
__.world.rank = 3;

__.nodes.shape = {.x=256, .y=256, .z=256, .t=20};
__.nodes.bound = {.x=3.141593, .y=3.141593, .z=3.141593, .t=0.010000};
__.nodes.steps = {.x=0.012272, .y=0.012272, .z=0.012272, .t=0.000500};

__.param.period = {.x=1, .y=0, .z=0};
__.param.a = {.x=2.000000, .y=1.000000, .z=1.000000, .t=2.449490};
__.param.b = {.x=0.000000, .y=0.000000, .z=0.000000, .t=7.853982};

__.local.rank = 3;
__.local.shape = {.x=5, .y=4, .z=2};
__.local.coord = {.x=0, .y=1, .z=1};

__.block.shape = {.x=54, .y=66, .z=130};
__.block.coord = {.x=0, .y=64, .z=128};
__.block.elems = 463320;

=======================
__.world.size = 40;
__.world.rank = 4;

__.nodes.shape = {.x=256, .y=256, .z=256, .t=20};
__.nodes.bound = {.x=3.141593, .y=3.141593, .z=3.141593, .t=0.010000};
__.nodes.steps = {.x=0.012272, .y=0.012272, .z=0.012272, .t=0.000500};

__.param.period = {.x=1, .y=0, .z=0};
__.param.a = {.x=2.000000, .y=1.000000, .z=1.000000, .t=2.449490};
__.param.b = {.x=0.000000, .y=0.000000, .z=0.000000, .t=7.853982};

__.local.rank = 4;
__.local.shape = {.x=5, .y=4, .z=2};
__.local.coord = {.x=0, .y=2, .z=0};

__.block.shape = {.x=54, .y=66, .z=130};
__.block.coord = {.x=0, .y=128, .z=0};
__.block.elems = 463320;

=======================
__.world.size = 40;
__.world.rank = 5;

__.nodes.shape = {.x=256, .y=256, .z=256, .t=20};
__.nodes.bound = {.x=3.141593, .y=3.141593, .z=3.141593, .t=0.010000};
__.nodes.steps = {.x=0.012272, .y=0.012272, .z=0.012272, .t=0.000500};

__.param.period = {.x=1, .y=0, .z=0};
__.param.a = {.x=2.000000, .y=1.000000, .z=1.000000, .t=2.449490};
__.param.b = {.x=0.000000, .y=0.000000, .z=0.000000, .t=7.853982};

__.local.rank = 5;
__.local.shape = {.x=5, .y=4, .z=2};
__.local.coord = {.x=0, .y=2, .z=1};

__.block.shape = {.x=54, .y=66, .z=130};
__.block.coord = {.x=0, .y=128, .z=128};
__.block.elems = 463320;

=======================
__.world.size = 40;
__.world.rank = 6;

__.nodes.shape = {.x=256, .y=256, .z=256, .t=20};
__.nodes.bound = {.x=3.141593, .y=3.141593, .z=3.141593, .t=0.010000};
__.nodes.steps = {.x=0.012272, .y=0.012272, .z=0.012272, .t=0.000500};

__.param.period = {.x=1, .y=0, .z=0};
__.param.a = {.x=2.000000, .y=1.000000, .z=1.000000, .t=2.449490};
__.param.b = {.x=0.000000, .y=0.000000, .z=0.000000, .t=7.853982};

__.local.rank = 6;
__.local.shape = {.x=5, .y=4, .z=2};
__.local.coord = {.x=0, .y=3, .z=0};

__.block.shape = {.x=54, .y=66, .z=130};
__.block.coord = {.x=0, .y=192, .z=0};
__.block.elems = 463320;

=======================
__.world.size = 40;
__.world.rank = 7;

__.nodes.shape = {.x=256, .y=256, .z=256, .t=20};
__.nodes.bound = {.x=3.141593, .y=3.141593, .z=3.141593, .t=0.010000};
__.nodes.steps = {.x=0.012272, .y=0.012272, .z=0.012272, .t=0.000500};

__.param.period = {.x=1, .y=0, .z=0};
__.param.a = {.x=2.000000, .y=1.000000, .z=1.000000, .t=2.449490};
__.param.b = {.x=0.000000, .y=0.000000, .z=0.000000, .t=7.853982};

__.local.rank = 7;
__.local.shape = {.x=5, .y=4, .z=2};
__.local.coord = {.x=0, .y=3, .z=1};

__.block.shape = {.x=54, .y=66, .z=130};
__.block.coord = {.x=0, .y=192, .z=128};
__.block.elems = 463320;

=======================
__.world.size = 40;
__.world.rank = 8;

__.nodes.shape = {.x=256, .y=256, .z=256, .t=20};
__.nodes.bound = {.x=3.141593, .y=3.141593, .z=3.141593, .t=0.010000};
__.nodes.steps = {.x=0.012272, .y=0.012272, .z=0.012272, .t=0.000500};

__.param.period = {.x=1, .y=0, .z=0};
__.param.a = {.x=2.000000, .y=1.000000, .z=1.000000, .t=2.449490};
__.param.b = {.x=0.000000, .y=0.000000, .z=0.000000, .t=7.853982};

__.local.rank = 8;
__.local.shape = {.x=5, .y=4, .z=2};
__.local.coord = {.x=1, .y=0, .z=0};

__.block.shape = {.x=54, .y=66, .z=130};
__.block.coord = {.x=52, .y=0, .z=0};
__.block.elems = 463320;

=======================
__.world.size = 40;
__.world.rank = 9;

__.nodes.shape = {.x=256, .y=256, .z=256, .t=20};
__.nodes.bound = {.x=3.141593, .y=3.141593, .z=3.141593, .t=0.010000};
__.nodes.steps = {.x=0.012272, .y=0.012272, .z=0.012272, .t=0.000500};

__.param.period = {.x=1, .y=0, .z=0};
__.param.a = {.x=2.000000, .y=1.000000, .z=1.000000, .t=2.449490};
__.param.b = {.x=0.000000, .y=0.000000, .z=0.000000, .t=7.853982};

__.local.rank = 9;
__.local.shape = {.x=5, .y=4, .z=2};
__.local.coord = {.x=1, .y=0, .z=1};

__.block.shape = {.x=54, .y=66, .z=130};
__.block.coord = {.x=52, .y=0, .z=128};
__.block.elems = 463320;

=======================
__.world.size = 40;
__.world.rank = 10;

__.nodes.shape = {.x=256, .y=256, .z=256, .t=20};
__.nodes.bound = {.x=3.141593, .y=3.141593, .z=3.141593, .t=0.010000};
__.nodes.steps = {.x=0.012272, .y=0.012272, .z=0.012272, .t=0.000500};

__.param.period = {.x=1, .y=0, .z=0};
__.param.a = {.x=2.000000, .y=1.000000, .z=1.000000, .t=2.449490};
__.param.b = {.x=0.000000, .y=0.000000, .z=0.000000, .t=7.853982};

__.local.rank = 10;
__.local.shape = {.x=5, .y=4, .z=2};
__.local.coord = {.x=1, .y=1, .z=0};

__.block.shape = {.x=54, .y=66, .z=130};
__.block.coord = {.x=52, .y=64, .z=0};
__.block.elems = 463320;

=======================
__.world.size = 40;
__.world.rank = 11;

__.nodes.shape = {.x=256, .y=256, .z=256, .t=20};
__.nodes.bound = {.x=3.141593, .y=3.141593, .z=3.141593, .t=0.010000};
__.nodes.steps = {.x=0.012272, .y=0.012272, .z=0.012272, .t=0.000500};

__.param.period = {.x=1, .y=0, .z=0};
__.param.a = {.x=2.000000, .y=1.000000, .z=1.000000, .t=2.449490};
__.param.b = {.x=0.000000, .y=0.000000, .z=0.000000, .t=7.853982};

__.local.rank = 11;
__.local.shape = {.x=5, .y=4, .z=2};
__.local.coord = {.x=1, .y=1, .z=1};

__.block.shape = {.x=54, .y=66, .z=130};
__.block.coord = {.x=52, .y=64, .z=128};
__.block.elems = 463320;

=======================
__.world.size = 40;
__.world.rank = 12;

__.nodes.shape = {.x=256, .y=256, .z=256, .t=20};
__.nodes.bound = {.x=3.141593, .y=3.141593, .z=3.141593, .t=0.010000};
__.nodes.steps = {.x=0.012272, .y=0.012272, .z=0.012272, .t=0.000500};

__.param.period = {.x=1, .y=0, .z=0};
__.param.a = {.x=2.000000, .y=1.000000, .z=1.000000, .t=2.449490};
__.param.b = {.x=0.000000, .y=0.000000, .z=0.000000, .t=7.853982};

__.local.rank = 12;
__.local.shape = {.x=5, .y=4, .z=2};
__.local.coord = {.x=1, .y=2, .z=0};

__.block.shape = {.x=54, .y=66, .z=130};
__.block.coord = {.x=52, .y=128, .z=0};
__.block.elems = 463320;

=======================
__.world.size = 40;
__.world.rank = 13;

__.nodes.shape = {.x=256, .y=256, .z=256, .t=20};
__.nodes.bound = {.x=3.141593, .y=3.141593, .z=3.141593, .t=0.010000};
__.nodes.steps = {.x=0.012272, .y=0.012272, .z=0.012272, .t=0.000500};

__.param.period = {.x=1, .y=0, .z=0};
__.param.a = {.x=2.000000, .y=1.000000, .z=1.000000, .t=2.449490};
__.param.b = {.x=0.000000, .y=0.000000, .z=0.000000, .t=7.853982};

__.local.rank = 13;
__.local.shape = {.x=5, .y=4, .z=2};
__.local.coord = {.x=1, .y=2, .z=1};

__.block.shape = {.x=54, .y=66, .z=130};
__.block.coord = {.x=52, .y=128, .z=128};
__.block.elems = 463320;

=======================
__.world.size = 40;
__.world.rank = 14;

__.nodes.shape = {.x=256, .y=256, .z=256, .t=20};
__.nodes.bound = {.x=3.141593, .y=3.141593, .z=3.141593, .t=0.010000};
__.nodes.steps = {.x=0.012272, .y=0.012272, .z=0.012272, .t=0.000500};

__.param.period = {.x=1, .y=0, .z=0};
__.param.a = {.x=2.000000, .y=1.000000, .z=1.000000, .t=2.449490};
__.param.b = {.x=0.000000, .y=0.000000, .z=0.000000, .t=7.853982};

__.local.rank = 14;
__.local.shape = {.x=5, .y=4, .z=2};
__.local.coord = {.x=1, .y=3, .z=0};

__.block.shape = {.x=54, .y=66, .z=130};
__.block.coord = {.x=52, .y=192, .z=0};
__.block.elems = 463320;

=======================
__.world.size = 40;
__.world.rank = 15;

__.nodes.shape = {.x=256, .y=256, .z=256, .t=20};
__.nodes.bound = {.x=3.141593, .y=3.141593, .z=3.141593, .t=0.010000};
__.nodes.steps = {.x=0.012272, .y=0.012272, .z=0.012272, .t=0.000500};

__.param.period = {.x=1, .y=0, .z=0};
__.param.a = {.x=2.000000, .y=1.000000, .z=1.000000, .t=2.449490};
__.param.b = {.x=0.000000, .y=0.000000, .z=0.000000, .t=7.853982};

__.local.rank = 15;
__.local.shape = {.x=5, .y=4, .z=2};
__.local.coord = {.x=1, .y=3, .z=1};

__.block.shape = {.x=54, .y=66, .z=130};
__.block.coord = {.x=52, .y=192, .z=128};
__.block.elems = 463320;

=======================
__.world.size = 40;
__.world.rank = 16;

__.nodes.shape = {.x=256, .y=256, .z=256, .t=20};
__.nodes.bound = {.x=3.141593, .y=3.141593, .z=3.141593, .t=0.010000};
__.nodes.steps = {.x=0.012272, .y=0.012272, .z=0.012272, .t=0.000500};

__.param.period = {.x=1, .y=0, .z=0};
__.param.a = {.x=2.000000, .y=1.000000, .z=1.000000, .t=2.449490};
__.param.b = {.x=0.000000, .y=0.000000, .z=0.000000, .t=7.853982};

__.local.rank = 16;
__.local.shape = {.x=5, .y=4, .z=2};
__.local.coord = {.x=2, .y=0, .z=0};

__.block.shape = {.x=54, .y=66, .z=130};
__.block.coord = {.x=104, .y=0, .z=0};
__.block.elems = 463320;

=======================
__.world.size = 40;
__.world.rank = 17;

__.nodes.shape = {.x=256, .y=256, .z=256, .t=20};
__.nodes.bound = {.x=3.141593, .y=3.141593, .z=3.141593, .t=0.010000};
__.nodes.steps = {.x=0.012272, .y=0.012272, .z=0.012272, .t=0.000500};

__.param.period = {.x=1, .y=0, .z=0};
__.param.a = {.x=2.000000, .y=1.000000, .z=1.000000, .t=2.449490};
__.param.b = {.x=0.000000, .y=0.000000, .z=0.000000, .t=7.853982};

__.local.rank = 17;
__.local.shape = {.x=5, .y=4, .z=2};
__.local.coord = {.x=2, .y=0, .z=1};

__.block.shape = {.x=54, .y=66, .z=130};
__.block.coord = {.x=104, .y=0, .z=128};
__.block.elems = 463320;

=======================
__.world.size = 40;
__.world.rank = 18;

__.nodes.shape = {.x=256, .y=256, .z=256, .t=20};
__.nodes.bound = {.x=3.141593, .y=3.141593, .z=3.141593, .t=0.010000};
__.nodes.steps = {.x=0.012272, .y=0.012272, .z=0.012272, .t=0.000500};

__.param.period = {.x=1, .y=0, .z=0};
__.param.a = {.x=2.000000, .y=1.000000, .z=1.000000, .t=2.449490};
__.param.b = {.x=0.000000, .y=0.000000, .z=0.000000, .t=7.853982};

__.local.rank = 18;
__.local.shape = {.x=5, .y=4, .z=2};
__.local.coord = {.x=2, .y=1, .z=0};

__.block.shape = {.x=54, .y=66, .z=130};
__.block.coord = {.x=104, .y=64, .z=0};
__.block.elems = 463320;

=======================
__.world.size = 40;
__.world.rank = 0;

__.nodes.shape = {.x=256, .y=256, .z=256, .t=20};
__.nodes.bound = {.x=3.141593, .y=3.141593, .z=3.141593, .t=0.010000};
__.nodes.steps = {.x=0.012272, .y=0.012272, .z=0.012272, .t=0.000500};

__.param.period = {.x=1, .y=0, .z=0};
__.param.a = {.x=2.000000, .y=1.000000, .z=1.000000, .t=2.449490};
__.param.b = {.x=0.000000, .y=0.000000, .z=0.000000, .t=7.853982};

__.local.rank = 0;
__.local.shape = {.x=5, .y=4, .z=2};
__.local.coord = {.x=0, .y=0, .z=0};

__.block.shape = {.x=54, .y=66, .z=130};
__.block.coord = {.x=0, .y=0, .z=0};
__.block.elems = 463320;

=======================
__.world.size = 40;
__.world.rank = 1;

__.nodes.shape = {.x=256, .y=256, .z=256, .t=20};
__.nodes.bound = {.x=3.141593, .y=3.141593, .z=3.141593, .t=0.010000};
__.nodes.steps = {.x=0.012272, .y=0.012272, .z=0.012272, .t=0.000500};

__.param.period = {.x=1, .y=0, .z=0};
__.param.a = {.x=2.000000, .y=1.000000, .z=1.000000, .t=2.449490};
__.param.b = {.x=0.000000, .y=0.000000, .z=0.000000, .t=7.853982};

__.local.rank = 1;
__.local.shape = {.x=5, .y=4, .z=2};
__.local.coord = {.x=0, .y=0, .z=1};

__.block.shape = {.x=54, .y=66, .z=130};
__.block.coord = {.x=0, .y=0, .z=128};
__.block.elems = 463320;

=======================
__.world.size = 40;
__.world.rank = 2;

__.nodes.shape = {.x=256, .y=256, .z=256, .t=20};
__.nodes.bound = {.x=3.141593, .y=3.141593, .z=3.141593, .t=0.010000};
__.nodes.steps = {.x=0.012272, .y=0.012272, .z=0.012272, .t=0.000500};

__.param.period = {.x=1, .y=0, .z=0};
__.param.a = {.x=2.000000, .y=1.000000, .z=1.000000, .t=2.449490};
__.param.b = {.x=0.000000, .y=0.000000, .z=0.000000, .t=7.853982};

__.local.rank = 2;
__.local.shape = {.x=5, .y=4, .z=2};
__.local.coord = {.x=0, .y=1, .z=0};

__.block.shape = {.x=54, .y=66, .z=130};
__.block.coord = {.x=0, .y=64, .z=0};
__.block.elems = 463320;

=======================
__.world.size = 40;
__.world.rank = 39;

__.nodes.shape = {.x=256, .y=256, .z=256, .t=20};
__.nodes.bound = {.x=3.141593, .y=3.141593, .z=3.141593, .t=0.010000};
__.nodes.steps = {.x=0.012272, .y=0.012272, .z=0.012272, .t=0.000500};

__.param.period = {.x=1, .y=0, .z=0};
__.param.a = {.x=2.000000, .y=1.000000, .z=1.000000, .t=2.449490};
__.param.b = {.x=0.000000, .y=0.000000, .z=0.000000, .t=7.853982};

__.local.rank = 39;
__.local.shape = {.x=5, .y=4, .z=2};
__.local.coord = {.x=4, .y=3, .z=1};

__.block.shape = {.x=50, .y=66, .z=130};
__.block.coord = {.x=208, .y=192, .z=128};
__.block.elems = 429000;

=======================
__.world.size = 40;
__.world.rank = 20;

__.nodes.shape = {.x=256, .y=256, .z=256, .t=20};
__.nodes.bound = {.x=3.141593, .y=3.141593, .z=3.141593, .t=0.010000};
__.nodes.steps = {.x=0.012272, .y=0.012272, .z=0.012272, .t=0.000500};

__.param.period = {.x=1, .y=0, .z=0};
__.param.a = {.x=2.000000, .y=1.000000, .z=1.000000, .t=2.449490};
__.param.b = {.x=0.000000, .y=0.000000, .z=0.000000, .t=7.853982};

__.local.rank = 20;
__.local.shape = {.x=5, .y=4, .z=2};
__.local.coord = {.x=2, .y=2, .z=0};

__.block.shape = {.x=54, .y=66, .z=130};
__.block.coord = {.x=104, .y=128, .z=0};
__.block.elems = 463320;

=======================
__.world.size = 40;
__.world.rank = 21;

__.nodes.shape = {.x=256, .y=256, .z=256, .t=20};
__.nodes.bound = {.x=3.141593, .y=3.141593, .z=3.141593, .t=0.010000};
__.nodes.steps = {.x=0.012272, .y=0.012272, .z=0.012272, .t=0.000500};

__.param.period = {.x=1, .y=0, .z=0};
__.param.a = {.x=2.000000, .y=1.000000, .z=1.000000, .t=2.449490};
__.param.b = {.x=0.000000, .y=0.000000, .z=0.000000, .t=7.853982};

__.local.rank = 21;
__.local.shape = {.x=5, .y=4, .z=2};
__.local.coord = {.x=2, .y=2, .z=1};

__.block.shape = {.x=54, .y=66, .z=130};
__.block.coord = {.x=104, .y=128, .z=128};
__.block.elems = 463320;

=======================
__.world.size = 40;
__.world.rank = 22;

__.nodes.shape = {.x=256, .y=256, .z=256, .t=20};
__.nodes.bound = {.x=3.141593, .y=3.141593, .z=3.141593, .t=0.010000};
__.nodes.steps = {.x=0.012272, .y=0.012272, .z=0.012272, .t=0.000500};

__.param.period = {.x=1, .y=0, .z=0};
__.param.a = {.x=2.000000, .y=1.000000, .z=1.000000, .t=2.449490};
__.param.b = {.x=0.000000, .y=0.000000, .z=0.000000, .t=7.853982};

__.local.rank = 22;
__.local.shape = {.x=5, .y=4, .z=2};
__.local.coord = {.x=2, .y=3, .z=0};

__.block.shape = {.x=54, .y=66, .z=130};
__.block.coord = {.x=104, .y=192, .z=0};
__.block.elems = 463320;

=======================
__.world.size = 40;
__.world.rank = 23;

__.nodes.shape = {.x=256, .y=256, .z=256, .t=20};
__.nodes.bound = {.x=3.141593, .y=3.141593, .z=3.141593, .t=0.010000};
__.nodes.steps = {.x=0.012272, .y=0.012272, .z=0.012272, .t=0.000500};

__.param.period = {.x=1, .y=0, .z=0};
__.param.a = {.x=2.000000, .y=1.000000, .z=1.000000, .t=2.449490};
__.param.b = {.x=0.000000, .y=0.000000, .z=0.000000, .t=7.853982};

__.local.rank = 23;
__.local.shape = {.x=5, .y=4, .z=2};
__.local.coord = {.x=2, .y=3, .z=1};

__.block.shape = {.x=54, .y=66, .z=130};
__.block.coord = {.x=104, .y=192, .z=128};
__.block.elems = 463320;

=======================
__.world.size = 40;
__.world.rank = 24;

__.nodes.shape = {.x=256, .y=256, .z=256, .t=20};
__.nodes.bound = {.x=3.141593, .y=3.141593, .z=3.141593, .t=0.010000};
__.nodes.steps = {.x=0.012272, .y=0.012272, .z=0.012272, .t=0.000500};

__.param.period = {.x=1, .y=0, .z=0};
__.param.a = {.x=2.000000, .y=1.000000, .z=1.000000, .t=2.449490};
__.param.b = {.x=0.000000, .y=0.000000, .z=0.000000, .t=7.853982};

__.local.rank = 24;
__.local.shape = {.x=5, .y=4, .z=2};
__.local.coord = {.x=3, .y=0, .z=0};

__.block.shape = {.x=54, .y=66, .z=130};
__.block.coord = {.x=156, .y=0, .z=0};
__.block.elems = 463320;

=======================
__.world.size = 40;
__.world.rank = 25;

__.nodes.shape = {.x=256, .y=256, .z=256, .t=20};
__.nodes.bound = {.x=3.141593, .y=3.141593, .z=3.141593, .t=0.010000};
__.nodes.steps = {.x=0.012272, .y=0.012272, .z=0.012272, .t=0.000500};

__.param.period = {.x=1, .y=0, .z=0};
__.param.a = {.x=2.000000, .y=1.000000, .z=1.000000, .t=2.449490};
__.param.b = {.x=0.000000, .y=0.000000, .z=0.000000, .t=7.853982};

__.local.rank = 25;
__.local.shape = {.x=5, .y=4, .z=2};
__.local.coord = {.x=3, .y=0, .z=1};

__.block.shape = {.x=54, .y=66, .z=130};
__.block.coord = {.x=156, .y=0, .z=128};
__.block.elems = 463320;

=======================
__.world.size = 40;
__.world.rank = 26;

__.nodes.shape = {.x=256, .y=256, .z=256, .t=20};
__.nodes.bound = {.x=3.141593, .y=3.141593, .z=3.141593, .t=0.010000};
__.nodes.steps = {.x=0.012272, .y=0.012272, .z=0.012272, .t=0.000500};

__.param.period = {.x=1, .y=0, .z=0};
__.param.a = {.x=2.000000, .y=1.000000, .z=1.000000, .t=2.449490};
__.param.b = {.x=0.000000, .y=0.000000, .z=0.000000, .t=7.853982};

__.local.rank = 26;
__.local.shape = {.x=5, .y=4, .z=2};
__.local.coord = {.x=3, .y=1, .z=0};

__.block.shape = {.x=54, .y=66, .z=130};
__.block.coord = {.x=156, .y=64, .z=0};
__.block.elems = 463320;

=======================
__.world.size = 40;
__.world.rank = 27;

__.nodes.shape = {.x=256, .y=256, .z=256, .t=20};
__.nodes.bound = {.x=3.141593, .y=3.141593, .z=3.141593, .t=0.010000};
__.nodes.steps = {.x=0.012272, .y=0.012272, .z=0.012272, .t=0.000500};

__.param.period = {.x=1, .y=0, .z=0};
__.param.a = {.x=2.000000, .y=1.000000, .z=1.000000, .t=2.449490};
__.param.b = {.x=0.000000, .y=0.000000, .z=0.000000, .t=7.853982};

__.local.rank = 27;
__.local.shape = {.x=5, .y=4, .z=2};
__.local.coord = {.x=3, .y=1, .z=1};

__.block.shape = {.x=54, .y=66, .z=130};
__.block.coord = {.x=156, .y=64, .z=128};
__.block.elems = 463320;

=======================
__.world.size = 40;
__.world.rank = 28;

__.nodes.shape = {.x=256, .y=256, .z=256, .t=20};
__.nodes.bound = {.x=3.141593, .y=3.141593, .z=3.141593, .t=0.010000};
__.nodes.steps = {.x=0.012272, .y=0.012272, .z=0.012272, .t=0.000500};

__.param.period = {.x=1, .y=0, .z=0};
__.param.a = {.x=2.000000, .y=1.000000, .z=1.000000, .t=2.449490};
__.param.b = {.x=0.000000, .y=0.000000, .z=0.000000, .t=7.853982};

__.local.rank = 28;
__.local.shape = {.x=5, .y=4, .z=2};
__.local.coord = {.x=3, .y=2, .z=0};

__.block.shape = {.x=54, .y=66, .z=130};
__.block.coord = {.x=156, .y=128, .z=0};
__.block.elems = 463320;

=======================
__.world.size = 40;
__.world.rank = 29;

__.nodes.shape = {.x=256, .y=256, .z=256, .t=20};
__.nodes.bound = {.x=3.141593, .y=3.141593, .z=3.141593, .t=0.010000};
__.nodes.steps = {.x=0.012272, .y=0.012272, .z=0.012272, .t=0.000500};

__.param.period = {.x=1, .y=0, .z=0};
__.param.a = {.x=2.000000, .y=1.000000, .z=1.000000, .t=2.449490};
__.param.b = {.x=0.000000, .y=0.000000, .z=0.000000, .t=7.853982};

__.local.rank = 29;
__.local.shape = {.x=5, .y=4, .z=2};
__.local.coord = {.x=3, .y=2, .z=1};

__.block.shape = {.x=54, .y=66, .z=130};
__.block.coord = {.x=156, .y=128, .z=128};
__.block.elems = 463320;

=======================
__.world.size = 40;
__.world.rank = 30;

__.nodes.shape = {.x=256, .y=256, .z=256, .t=20};
__.nodes.bound = {.x=3.141593, .y=3.141593, .z=3.141593, .t=0.010000};
__.nodes.steps = {.x=0.012272, .y=0.012272, .z=0.012272, .t=0.000500};

__.param.period = {.x=1, .y=0, .z=0};
__.param.a = {.x=2.000000, .y=1.000000, .z=1.000000, .t=2.449490};
__.param.b = {.x=0.000000, .y=0.000000, .z=0.000000, .t=7.853982};

__.local.rank = 30;
__.local.shape = {.x=5, .y=4, .z=2};
__.local.coord = {.x=3, .y=3, .z=0};

__.block.shape = {.x=54, .y=66, .z=130};
__.block.coord = {.x=156, .y=192, .z=0};
__.block.elems = 463320;

=======================
__.world.size = 40;
__.world.rank = 31;

__.nodes.shape = {.x=256, .y=256, .z=256, .t=20};
__.nodes.bound = {.x=3.141593, .y=3.141593, .z=3.141593, .t=0.010000};
__.nodes.steps = {.x=0.012272, .y=0.012272, .z=0.012272, .t=0.000500};

__.param.period = {.x=1, .y=0, .z=0};
__.param.a = {.x=2.000000, .y=1.000000, .z=1.000000, .t=2.449490};
__.param.b = {.x=0.000000, .y=0.000000, .z=0.000000, .t=7.853982};

__.local.rank = 31;
__.local.shape = {.x=5, .y=4, .z=2};
__.local.coord = {.x=3, .y=3, .z=1};

__.block.shape = {.x=54, .y=66, .z=130};
__.block.coord = {.x=156, .y=192, .z=128};
__.block.elems = 463320;

=======================
__.world.size = 40;
__.world.rank = 32;

__.nodes.shape = {.x=256, .y=256, .z=256, .t=20};
__.nodes.bound = {.x=3.141593, .y=3.141593, .z=3.141593, .t=0.010000};
__.nodes.steps = {.x=0.012272, .y=0.012272, .z=0.012272, .t=0.000500};

__.param.period = {.x=1, .y=0, .z=0};
__.param.a = {.x=2.000000, .y=1.000000, .z=1.000000, .t=2.449490};
__.param.b = {.x=0.000000, .y=0.000000, .z=0.000000, .t=7.853982};

__.local.rank = 32;
__.local.shape = {.x=5, .y=4, .z=2};
__.local.coord = {.x=4, .y=0, .z=0};

__.block.shape = {.x=50, .y=66, .z=130};
__.block.coord = {.x=208, .y=0, .z=0};
__.block.elems = 429000;

=======================
__.world.size = 40;
__.world.rank = 33;

__.nodes.shape = {.x=256, .y=256, .z=256, .t=20};
__.nodes.bound = {.x=3.141593, .y=3.141593, .z=3.141593, .t=0.010000};
__.nodes.steps = {.x=0.012272, .y=0.012272, .z=0.012272, .t=0.000500};

__.param.period = {.x=1, .y=0, .z=0};
__.param.a = {.x=2.000000, .y=1.000000, .z=1.000000, .t=2.449490};
__.param.b = {.x=0.000000, .y=0.000000, .z=0.000000, .t=7.853982};

__.local.rank = 33;
__.local.shape = {.x=5, .y=4, .z=2};
__.local.coord = {.x=4, .y=0, .z=1};

__.block.shape = {.x=50, .y=66, .z=130};
__.block.coord = {.x=208, .y=0, .z=128};
__.block.elems = 429000;

=======================
__.world.size = 40;
__.world.rank = 34;

__.nodes.shape = {.x=256, .y=256, .z=256, .t=20};
__.nodes.bound = {.x=3.141593, .y=3.141593, .z=3.141593, .t=0.010000};
__.nodes.steps = {.x=0.012272, .y=0.012272, .z=0.012272, .t=0.000500};

__.param.period = {.x=1, .y=0, .z=0};
__.param.a = {.x=2.000000, .y=1.000000, .z=1.000000, .t=2.449490};
__.param.b = {.x=0.000000, .y=0.000000, .z=0.000000, .t=7.853982};

__.local.rank = 34;
__.local.shape = {.x=5, .y=4, .z=2};
__.local.coord = {.x=4, .y=1, .z=0};

__.block.shape = {.x=50, .y=66, .z=130};
__.block.coord = {.x=208, .y=64, .z=0};
__.block.elems = 429000;

=======================
__.world.size = 40;
__.world.rank = 35;

__.nodes.shape = {.x=256, .y=256, .z=256, .t=20};
__.nodes.bound = {.x=3.141593, .y=3.141593, .z=3.141593, .t=0.010000};
__.nodes.steps = {.x=0.012272, .y=0.012272, .z=0.012272, .t=0.000500};

__.param.period = {.x=1, .y=0, .z=0};
__.param.a = {.x=2.000000, .y=1.000000, .z=1.000000, .t=2.449490};
__.param.b = {.x=0.000000, .y=0.000000, .z=0.000000, .t=7.853982};

__.local.rank = 35;
__.local.shape = {.x=5, .y=4, .z=2};
__.local.coord = {.x=4, .y=1, .z=1};

__.block.shape = {.x=50, .y=66, .z=130};
__.block.coord = {.x=208, .y=64, .z=128};
__.block.elems = 429000;

=======================
__.world.size = 40;
__.world.rank = 36;

__.nodes.shape = {.x=256, .y=256, .z=256, .t=20};
__.nodes.bound = {.x=3.141593, .y=3.141593, .z=3.141593, .t=0.010000};
__.nodes.steps = {.x=0.012272, .y=0.012272, .z=0.012272, .t=0.000500};

__.param.period = {.x=1, .y=0, .z=0};
__.param.a = {.x=2.000000, .y=1.000000, .z=1.000000, .t=2.449490};
__.param.b = {.x=0.000000, .y=0.000000, .z=0.000000, .t=7.853982};

__.local.rank = 36;
__.local.shape = {.x=5, .y=4, .z=2};
__.local.coord = {.x=4, .y=2, .z=0};

__.block.shape = {.x=50, .y=66, .z=130};
__.block.coord = {.x=208, .y=128, .z=0};
__.block.elems = 429000;

=======================
__.world.size = 40;
__.world.rank = 37;

__.nodes.shape = {.x=256, .y=256, .z=256, .t=20};
__.nodes.bound = {.x=3.141593, .y=3.141593, .z=3.141593, .t=0.010000};
__.nodes.steps = {.x=0.012272, .y=0.012272, .z=0.012272, .t=0.000500};

__.param.period = {.x=1, .y=0, .z=0};
__.param.a = {.x=2.000000, .y=1.000000, .z=1.000000, .t=2.449490};
__.param.b = {.x=0.000000, .y=0.000000, .z=0.000000, .t=7.853982};

__.local.rank = 37;
__.local.shape = {.x=5, .y=4, .z=2};
__.local.coord = {.x=4, .y=2, .z=1};

__.block.shape = {.x=50, .y=66, .z=130};
__.block.coord = {.x=208, .y=128, .z=128};
__.block.elems = 429000;

=======================
__.world.size = 40;
__.world.rank = 38;

__.nodes.shape = {.x=256, .y=256, .z=256, .t=20};
__.nodes.bound = {.x=3.141593, .y=3.141593, .z=3.141593, .t=0.010000};
__.nodes.steps = {.x=0.012272, .y=0.012272, .z=0.012272, .t=0.000500};

__.param.period = {.x=1, .y=0, .z=0};
__.param.a = {.x=2.000000, .y=1.000000, .z=1.000000, .t=2.449490};
__.param.b = {.x=0.000000, .y=0.000000, .z=0.000000, .t=7.853982};

__.local.rank = 38;
__.local.shape = {.x=5, .y=4, .z=2};
__.local.coord = {.x=4, .y=3, .z=0};

__.block.shape = {.x=50, .y=66, .z=130};
__.block.coord = {.x=208, .y=192, .z=0};
__.block.elems = 429000;

=======================
__.world.size = 40;
__.world.rank = 19;

__.nodes.shape = {.x=256, .y=256, .z=256, .t=20};
__.nodes.bound = {.x=3.141593, .y=3.141593, .z=3.141593, .t=0.010000};
__.nodes.steps = {.x=0.012272, .y=0.012272, .z=0.012272, .t=0.000500};

__.param.period = {.x=1, .y=0, .z=0};
__.param.a = {.x=2.000000, .y=1.000000, .z=1.000000, .t=2.449490};
__.param.b = {.x=0.000000, .y=0.000000, .z=0.000000, .t=7.853982};

__.local.rank = 19;
__.local.shape = {.x=5, .y=4, .z=2};
__.local.coord = {.x=2, .y=1, .z=1};

__.block.shape = {.x=54, .y=66, .z=130};
__.block.coord = {.x=104, .y=64, .z=128};
__.block.elems = 463320;

__TRIALS__.append((6.365451e-01, [0.000000e+00, 2.814293e-11, 1.125714e-10, 2.532855e-10, 4.502845e-10, 7.035680e-10, 1.013135e-09, 1.378985e-09, 1.801117e-09, 2.279529e-09, 2.814220e-09, 3.405188e-09, 4.052432e-09, 4.755950e-09, 5.515739e-09, 6.331797e-09, 7.204122e-09, 8.132712e-09, 9.117562e-09, 1.015867e-08, 1.125604e-08, ]))
__TRIALS__.append((3.571847e-01, [0.000000e+00, 2.814293e-11, 1.125714e-10, 2.532855e-10, 4.502845e-10, 7.035680e-10, 1.013135e-09, 1.378985e-09, 1.801117e-09, 2.279529e-09, 2.814220e-09, 3.405188e-09, 4.052432e-09, 4.755950e-09, 5.515739e-09, 6.331797e-09, 7.204122e-09, 8.132712e-09, 9.117562e-09, 1.015867e-08, 1.125604e-08, ]))
__TRIALS__.append((3.485725e-01, [0.000000e+00, 2.814293e-11, 1.125714e-10, 2.532855e-10, 4.502845e-10, 7.035680e-10, 1.013135e-09, 1.378985e-09, 1.801117e-09, 2.279529e-09, 2.814220e-09, 3.405188e-09, 4.052432e-09, 4.755950e-09, 5.515739e-09, 6.331797e-09, 7.204122e-09, 8.132712e-09, 9.117562e-09, 1.015867e-08, 1.125604e-08, ]))
__TRIALS__.append((3.386094e-01, [0.000000e+00, 2.814293e-11, 1.125714e-10, 2.532855e-10, 4.502845e-10, 7.035680e-10, 1.013135e-09, 1.378985e-09, 1.801117e-09, 2.279529e-09, 2.814220e-09, 3.405188e-09, 4.052432e-09, 4.755950e-09, 5.515739e-09, 6.331797e-09, 7.204122e-09, 8.132712e-09, 9.117562e-09, 1.015867e-08, 1.125604e-08, ]))
__TRIALS__.append((3.635442e-01, [0.000000e+00, 2.814293e-11, 1.125714e-10, 2.532855e-10, 4.502845e-10, 7.035680e-10, 1.013135e-09, 1.378985e-09, 1.801117e-09, 2.279529e-09, 2.814220e-09, 3.405188e-09, 4.052432e-09, 4.755950e-09, 5.515739e-09, 6.331797e-09, 7.204122e-09, 8.132712e-09, 9.117562e-09, 1.015867e-08, 1.125604e-08, ]))
__TRIALS__.append((3.579843e-01, [0.000000e+00, 2.814293e-11, 1.125714e-10, 2.532855e-10, 4.502845e-10, 7.035680e-10, 1.013135e-09, 1.378985e-09, 1.801117e-09, 2.279529e-09, 2.814220e-09, 3.405188e-09, 4.052432e-09, 4.755950e-09, 5.515739e-09, 6.331797e-09, 7.204122e-09, 8.132712e-09, 9.117562e-09, 1.015867e-08, 1.125604e-08, ]))
__TRIALS__.append((3.327620e-01, [0.000000e+00, 2.814293e-11, 1.125714e-10, 2.532855e-10, 4.502845e-10, 7.035680e-10, 1.013135e-09, 1.378985e-09, 1.801117e-09, 2.279529e-09, 2.814220e-09, 3.405188e-09, 4.052432e-09, 4.755950e-09, 5.515739e-09, 6.331797e-09, 7.204122e-09, 8.132712e-09, 9.117562e-09, 1.015867e-08, 1.125604e-08, ]))
__TRIALS__.append((3.359789e-01, [0.000000e+00, 2.814293e-11, 1.125714e-10, 2.532855e-10, 4.502845e-10, 7.035680e-10, 1.013135e-09, 1.378985e-09, 1.801117e-09, 2.279529e-09, 2.814220e-09, 3.405188e-09, 4.052432e-09, 4.755950e-09, 5.515739e-09, 6.331797e-09, 7.204122e-09, 8.132712e-09, 9.117562e-09, 1.015867e-08, 1.125604e-08, ]))
__TRIALS__.append((3.343415e-01, [0.000000e+00, 2.814293e-11, 1.125714e-10, 2.532855e-10, 4.502845e-10, 7.035680e-10, 1.013135e-09, 1.378985e-09, 1.801117e-09, 2.279529e-09, 2.814220e-09, 3.405188e-09, 4.052432e-09, 4.755950e-09, 5.515739e-09, 6.331797e-09, 7.204122e-09, 8.132712e-09, 9.117562e-09, 1.015867e-08, 1.125604e-08, ]))
__TRIALS__.append((3.412891e-01, [0.000000e+00, 2.814293e-11, 1.125714e-10, 2.532855e-10, 4.502845e-10, 7.035680e-10, 1.013135e-09, 1.378985e-09, 1.801117e-09, 2.279529e-09, 2.814220e-09, 3.405188e-09, 4.052432e-09, 4.755950e-09, 5.515739e-09, 6.331797e-09, 7.204122e-09, 8.132712e-09, 9.117562e-09, 1.015867e-08, 1.125604e-08, ]))


PS:

Read file <main.836946.err> for stderr output of this job.

