__PARAMS__ = {'P': 128, 'O': 4, 'L': 1.000000e+00, 'T': 1.000000e-02, 'N': 256, 'K': 20}
=======================
__.world.size = 128;
__.world.rank = 0;

__.nodes.shape = {.x=256, .y=256, .z=256, .t=20};
__.nodes.bound = {.x=1.000000, .y=1.000000, .z=1.000000, .t=0.010000};
__.nodes.steps = {.x=0.003906, .y=0.003906, .z=0.003906, .t=0.000500};

__.param.period = {.x=1, .y=0, .z=0};
__.param.a = {.x=6.283185, .y=3.141593, .z=3.141593, .t=7.695299};
__.param.b = {.x=0.000000, .y=0.000000, .z=0.000000, .t=7.853982};

__.local.rank = 0;
__.local.shape = {.x=8, .y=4, .z=4};
__.local.coord = {.x=0, .y=0, .z=0};

__.block.shape = {.x=34, .y=66, .z=66};
__.block.coord = {.x=0, .y=0, .z=0};
__.block.elems = 148104;

=======================
__.world.size = 128;
__.world.rank = 1;

__.nodes.shape = {.x=256, .y=256, .z=256, .t=20};
__.nodes.bound = {.x=1.000000, .y=1.000000, .z=1.000000, .t=0.010000};
__.nodes.steps = {.x=0.003906, .y=0.003906, .z=0.003906, .t=0.000500};

__.param.period = {.x=1, .y=0, .z=0};
__.param.a = {.x=6.283185, .y=3.141593, .z=3.141593, .t=7.695299};
__.param.b = {.x=0.000000, .y=0.000000, .z=0.000000, .t=7.853982};

__.local.rank = 1;
__.local.shape = {.x=8, .y=4, .z=4};
__.local.coord = {.x=0, .y=0, .z=1};

__.block.shape = {.x=34, .y=66, .z=66};
__.block.coord = {.x=0, .y=0, .z=64};
__.block.elems = 148104;

=======================
__.world.size = 128;
__.world.rank = 2;

__.nodes.shape = {.x=256, .y=256, .z=256, .t=20};
__.nodes.bound = {.x=1.000000, .y=1.000000, .z=1.000000, .t=0.010000};
__.nodes.steps = {.x=0.003906, .y=0.003906, .z=0.003906, .t=0.000500};

__.param.period = {.x=1, .y=0, .z=0};
__.param.a = {.x=6.283185, .y=3.141593, .z=3.141593, .t=7.695299};
__.param.b = {.x=0.000000, .y=0.000000, .z=0.000000, .t=7.853982};

__.local.rank = 2;
__.local.shape = {.x=8, .y=4, .z=4};
__.local.coord = {.x=0, .y=0, .z=2};

__.block.shape = {.x=34, .y=66, .z=66};
__.block.coord = {.x=0, .y=0, .z=128};
__.block.elems = 148104;

=======================
__.world.size = 128;
__.world.rank = 3;

__.nodes.shape = {.x=256, .y=256, .z=256, .t=20};
__.nodes.bound = {.x=1.000000, .y=1.000000, .z=1.000000, .t=0.010000};
__.nodes.steps = {.x=0.003906, .y=0.003906, .z=0.003906, .t=0.000500};

__.param.period = {.x=1, .y=0, .z=0};
__.param.a = {.x=6.283185, .y=3.141593, .z=3.141593, .t=7.695299};
__.param.b = {.x=0.000000, .y=0.000000, .z=0.000000, .t=7.853982};

__.local.rank = 3;
__.local.shape = {.x=8, .y=4, .z=4};
__.local.coord = {.x=0, .y=0, .z=3};

__.block.shape = {.x=34, .y=66, .z=66};
__.block.coord = {.x=0, .y=0, .z=192};
__.block.elems = 148104;

=======================
__.world.size = 128;
__.world.rank = 4;

__.nodes.shape = {.x=256, .y=256, .z=256, .t=20};
__.nodes.bound = {.x=1.000000, .y=1.000000, .z=1.000000, .t=0.010000};
__.nodes.steps = {.x=0.003906, .y=0.003906, .z=0.003906, .t=0.000500};

__.param.period = {.x=1, .y=0, .z=0};
__.param.a = {.x=6.283185, .y=3.141593, .z=3.141593, .t=7.695299};
__.param.b = {.x=0.000000, .y=0.000000, .z=0.000000, .t=7.853982};

__.local.rank = 4;
__.local.shape = {.x=8, .y=4, .z=4};
__.local.coord = {.x=0, .y=1, .z=0};

__.block.shape = {.x=34, .y=66, .z=66};
__.block.coord = {.x=0, .y=64, .z=0};
__.block.elems = 148104;

=======================
__.world.size = 128;
__.world.rank = 5;

__.nodes.shape = {.x=256, .y=256, .z=256, .t=20};
__.nodes.bound = {.x=1.000000, .y=1.000000, .z=1.000000, .t=0.010000};
__.nodes.steps = {.x=0.003906, .y=0.003906, .z=0.003906, .t=0.000500};

__.param.period = {.x=1, .y=0, .z=0};
__.param.a = {.x=6.283185, .y=3.141593, .z=3.141593, .t=7.695299};
__.param.b = {.x=0.000000, .y=0.000000, .z=0.000000, .t=7.853982};

__.local.rank = 5;
__.local.shape = {.x=8, .y=4, .z=4};
__.local.coord = {.x=0, .y=1, .z=1};

__.block.shape = {.x=34, .y=66, .z=66};
__.block.coord = {.x=0, .y=64, .z=64};
__.block.elems = 148104;

=======================
__.world.size = 128;
__.world.rank = 6;

__.nodes.shape = {.x=256, .y=256, .z=256, .t=20};
__.nodes.bound = {.x=1.000000, .y=1.000000, .z=1.000000, .t=0.010000};
__.nodes.steps = {.x=0.003906, .y=0.003906, .z=0.003906, .t=0.000500};

__.param.period = {.x=1, .y=0, .z=0};
__.param.a = {.x=6.283185, .y=3.141593, .z=3.141593, .t=7.695299};
__.param.b = {.x=0.000000, .y=0.000000, .z=0.000000, .t=7.853982};

__.local.rank = 6;
__.local.shape = {.x=8, .y=4, .z=4};
__.local.coord = {.x=0, .y=1, .z=2};

__.block.shape = {.x=34, .y=66, .z=66};
__.block.coord = {.x=0, .y=64, .z=128};
__.block.elems = 148104;

=======================
__.world.size = 128;
__.world.rank = 7;

__.nodes.shape = {.x=256, .y=256, .z=256, .t=20};
__.nodes.bound = {.x=1.000000, .y=1.000000, .z=1.000000, .t=0.010000};
__.nodes.steps = {.x=0.003906, .y=0.003906, .z=0.003906, .t=0.000500};

__.param.period = {.x=1, .y=0, .z=0};
__.param.a = {.x=6.283185, .y=3.141593, .z=3.141593, .t=7.695299};
__.param.b = {.x=0.000000, .y=0.000000, .z=0.000000, .t=7.853982};

__.local.rank = 7;
__.local.shape = {.x=8, .y=4, .z=4};
__.local.coord = {.x=0, .y=1, .z=3};

__.block.shape = {.x=34, .y=66, .z=66};
__.block.coord = {.x=0, .y=64, .z=192};
__.block.elems = 148104;

=======================
__.world.size = 128;
__.world.rank = 8;

__.nodes.shape = {.x=256, .y=256, .z=256, .t=20};
__.nodes.bound = {.x=1.000000, .y=1.000000, .z=1.000000, .t=0.010000};
__.nodes.steps = {.x=0.003906, .y=0.003906, .z=0.003906, .t=0.000500};

__.param.period = {.x=1, .y=0, .z=0};
__.param.a = {.x=6.283185, .y=3.141593, .z=3.141593, .t=7.695299};
__.param.b = {.x=0.000000, .y=0.000000, .z=0.000000, .t=7.853982};

__.local.rank = 8;
__.local.shape = {.x=8, .y=4, .z=4};
__.local.coord = {.x=0, .y=2, .z=0};

__.block.shape = {.x=34, .y=66, .z=66};
__.block.coord = {.x=0, .y=128, .z=0};
__.block.elems = 148104;

=======================
__.world.size = 128;
__.world.rank = 9;

__.nodes.shape = {.x=256, .y=256, .z=256, .t=20};
__.nodes.bound = {.x=1.000000, .y=1.000000, .z=1.000000, .t=0.010000};
__.nodes.steps = {.x=0.003906, .y=0.003906, .z=0.003906, .t=0.000500};

__.param.period = {.x=1, .y=0, .z=0};
__.param.a = {.x=6.283185, .y=3.141593, .z=3.141593, .t=7.695299};
__.param.b = {.x=0.000000, .y=0.000000, .z=0.000000, .t=7.853982};

__.local.rank = 9;
__.local.shape = {.x=8, .y=4, .z=4};
__.local.coord = {.x=0, .y=2, .z=1};

__.block.shape = {.x=34, .y=66, .z=66};
__.block.coord = {.x=0, .y=128, .z=64};
__.block.elems = 148104;

=======================
__.world.size = 128;
__.world.rank = 10;

__.nodes.shape = {.x=256, .y=256, .z=256, .t=20};
__.nodes.bound = {.x=1.000000, .y=1.000000, .z=1.000000, .t=0.010000};
__.nodes.steps = {.x=0.003906, .y=0.003906, .z=0.003906, .t=0.000500};

__.param.period = {.x=1, .y=0, .z=0};
__.param.a = {.x=6.283185, .y=3.141593, .z=3.141593, .t=7.695299};
__.param.b = {.x=0.000000, .y=0.000000, .z=0.000000, .t=7.853982};

__.local.rank = 10;
__.local.shape = {.x=8, .y=4, .z=4};
__.local.coord = {.x=0, .y=2, .z=2};

__.block.shape = {.x=34, .y=66, .z=66};
__.block.coord = {.x=0, .y=128, .z=128};
__.block.elems = 148104;

=======================
__.world.size = 128;
__.world.rank = 11;

__.nodes.shape = {.x=256, .y=256, .z=256, .t=20};
__.nodes.bound = {.x=1.000000, .y=1.000000, .z=1.000000, .t=0.010000};
__.nodes.steps = {.x=0.003906, .y=0.003906, .z=0.003906, .t=0.000500};

__.param.period = {.x=1, .y=0, .z=0};
__.param.a = {.x=6.283185, .y=3.141593, .z=3.141593, .t=7.695299};
__.param.b = {.x=0.000000, .y=0.000000, .z=0.000000, .t=7.853982};

__.local.rank = 11;
__.local.shape = {.x=8, .y=4, .z=4};
__.local.coord = {.x=0, .y=2, .z=3};

__.block.shape = {.x=34, .y=66, .z=66};
__.block.coord = {.x=0, .y=128, .z=192};
__.block.elems = 148104;

=======================
__.world.size = 128;
__.world.rank = 12;

__.nodes.shape = {.x=256, .y=256, .z=256, .t=20};
__.nodes.bound = {.x=1.000000, .y=1.000000, .z=1.000000, .t=0.010000};
__.nodes.steps = {.x=0.003906, .y=0.003906, .z=0.003906, .t=0.000500};

__.param.period = {.x=1, .y=0, .z=0};
__.param.a = {.x=6.283185, .y=3.141593, .z=3.141593, .t=7.695299};
__.param.b = {.x=0.000000, .y=0.000000, .z=0.000000, .t=7.853982};

__.local.rank = 12;
__.local.shape = {.x=8, .y=4, .z=4};
__.local.coord = {.x=0, .y=3, .z=0};

__.block.shape = {.x=34, .y=66, .z=66};
__.block.coord = {.x=0, .y=192, .z=0};
__.block.elems = 148104;

=======================
__.world.size = 128;
__.world.rank = 13;

__.nodes.shape = {.x=256, .y=256, .z=256, .t=20};
__.nodes.bound = {.x=1.000000, .y=1.000000, .z=1.000000, .t=0.010000};
__.nodes.steps = {.x=0.003906, .y=0.003906, .z=0.003906, .t=0.000500};

__.param.period = {.x=1, .y=0, .z=0};
__.param.a = {.x=6.283185, .y=3.141593, .z=3.141593, .t=7.695299};
__.param.b = {.x=0.000000, .y=0.000000, .z=0.000000, .t=7.853982};

__.local.rank = 13;
__.local.shape = {.x=8, .y=4, .z=4};
__.local.coord = {.x=0, .y=3, .z=1};

__.block.shape = {.x=34, .y=66, .z=66};
__.block.coord = {.x=0, .y=192, .z=64};
__.block.elems = 148104;

=======================
__.world.size = 128;
__.world.rank = 14;

__.nodes.shape = {.x=256, .y=256, .z=256, .t=20};
__.nodes.bound = {.x=1.000000, .y=1.000000, .z=1.000000, .t=0.010000};
__.nodes.steps = {.x=0.003906, .y=0.003906, .z=0.003906, .t=0.000500};

__.param.period = {.x=1, .y=0, .z=0};
__.param.a = {.x=6.283185, .y=3.141593, .z=3.141593, .t=7.695299};
__.param.b = {.x=0.000000, .y=0.000000, .z=0.000000, .t=7.853982};

__.local.rank = 14;
__.local.shape = {.x=8, .y=4, .z=4};
__.local.coord = {.x=0, .y=3, .z=2};

__.block.shape = {.x=34, .y=66, .z=66};
__.block.coord = {.x=0, .y=192, .z=128};
__.block.elems = 148104;

=======================
__.world.size = 128;
__.world.rank = 15;

__.nodes.shape = {.x=256, .y=256, .z=256, .t=20};
__.nodes.bound = {.x=1.000000, .y=1.000000, .z=1.000000, .t=0.010000};
__.nodes.steps = {.x=0.003906, .y=0.003906, .z=0.003906, .t=0.000500};

__.param.period = {.x=1, .y=0, .z=0};
__.param.a = {.x=6.283185, .y=3.141593, .z=3.141593, .t=7.695299};
__.param.b = {.x=0.000000, .y=0.000000, .z=0.000000, .t=7.853982};

__.local.rank = 15;
__.local.shape = {.x=8, .y=4, .z=4};
__.local.coord = {.x=0, .y=3, .z=3};

__.block.shape = {.x=34, .y=66, .z=66};
__.block.coord = {.x=0, .y=192, .z=192};
__.block.elems = 148104;

=======================
__.world.size = 128;
__.world.rank = 16;

__.nodes.shape = {.x=256, .y=256, .z=256, .t=20};
__.nodes.bound = {.x=1.000000, .y=1.000000, .z=1.000000, .t=0.010000};
__.nodes.steps = {.x=0.003906, .y=0.003906, .z=0.003906, .t=0.000500};

__.param.period = {.x=1, .y=0, .z=0};
__.param.a = {.x=6.283185, .y=3.141593, .z=3.141593, .t=7.695299};
__.param.b = {.x=0.000000, .y=0.000000, .z=0.000000, .t=7.853982};

__.local.rank = 16;
__.local.shape = {.x=8, .y=4, .z=4};
__.local.coord = {.x=1, .y=0, .z=0};

__.block.shape = {.x=34, .y=66, .z=66};
__.block.coord = {.x=32, .y=0, .z=0};
__.block.elems = 148104;

=======================
__.world.size = 128;
__.world.rank = 17;

__.nodes.shape = {.x=256, .y=256, .z=256, .t=20};
__.nodes.bound = {.x=1.000000, .y=1.000000, .z=1.000000, .t=0.010000};
__.nodes.steps = {.x=0.003906, .y=0.003906, .z=0.003906, .t=0.000500};

__.param.period = {.x=1, .y=0, .z=0};
__.param.a = {.x=6.283185, .y=3.141593, .z=3.141593, .t=7.695299};
__.param.b = {.x=0.000000, .y=0.000000, .z=0.000000, .t=7.853982};

__.local.rank = 17;
__.local.shape = {.x=8, .y=4, .z=4};
__.local.coord = {.x=1, .y=0, .z=1};

__.block.shape = {.x=34, .y=66, .z=66};
__.block.coord = {.x=32, .y=0, .z=64};
__.block.elems = 148104;

=======================
__.world.size = 128;
__.world.rank = 18;

__.nodes.shape = {.x=256, .y=256, .z=256, .t=20};
__.nodes.bound = {.x=1.000000, .y=1.000000, .z=1.000000, .t=0.010000};
__.nodes.steps = {.x=0.003906, .y=0.003906, .z=0.003906, .t=0.000500};

__.param.period = {.x=1, .y=0, .z=0};
__.param.a = {.x=6.283185, .y=3.141593, .z=3.141593, .t=7.695299};
__.param.b = {.x=0.000000, .y=0.000000, .z=0.000000, .t=7.853982};

__.local.rank = 18;
__.local.shape = {.x=8, .y=4, .z=4};
__.local.coord = {.x=1, .y=0, .z=2};

__.block.shape = {.x=34, .y=66, .z=66};
__.block.coord = {.x=32, .y=0, .z=128};
__.block.elems = 148104;

=======================
__.world.size = 128;
__.world.rank = 19;

__.nodes.shape = {.x=256, .y=256, .z=256, .t=20};
__.nodes.bound = {.x=1.000000, .y=1.000000, .z=1.000000, .t=0.010000};
__.nodes.steps = {.x=0.003906, .y=0.003906, .z=0.003906, .t=0.000500};

__.param.period = {.x=1, .y=0, .z=0};
__.param.a = {.x=6.283185, .y=3.141593, .z=3.141593, .t=7.695299};
__.param.b = {.x=0.000000, .y=0.000000, .z=0.000000, .t=7.853982};

__.local.rank = 19;
__.local.shape = {.x=8, .y=4, .z=4};
__.local.coord = {.x=1, .y=0, .z=3};

__.block.shape = {.x=34, .y=66, .z=66};
__.block.coord = {.x=32, .y=0, .z=192};
__.block.elems = 148104;

=======================
__.world.size = 128;
__.world.rank = 20;

__.nodes.shape = {.x=256, .y=256, .z=256, .t=20};
__.nodes.bound = {.x=1.000000, .y=1.000000, .z=1.000000, .t=0.010000};
__.nodes.steps = {.x=0.003906, .y=0.003906, .z=0.003906, .t=0.000500};

__.param.period = {.x=1, .y=0, .z=0};
__.param.a = {.x=6.283185, .y=3.141593, .z=3.141593, .t=7.695299};
__.param.b = {.x=0.000000, .y=0.000000, .z=0.000000, .t=7.853982};

__.local.rank = 20;
__.local.shape = {.x=8, .y=4, .z=4};
__.local.coord = {.x=1, .y=1, .z=0};

__.block.shape = {.x=34, .y=66, .z=66};
__.block.coord = {.x=32, .y=64, .z=0};
__.block.elems = 148104;

=======================
__.world.size = 128;
__.world.rank = 21;

__.nodes.shape = {.x=256, .y=256, .z=256, .t=20};
__.nodes.bound = {.x=1.000000, .y=1.000000, .z=1.000000, .t=0.010000};
__.nodes.steps = {.x=0.003906, .y=0.003906, .z=0.003906, .t=0.000500};

__.param.period = {.x=1, .y=0, .z=0};
__.param.a = {.x=6.283185, .y=3.141593, .z=3.141593, .t=7.695299};
__.param.b = {.x=0.000000, .y=0.000000, .z=0.000000, .t=7.853982};

__.local.rank = 21;
__.local.shape = {.x=8, .y=4, .z=4};
__.local.coord = {.x=1, .y=1, .z=1};

__.block.shape = {.x=34, .y=66, .z=66};
__.block.coord = {.x=32, .y=64, .z=64};
__.block.elems = 148104;

=======================
__.world.size = 128;
__.world.rank = 22;

__.nodes.shape = {.x=256, .y=256, .z=256, .t=20};
__.nodes.bound = {.x=1.000000, .y=1.000000, .z=1.000000, .t=0.010000};
__.nodes.steps = {.x=0.003906, .y=0.003906, .z=0.003906, .t=0.000500};

__.param.period = {.x=1, .y=0, .z=0};
__.param.a = {.x=6.283185, .y=3.141593, .z=3.141593, .t=7.695299};
__.param.b = {.x=0.000000, .y=0.000000, .z=0.000000, .t=7.853982};

__.local.rank = 22;
__.local.shape = {.x=8, .y=4, .z=4};
__.local.coord = {.x=1, .y=1, .z=2};

__.block.shape = {.x=34, .y=66, .z=66};
__.block.coord = {.x=32, .y=64, .z=128};
__.block.elems = 148104;

=======================
__.world.size = 128;
__.world.rank = 23;

__.nodes.shape = {.x=256, .y=256, .z=256, .t=20};
__.nodes.bound = {.x=1.000000, .y=1.000000, .z=1.000000, .t=0.010000};
__.nodes.steps = {.x=0.003906, .y=0.003906, .z=0.003906, .t=0.000500};

__.param.period = {.x=1, .y=0, .z=0};
__.param.a = {.x=6.283185, .y=3.141593, .z=3.141593, .t=7.695299};
__.param.b = {.x=0.000000, .y=0.000000, .z=0.000000, .t=7.853982};

__.local.rank = 23;
__.local.shape = {.x=8, .y=4, .z=4};
__.local.coord = {.x=1, .y=1, .z=3};

__.block.shape = {.x=34, .y=66, .z=66};
__.block.coord = {.x=32, .y=64, .z=192};
__.block.elems = 148104;

=======================
__.world.size = 128;
__.world.rank = 24;

__.nodes.shape = {.x=256, .y=256, .z=256, .t=20};
__.nodes.bound = {.x=1.000000, .y=1.000000, .z=1.000000, .t=0.010000};
__.nodes.steps = {.x=0.003906, .y=0.003906, .z=0.003906, .t=0.000500};

__.param.period = {.x=1, .y=0, .z=0};
__.param.a = {.x=6.283185, .y=3.141593, .z=3.141593, .t=7.695299};
__.param.b = {.x=0.000000, .y=0.000000, .z=0.000000, .t=7.853982};

__.local.rank = 24;
__.local.shape = {.x=8, .y=4, .z=4};
__.local.coord = {.x=1, .y=2, .z=0};

__.block.shape = {.x=34, .y=66, .z=66};
__.block.coord = {.x=32, .y=128, .z=0};
__.block.elems = 148104;

=======================
__.world.size = 128;
__.world.rank = 25;

__.nodes.shape = {.x=256, .y=256, .z=256, .t=20};
__.nodes.bound = {.x=1.000000, .y=1.000000, .z=1.000000, .t=0.010000};
__.nodes.steps = {.x=0.003906, .y=0.003906, .z=0.003906, .t=0.000500};

__.param.period = {.x=1, .y=0, .z=0};
__.param.a = {.x=6.283185, .y=3.141593, .z=3.141593, .t=7.695299};
__.param.b = {.x=0.000000, .y=0.000000, .z=0.000000, .t=7.853982};

__.local.rank = 25;
=======================
__.local.shape = {.x=8, .y=4, .z=4};
__.local.coord = {.x=1, .y=2, .z=1};

__.world.size = 128;
__.block.shape = {.x=34, .y=66, .z=66};
__.world.rank = 32;
__.block.coord = {.x=32, .y=128, .z=64};

__.block.elems = 148104;
__.nodes.shape = {.x=256, .y=256, .z=256, .t=20};

__.nodes.bound = {.x=1.000000, .y=1.000000, .z=1.000000, .t=0.010000};
=======================
__.nodes.steps = {.x=0.003906, .y=0.003906, .z=0.003906, .t=0.000500};
__.world.size = 128;

__.world.rank = 26;
__.param.period = {.x=1, .y=0, .z=0};

__.nodes.shape = {.x=256, .y=256, .z=256, .t=20};
__.param.a = {.x=6.283185, .y=3.141593, .z=3.141593, .t=7.695299};
__.nodes.bound = {.x=1.000000, .y=1.000000, .z=1.000000, .t=0.010000};
__.param.b = {.x=0.000000, .y=0.000000, .z=0.000000, .t=7.853982};
__.nodes.steps = {.x=0.003906, .y=0.003906, .z=0.003906, .t=0.000500};


__.param.period = {.x=1, .y=0, .z=0};
__.local.rank = 32;
__.param.a = {.x=6.283185, .y=3.141593, .z=3.141593, .t=7.695299};
__.local.shape = {.x=8, .y=4, .z=4};
__.param.b = {.x=0.000000, .y=0.000000, .z=0.000000, .t=7.853982};
__.local.coord = {.x=2, .y=0, .z=0};


__.local.rank = 26;
__.block.shape = {.x=34, .y=66, .z=66};
__.local.shape = {.x=8, .y=4, .z=4};
__.block.coord = {.x=64, .y=0, .z=0};
__.local.coord = {.x=1, .y=2, .z=2};

__.block.elems = 148104;
__.block.shape = {.x=34, .y=66, .z=66};

__.block.coord = {.x=32, .y=128, .z=128};
=======================
__.block.elems = 148104;
__.world.size = 128;

__.world.rank = 33;
=======================
__.world.size = 128;

__.world.rank = 27;
__.nodes.shape = {.x=256, .y=256, .z=256, .t=20};

__.nodes.bound = {.x=1.000000, .y=1.000000, .z=1.000000, .t=0.010000};
__.nodes.shape = {.x=256, .y=256, .z=256, .t=20};
__.nodes.steps = {.x=0.003906, .y=0.003906, .z=0.003906, .t=0.000500};
__.nodes.bound = {.x=1.000000, .y=1.000000, .z=1.000000, .t=0.010000};
__.nodes.steps = {.x=0.003906, .y=0.003906, .z=0.003906, .t=0.000500};


__.param.period = {.x=1, .y=0, .z=0};
__.param.period = {.x=1, .y=0, .z=0};
__.param.a = {.x=6.283185, .y=3.141593, .z=3.141593, .t=7.695299};
__.param.a = {.x=6.283185, .y=3.141593, .z=3.141593, .t=7.695299};
__.param.b = {.x=0.000000, .y=0.000000, .z=0.000000, .t=7.853982};
__.param.b = {.x=0.000000, .y=0.000000, .z=0.000000, .t=7.853982};


__.local.rank = 27;
__.local.rank = 33;
__.local.shape = {.x=8, .y=4, .z=4};
__.local.shape = {.x=8, .y=4, .z=4};
__.local.coord = {.x=1, .y=2, .z=3};
__.local.coord = {.x=2, .y=0, .z=1};


__.block.shape = {.x=34, .y=66, .z=66};
__.block.shape = {.x=34, .y=66, .z=66};
__.block.coord = {.x=32, .y=128, .z=192};
__.block.elems = 148104;
__.block.coord = {.x=64, .y=0, .z=64};

__.block.elems = 148104;
=======================

__.world.size = 128;
=======================
__.world.rank = 28;

__.world.size = 128;
__.nodes.shape = {.x=256, .y=256, .z=256, .t=20};
__.world.rank = 34;
__.nodes.bound = {.x=1.000000, .y=1.000000, .z=1.000000, .t=0.010000};

__.nodes.steps = {.x=0.003906, .y=0.003906, .z=0.003906, .t=0.000500};
__.nodes.shape = {.x=256, .y=256, .z=256, .t=20};

__.param.period = {.x=1, .y=0, .z=0};
__.nodes.bound = {.x=1.000000, .y=1.000000, .z=1.000000, .t=0.010000};
__.param.a = {.x=6.283185, .y=3.141593, .z=3.141593, .t=7.695299};
__.nodes.steps = {.x=0.003906, .y=0.003906, .z=0.003906, .t=0.000500};
__.param.b = {.x=0.000000, .y=0.000000, .z=0.000000, .t=7.853982};


__.param.period = {.x=1, .y=0, .z=0};
__.local.rank = 28;
__.param.a = {.x=6.283185, .y=3.141593, .z=3.141593, .t=7.695299};
__.local.shape = {.x=8, .y=4, .z=4};
__.local.coord = {.x=1, .y=3, .z=0};
__.param.b = {.x=0.000000, .y=0.000000, .z=0.000000, .t=7.853982};


__.block.shape = {.x=34, .y=66, .z=66};
__.local.rank = 34;
__.block.coord = {.x=32, .y=192, .z=0};
__.local.shape = {.x=8, .y=4, .z=4};
__.block.elems = 148104;
__.local.coord = {.x=2, .y=0, .z=2};


=======================
__.block.shape = {.x=34, .y=66, .z=66};
__.world.size = 128;
__.block.coord = {.x=64, .y=0, .z=128};
__.world.rank = 29;
__.block.elems = 148104;


__.nodes.shape = {.x=256, .y=256, .z=256, .t=20};
__.nodes.bound = {.x=1.000000, .y=1.000000, .z=1.000000, .t=0.010000};
=======================
__.nodes.steps = {.x=0.003906, .y=0.003906, .z=0.003906, .t=0.000500};
__.world.size = 128;

__.world.rank = 35;
__.param.period = {.x=1, .y=0, .z=0};

__.param.a = {.x=6.283185, .y=3.141593, .z=3.141593, .t=7.695299};
__.nodes.shape = {.x=256, .y=256, .z=256, .t=20};
__.param.b = {.x=0.000000, .y=0.000000, .z=0.000000, .t=7.853982};
__.nodes.bound = {.x=1.000000, .y=1.000000, .z=1.000000, .t=0.010000};

__.nodes.steps = {.x=0.003906, .y=0.003906, .z=0.003906, .t=0.000500};
__.local.rank = 29;

__.local.shape = {.x=8, .y=4, .z=4};
__.param.period = {.x=1, .y=0, .z=0};
__.local.coord = {.x=1, .y=3, .z=1};
__.param.a = {.x=6.283185, .y=3.141593, .z=3.141593, .t=7.695299};

__.param.b = {.x=0.000000, .y=0.000000, .z=0.000000, .t=7.853982};
__.block.shape = {.x=34, .y=66, .z=66};

__.block.coord = {.x=32, .y=192, .z=64};
__.local.rank = 35;
__.block.elems = 148104;
__.local.shape = {.x=8, .y=4, .z=4};

__.local.coord = {.x=2, .y=0, .z=3};
=======================

__.world.size = 128;
__.block.shape = {.x=34, .y=66, .z=66};
__.world.rank = 30;
__.block.coord = {.x=64, .y=0, .z=192};

__.block.elems = 148104;
__.nodes.shape = {.x=256, .y=256, .z=256, .t=20};

__.nodes.bound = {.x=1.000000, .y=1.000000, .z=1.000000, .t=0.010000};
=======================
__.nodes.steps = {.x=0.003906, .y=0.003906, .z=0.003906, .t=0.000500};
__.world.size = 128;

__.world.rank = 36;
__.param.period = {.x=1, .y=0, .z=0};

__.param.a = {.x=6.283185, .y=3.141593, .z=3.141593, .t=7.695299};
__.nodes.shape = {.x=256, .y=256, .z=256, .t=20};
__.param.b = {.x=0.000000, .y=0.000000, .z=0.000000, .t=7.853982};
__.nodes.bound = {.x=1.000000, .y=1.000000, .z=1.000000, .t=0.010000};

__.nodes.steps = {.x=0.003906, .y=0.003906, .z=0.003906, .t=0.000500};
__.local.rank = 30;

__.local.shape = {.x=8, .y=4, .z=4};
__.param.period = {.x=1, .y=0, .z=0};
__.local.coord = {.x=1, .y=3, .z=2};
__.param.a = {.x=6.283185, .y=3.141593, .z=3.141593, .t=7.695299};

__.param.b = {.x=0.000000, .y=0.000000, .z=0.000000, .t=7.853982};
__.block.shape = {.x=34, .y=66, .z=66};

__.block.coord = {.x=32, .y=192, .z=128};
__.local.rank = 36;
__.block.elems = 148104;
__.local.shape = {.x=8, .y=4, .z=4};

__.local.coord = {.x=2, .y=1, .z=0};
=======================

__.world.size = 128;
__.block.shape = {.x=34, .y=66, .z=66};
__.world.rank = 31;
__.block.coord = {.x=64, .y=64, .z=0};

__.block.elems = 148104;
__.nodes.shape = {.x=256, .y=256, .z=256, .t=20};

__.nodes.bound = {.x=1.000000, .y=1.000000, .z=1.000000, .t=0.010000};
=======================
__.nodes.steps = {.x=0.003906, .y=0.003906, .z=0.003906, .t=0.000500};
__.world.size = 128;

__.world.rank = 37;
__.param.period = {.x=1, .y=0, .z=0};

__.param.a = {.x=6.283185, .y=3.141593, .z=3.141593, .t=7.695299};
__.nodes.shape = {.x=256, .y=256, .z=256, .t=20};
__.param.b = {.x=0.000000, .y=0.000000, .z=0.000000, .t=7.853982};
__.nodes.bound = {.x=1.000000, .y=1.000000, .z=1.000000, .t=0.010000};

__.nodes.steps = {.x=0.003906, .y=0.003906, .z=0.003906, .t=0.000500};
__.local.rank = 31;

__.local.shape = {.x=8, .y=4, .z=4};
__.param.period = {.x=1, .y=0, .z=0};
__.local.coord = {.x=1, .y=3, .z=3};
__.param.a = {.x=6.283185, .y=3.141593, .z=3.141593, .t=7.695299};

__.param.b = {.x=0.000000, .y=0.000000, .z=0.000000, .t=7.853982};
__.block.shape = {.x=34, .y=66, .z=66};

__.block.coord = {.x=32, .y=192, .z=192};
__.local.rank = 37;
__.block.elems = 148104;
__.local.shape = {.x=8, .y=4, .z=4};

__.local.coord = {.x=2, .y=1, .z=1};

__.block.shape = {.x=34, .y=66, .z=66};
__.block.coord = {.x=64, .y=64, .z=64};
__.block.elems = 148104;

=======================
__.world.size = 128;
__.world.rank = 38;

__.nodes.shape = {.x=256, .y=256, .z=256, .t=20};
__.nodes.bound = {.x=1.000000, .y=1.000000, .z=1.000000, .t=0.010000};
__.nodes.steps = {.x=0.003906, .y=0.003906, .z=0.003906, .t=0.000500};

__.param.period = {.x=1, .y=0, .z=0};
__.param.a = {.x=6.283185, .y=3.141593, .z=3.141593, .t=7.695299};
__.param.b = {.x=0.000000, .y=0.000000, .z=0.000000, .t=7.853982};

__.local.rank = 38;
__.local.shape = {.x=8, .y=4, .z=4};
__.local.coord = {.x=2, .y=1, .z=2};

__.block.shape = {.x=34, .y=66, .z=66};
__.block.coord = {.x=64, .y=64, .z=128};
__.block.elems = 148104;

=======================
__.world.size = 128;
__.world.rank = 39;

__.nodes.shape = {.x=256, .y=256, .z=256, .t=20};
__.nodes.bound = {.x=1.000000, .y=1.000000, .z=1.000000, .t=0.010000};
__.nodes.steps = {.x=0.003906, .y=0.003906, .z=0.003906, .t=0.000500};

__.param.period = {.x=1, .y=0, .z=0};
__.param.a = {.x=6.283185, .y=3.141593, .z=3.141593, .t=7.695299};
__.param.b = {.x=0.000000, .y=0.000000, .z=0.000000, .t=7.853982};

__.local.rank = 39;
__.local.shape = {.x=8, .y=4, .z=4};
__.local.coord = {.x=2, .y=1, .z=3};

__.block.shape = {.x=34, .y=66, .z=66};
__.block.coord = {.x=64, .y=64, .z=192};
__.block.elems = 148104;

=======================
__.world.size = 128;
__.world.rank = 40;

__.nodes.shape = {.x=256, .y=256, .z=256, .t=20};
__.nodes.bound = {.x=1.000000, .y=1.000000, .z=1.000000, .t=0.010000};
__.nodes.steps = {.x=0.003906, .y=0.003906, .z=0.003906, .t=0.000500};

__.param.period = {.x=1, .y=0, .z=0};
__.param.a = {.x=6.283185, .y=3.141593, .z=3.141593, .t=7.695299};
__.param.b = {.x=0.000000, .y=0.000000, .z=0.000000, .t=7.853982};

__.local.rank = 40;
__.local.shape = {.x=8, .y=4, .z=4};
__.local.coord = {.x=2, .y=2, .z=0};

__.block.shape = {.x=34, .y=66, .z=66};
__.block.coord = {.x=64, .y=128, .z=0};
__.block.elems = 148104;

=======================
__.world.size = 128;
__.world.rank = 41;

__.nodes.shape = {.x=256, .y=256, .z=256, .t=20};
__.nodes.bound = {.x=1.000000, .y=1.000000, .z=1.000000, .t=0.010000};
__.nodes.steps = {.x=0.003906, .y=0.003906, .z=0.003906, .t=0.000500};

__.param.period = {.x=1, .y=0, .z=0};
__.param.a = {.x=6.283185, .y=3.141593, .z=3.141593, .t=7.695299};
__.param.b = {.x=0.000000, .y=0.000000, .z=0.000000, .t=7.853982};

__.local.rank = 41;
__.local.shape = {.x=8, .y=4, .z=4};
__.local.coord = {.x=2, .y=2, .z=1};

__.block.shape = {.x=34, .y=66, .z=66};
__.block.coord = {.x=64, .y=128, .z=64};
__.block.elems = 148104;

=======================
__.world.size = 128;
__.world.rank = 42;

__.nodes.shape = {.x=256, .y=256, .z=256, .t=20};
__.nodes.bound = {.x=1.000000, .y=1.000000, .z=1.000000, .t=0.010000};
__.nodes.steps = {.x=0.003906, .y=0.003906, .z=0.003906, .t=0.000500};

__.param.period = {.x=1, .y=0, .z=0};
__.param.a = {.x=6.283185, .y=3.141593, .z=3.141593, .t=7.695299};
__.param.b = {.x=0.000000, .y=0.000000, .z=0.000000, .t=7.853982};

__.local.rank = 42;
__.local.shape = {.x=8, .y=4, .z=4};
__.local.coord = {.x=2, .y=2, .z=2};

__.block.shape = {.x=34, .y=66, .z=66};
__.block.coord = {.x=64, .y=128, .z=128};
__.block.elems = 148104;

=======================
__.world.size = 128;
__.world.rank = 43;

__.nodes.shape = {.x=256, .y=256, .z=256, .t=20};
__.nodes.bound = {.x=1.000000, .y=1.000000, .z=1.000000, .t=0.010000};
__.nodes.steps = {.x=0.003906, .y=0.003906, .z=0.003906, .t=0.000500};

__.param.period = {.x=1, .y=0, .z=0};
__.param.a = {.x=6.283185, .y=3.141593, .z=3.141593, .t=7.695299};
__.param.b = {.x=0.000000, .y=0.000000, .z=0.000000, .t=7.853982};

__.local.rank = 43;
__.local.shape = {.x=8, .y=4, .z=4};
__.local.coord = {.x=2, .y=2, .z=3};

__.block.shape = {.x=34, .y=66, .z=66};
__.block.coord = {.x=64, .y=128, .z=192};
__.block.elems = 148104;

=======================
__.world.size = 128;
__.world.rank = 44;

__.nodes.shape = {.x=256, .y=256, .z=256, .t=20};
__.nodes.bound = {.x=1.000000, .y=1.000000, .z=1.000000, .t=0.010000};
__.nodes.steps = {.x=0.003906, .y=0.003906, .z=0.003906, .t=0.000500};

__.param.period = {.x=1, .y=0, .z=0};
__.param.a = {.x=6.283185, .y=3.141593, .z=3.141593, .t=7.695299};
__.param.b = {.x=0.000000, .y=0.000000, .z=0.000000, .t=7.853982};

__.local.rank = 44;
__.local.shape = {.x=8, .y=4, .z=4};
__.local.coord = {.x=2, .y=3, .z=0};

__.block.shape = {.x=34, .y=66, .z=66};
__.block.coord = {.x=64, .y=192, .z=0};
__.block.elems = 148104;

=======================
__.world.size = 128;
__.world.rank = 45;

__.nodes.shape = {.x=256, .y=256, .z=256, .t=20};
__.nodes.bound = {.x=1.000000, .y=1.000000, .z=1.000000, .t=0.010000};
__.nodes.steps = {.x=0.003906, .y=0.003906, .z=0.003906, .t=0.000500};

__.param.period = {.x=1, .y=0, .z=0};
__.param.a = {.x=6.283185, .y=3.141593, .z=3.141593, .t=7.695299};
__.param.b = {.x=0.000000, .y=0.000000, .z=0.000000, .t=7.853982};

__.local.rank = 45;
__.local.shape = {.x=8, .y=4, .z=4};
__.local.coord = {.x=2, .y=3, .z=1};

__.block.shape = {.x=34, .y=66, .z=66};
__.block.coord = {.x=64, .y=192, .z=64};
__.block.elems = 148104;

=======================
__.world.size = 128;
__.world.rank = 46;

__.nodes.shape = {.x=256, .y=256, .z=256, .t=20};
__.nodes.bound = {.x=1.000000, .y=1.000000, .z=1.000000, .t=0.010000};
__.nodes.steps = {.x=0.003906, .y=0.003906, .z=0.003906, .t=0.000500};

__.param.period = {.x=1, .y=0, .z=0};
__.param.a = {.x=6.283185, .y=3.141593, .z=3.141593, .t=7.695299};
__.param.b = {.x=0.000000, .y=0.000000, .z=0.000000, .t=7.853982};

__.local.rank = 46;
__.local.shape = {.x=8, .y=4, .z=4};
__.local.coord = {.x=2, .y=3, .z=2};

__.block.shape = {.x=34, .y=66, .z=66};
__.block.coord = {.x=64, .y=192, .z=128};
__.block.elems = 148104;

=======================
__.world.size = 128;
__.world.rank = 47;

__.nodes.shape = {.x=256, .y=256, .z=256, .t=20};
__.nodes.bound = {.x=1.000000, .y=1.000000, .z=1.000000, .t=0.010000};
__.nodes.steps = {.x=0.003906, .y=0.003906, .z=0.003906, .t=0.000500};

__.param.period = {.x=1, .y=0, .z=0};
__.param.a = {.x=6.283185, .y=3.141593, .z=3.141593, .t=7.695299};
__.param.b = {.x=0.000000, .y=0.000000, .z=0.000000, .t=7.853982};

__.local.rank = 47;
__.local.shape = {.x=8, .y=4, .z=4};
__.local.coord = {.x=2, .y=3, .z=3};

__.block.shape = {.x=34, .y=66, .z=66};
__.block.coord = {.x=64, .y=192, .z=192};
__.block.elems = 148104;

=======================
__.world.size = 128;
__.world.rank = 48;

__.nodes.shape = {.x=256, .y=256, .z=256, .t=20};
__.nodes.bound = {.x=1.000000, .y=1.000000, .z=1.000000, .t=0.010000};
__.nodes.steps = {.x=0.003906, .y=0.003906, .z=0.003906, .t=0.000500};

__.param.period = {.x=1, .y=0, .z=0};
__.param.a = {.x=6.283185, .y=3.141593, .z=3.141593, .t=7.695299};
__.param.b = {.x=0.000000, .y=0.000000, .z=0.000000, .t=7.853982};

__.local.rank = 48;
__.local.shape = {.x=8, .y=4, .z=4};
__.local.coord = {.x=3, .y=0, .z=0};

__.block.shape = {.x=34, .y=66, .z=66};
__.block.coord = {.x=96, .y=0, .z=0};
__.block.elems = 148104;

=======================
__.world.size = 128;
__.world.rank = 49;

__.nodes.shape = {.x=256, .y=256, .z=256, .t=20};
__.nodes.bound = {.x=1.000000, .y=1.000000, .z=1.000000, .t=0.010000};
__.nodes.steps = {.x=0.003906, .y=0.003906, .z=0.003906, .t=0.000500};

__.param.period = {.x=1, .y=0, .z=0};
__.param.a = {.x=6.283185, .y=3.141593, .z=3.141593, .t=7.695299};
__.param.b = {.x=0.000000, .y=0.000000, .z=0.000000, .t=7.853982};

__.local.rank = 49;
__.local.shape = {.x=8, .y=4, .z=4};
__.local.coord = {.x=3, .y=0, .z=1};

__.block.shape = {.x=34, .y=66, .z=66};
__.block.coord = {.x=96, .y=0, .z=64};
__.block.elems = 148104;

=======================
__.world.size = 128;
__.world.rank = 50;

__.nodes.shape = {.x=256, .y=256, .z=256, .t=20};
__.nodes.bound = {.x=1.000000, .y=1.000000, .z=1.000000, .t=0.010000};
__.nodes.steps = {.x=0.003906, .y=0.003906, .z=0.003906, .t=0.000500};

__.param.period = {.x=1, .y=0, .z=0};
__.param.a = {.x=6.283185, .y=3.141593, .z=3.141593, .t=7.695299};
__.param.b = {.x=0.000000, .y=0.000000, .z=0.000000, .t=7.853982};

__.local.rank = 50;
__.local.shape = {.x=8, .y=4, .z=4};
__.local.coord = {.x=3, .y=0, .z=2};

__.block.shape = {.x=34, .y=66, .z=66};
__.block.coord = {.x=96, .y=0, .z=128};
__.block.elems = 148104;

=======================
__.world.size = 128;
__.world.rank = 51;

__.nodes.shape = {.x=256, .y=256, .z=256, .t=20};
__.nodes.bound = {.x=1.000000, .y=1.000000, .z=1.000000, .t=0.010000};
__.nodes.steps = {.x=0.003906, .y=0.003906, .z=0.003906, .t=0.000500};

__.param.period = {.x=1, .y=0, .z=0};
__.param.a = {.x=6.283185, .y=3.141593, .z=3.141593, .t=7.695299};
__.param.b = {.x=0.000000, .y=0.000000, .z=0.000000, .t=7.853982};

__.local.rank = 51;
__.local.shape = {.x=8, .y=4, .z=4};
__.local.coord = {.x=3, .y=0, .z=3};

__.block.shape = {.x=34, .y=66, .z=66};
__.block.coord = {.x=96, .y=0, .z=192};
__.block.elems = 148104;

=======================
=======================
__.world.size = 128;
__.world.size = 128;
__.world.rank = 64;
__.world.rank = 52;


__.nodes.shape = {.x=256, .y=256, .z=256, .t=20};
__.nodes.shape = {.x=256, .y=256, .z=256, .t=20};
__.nodes.bound = {.x=1.000000, .y=1.000000, .z=1.000000, .t=0.010000};
__.nodes.bound = {.x=1.000000, .y=1.000000, .z=1.000000, .t=0.010000};
__.nodes.steps = {.x=0.003906, .y=0.003906, .z=0.003906, .t=0.000500};
__.nodes.steps = {.x=0.003906, .y=0.003906, .z=0.003906, .t=0.000500};


__.param.period = {.x=1, .y=0, .z=0};
__.param.period = {.x=1, .y=0, .z=0};
__.param.a = {.x=6.283185, .y=3.141593, .z=3.141593, .t=7.695299};
__.param.a = {.x=6.283185, .y=3.141593, .z=3.141593, .t=7.695299};
__.param.b = {.x=0.000000, .y=0.000000, .z=0.000000, .t=7.853982};
__.param.b = {.x=0.000000, .y=0.000000, .z=0.000000, .t=7.853982};


__.local.rank = 64;
__.local.rank = 52;
__.local.shape = {.x=8, .y=4, .z=4};
__.local.shape = {.x=8, .y=4, .z=4};
__.local.coord = {.x=4, .y=0, .z=0};
__.local.coord = {.x=3, .y=1, .z=0};


__.block.shape = {.x=34, .y=66, .z=66};
__.block.shape = {.x=34, .y=66, .z=66};
__.block.coord = {.x=128, .y=0, .z=0};
__.block.coord = {.x=96, .y=64, .z=0};
__.block.elems = 148104;
__.block.elems = 148104;


=======================
=======================
__.world.size = 128;
__.world.size = 128;
__.world.rank = 65;
__.world.rank = 53;


__.nodes.shape = {.x=256, .y=256, .z=256, .t=20};
__.nodes.shape = {.x=256, .y=256, .z=256, .t=20};
__.nodes.bound = {.x=1.000000, .y=1.000000, .z=1.000000, .t=0.010000};
__.nodes.bound = {.x=1.000000, .y=1.000000, .z=1.000000, .t=0.010000};
__.nodes.steps = {.x=0.003906, .y=0.003906, .z=0.003906, .t=0.000500};
__.nodes.steps = {.x=0.003906, .y=0.003906, .z=0.003906, .t=0.000500};


__.param.period = {.x=1, .y=0, .z=0};
__.param.period = {.x=1, .y=0, .z=0};
__.param.a = {.x=6.283185, .y=3.141593, .z=3.141593, .t=7.695299};
__.param.a = {.x=6.283185, .y=3.141593, .z=3.141593, .t=7.695299};
__.param.b = {.x=0.000000, .y=0.000000, .z=0.000000, .t=7.853982};
__.param.b = {.x=0.000000, .y=0.000000, .z=0.000000, .t=7.853982};


__.local.rank = 53;
__.local.rank = 65;
__.local.shape = {.x=8, .y=4, .z=4};
__.local.shape = {.x=8, .y=4, .z=4};
__.local.coord = {.x=3, .y=1, .z=1};
__.local.coord = {.x=4, .y=0, .z=1};


__.block.shape = {.x=34, .y=66, .z=66};
__.block.shape = {.x=34, .y=66, .z=66};
__.block.coord = {.x=96, .y=64, .z=64};
__.block.coord = {.x=128, .y=0, .z=64};
__.block.elems = 148104;
__.block.elems = 148104;


=======================
=======================
__.world.size = 128;
__.world.size = 128;
__.world.rank = 54;
__.world.rank = 66;


__.nodes.shape = {.x=256, .y=256, .z=256, .t=20};
__.nodes.shape = {.x=256, .y=256, .z=256, .t=20};
__.nodes.bound = {.x=1.000000, .y=1.000000, .z=1.000000, .t=0.010000};
__.nodes.bound = {.x=1.000000, .y=1.000000, .z=1.000000, .t=0.010000};
__.nodes.steps = {.x=0.003906, .y=0.003906, .z=0.003906, .t=0.000500};
__.nodes.steps = {.x=0.003906, .y=0.003906, .z=0.003906, .t=0.000500};


__.param.period = {.x=1, .y=0, .z=0};
__.param.period = {.x=1, .y=0, .z=0};
__.param.a = {.x=6.283185, .y=3.141593, .z=3.141593, .t=7.695299};
__.param.a = {.x=6.283185, .y=3.141593, .z=3.141593, .t=7.695299};
__.param.b = {.x=0.000000, .y=0.000000, .z=0.000000, .t=7.853982};
__.param.b = {.x=0.000000, .y=0.000000, .z=0.000000, .t=7.853982};


__.local.rank = 54;
__.local.rank = 66;
__.local.shape = {.x=8, .y=4, .z=4};
__.local.shape = {.x=8, .y=4, .z=4};
__.local.coord = {.x=3, .y=1, .z=2};
__.local.coord = {.x=4, .y=0, .z=2};


__.block.shape = {.x=34, .y=66, .z=66};
__.block.shape = {.x=34, .y=66, .z=66};
__.block.coord = {.x=96, .y=64, .z=128};
__.block.coord = {.x=128, .y=0, .z=128};
__.block.elems = 148104;
__.block.elems = 148104;

=======================
__.world.size = 128;

__.world.rank = 55;
=======================

__.world.size = 128;
__.nodes.shape = {.x=256, .y=256, .z=256, .t=20};
__.world.rank = 67;
__.nodes.bound = {.x=1.000000, .y=1.000000, .z=1.000000, .t=0.010000};

__.nodes.steps = {.x=0.003906, .y=0.003906, .z=0.003906, .t=0.000500};
__.nodes.shape = {.x=256, .y=256, .z=256, .t=20};

__.nodes.bound = {.x=1.000000, .y=1.000000, .z=1.000000, .t=0.010000};
__.param.period = {.x=1, .y=0, .z=0};
__.nodes.steps = {.x=0.003906, .y=0.003906, .z=0.003906, .t=0.000500};
__.param.a = {.x=6.283185, .y=3.141593, .z=3.141593, .t=7.695299};

__.param.b = {.x=0.000000, .y=0.000000, .z=0.000000, .t=7.853982};
__.param.period = {.x=1, .y=0, .z=0};

__.param.a = {.x=6.283185, .y=3.141593, .z=3.141593, .t=7.695299};
__.local.rank = 55;
__.param.b = {.x=0.000000, .y=0.000000, .z=0.000000, .t=7.853982};
__.local.shape = {.x=8, .y=4, .z=4};

__.local.coord = {.x=3, .y=1, .z=3};
__.local.rank = 67;

__.local.shape = {.x=8, .y=4, .z=4};
__.block.shape = {.x=34, .y=66, .z=66};
__.local.coord = {.x=4, .y=0, .z=3};
__.block.coord = {.x=96, .y=64, .z=192};

__.block.elems = 148104;
__.block.shape = {.x=34, .y=66, .z=66};

__.block.coord = {.x=128, .y=0, .z=192};
=======================
__.block.elems = 148104;
__.world.size = 128;

__.world.rank = 56;
=======================

__.world.size = 128;
__.nodes.shape = {.x=256, .y=256, .z=256, .t=20};
__.world.rank = 68;
__.nodes.bound = {.x=1.000000, .y=1.000000, .z=1.000000, .t=0.010000};

__.nodes.steps = {.x=0.003906, .y=0.003906, .z=0.003906, .t=0.000500};
__.nodes.shape = {.x=256, .y=256, .z=256, .t=20};

__.nodes.bound = {.x=1.000000, .y=1.000000, .z=1.000000, .t=0.010000};
__.param.period = {.x=1, .y=0, .z=0};
__.nodes.steps = {.x=0.003906, .y=0.003906, .z=0.003906, .t=0.000500};
__.param.a = {.x=6.283185, .y=3.141593, .z=3.141593, .t=7.695299};

__.param.b = {.x=0.000000, .y=0.000000, .z=0.000000, .t=7.853982};
__.param.period = {.x=1, .y=0, .z=0};

__.param.a = {.x=6.283185, .y=3.141593, .z=3.141593, .t=7.695299};
__.local.rank = 56;
__.param.b = {.x=0.000000, .y=0.000000, .z=0.000000, .t=7.853982};
__.local.shape = {.x=8, .y=4, .z=4};

__.local.coord = {.x=3, .y=2, .z=0};
__.local.rank = 68;

__.local.shape = {.x=8, .y=4, .z=4};
__.block.shape = {.x=34, .y=66, .z=66};
__.local.coord = {.x=4, .y=1, .z=0};
__.block.coord = {.x=96, .y=128, .z=0};

__.block.elems = 148104;
__.block.shape = {.x=34, .y=66, .z=66};

__.block.coord = {.x=128, .y=64, .z=0};
=======================
__.block.elems = 148104;
__.world.size = 128;

__.world.rank = 57;
=======================

__.world.size = 128;
__.nodes.shape = {.x=256, .y=256, .z=256, .t=20};
__.world.rank = 69;
__.nodes.bound = {.x=1.000000, .y=1.000000, .z=1.000000, .t=0.010000};

__.nodes.steps = {.x=0.003906, .y=0.003906, .z=0.003906, .t=0.000500};
__.nodes.shape = {.x=256, .y=256, .z=256, .t=20};

__.nodes.bound = {.x=1.000000, .y=1.000000, .z=1.000000, .t=0.010000};
__.param.period = {.x=1, .y=0, .z=0};
__.nodes.steps = {.x=0.003906, .y=0.003906, .z=0.003906, .t=0.000500};
__.param.a = {.x=6.283185, .y=3.141593, .z=3.141593, .t=7.695299};

__.param.b = {.x=0.000000, .y=0.000000, .z=0.000000, .t=7.853982};
__.param.period = {.x=1, .y=0, .z=0};

__.param.a = {.x=6.283185, .y=3.141593, .z=3.141593, .t=7.695299};
__.local.rank = 57;
__.param.b = {.x=0.000000, .y=0.000000, .z=0.000000, .t=7.853982};
__.local.shape = {.x=8, .y=4, .z=4};

__.local.coord = {.x=3, .y=2, .z=1};
__.local.rank = 69;

__.local.shape = {.x=8, .y=4, .z=4};
__.block.shape = {.x=34, .y=66, .z=66};
__.local.coord = {.x=4, .y=1, .z=1};
__.block.coord = {.x=96, .y=128, .z=64};

__.block.elems = 148104;
__.block.shape = {.x=34, .y=66, .z=66};

__.block.coord = {.x=128, .y=64, .z=64};
=======================
__.block.elems = 148104;
__.world.size = 128;

__.world.rank = 58;
=======================

__.world.size = 128;
__.nodes.shape = {.x=256, .y=256, .z=256, .t=20};
__.world.rank = 70;
__.nodes.bound = {.x=1.000000, .y=1.000000, .z=1.000000, .t=0.010000};

__.nodes.steps = {.x=0.003906, .y=0.003906, .z=0.003906, .t=0.000500};
__.nodes.shape = {.x=256, .y=256, .z=256, .t=20};

__.nodes.bound = {.x=1.000000, .y=1.000000, .z=1.000000, .t=0.010000};
__.param.period = {.x=1, .y=0, .z=0};
__.nodes.steps = {.x=0.003906, .y=0.003906, .z=0.003906, .t=0.000500};
__.param.a = {.x=6.283185, .y=3.141593, .z=3.141593, .t=7.695299};

__.param.b = {.x=0.000000, .y=0.000000, .z=0.000000, .t=7.853982};
__.param.period = {.x=1, .y=0, .z=0};

__.param.a = {.x=6.283185, .y=3.141593, .z=3.141593, .t=7.695299};
__.local.rank = 58;
__.param.b = {.x=0.000000, .y=0.000000, .z=0.000000, .t=7.853982};
__.local.shape = {.x=8, .y=4, .z=4};

__.local.coord = {.x=3, .y=2, .z=2};
__.local.rank = 70;

__.local.shape = {.x=8, .y=4, .z=4};
__.block.shape = {.x=34, .y=66, .z=66};
__.local.coord = {.x=4, .y=1, .z=2};
__.block.coord = {.x=96, .y=128, .z=128};

__.block.elems = 148104;
__.block.shape = {.x=34, .y=66, .z=66};

__.block.coord = {.x=128, .y=64, .z=128};
=======================
__.block.elems = 148104;
__.world.size = 128;

__.world.rank = 59;
=======================

__.world.size = 128;
__.nodes.shape = {.x=256, .y=256, .z=256, .t=20};
__.world.rank = 71;
__.nodes.bound = {.x=1.000000, .y=1.000000, .z=1.000000, .t=0.010000};

__.nodes.steps = {.x=0.003906, .y=0.003906, .z=0.003906, .t=0.000500};
__.nodes.shape = {.x=256, .y=256, .z=256, .t=20};

__.nodes.bound = {.x=1.000000, .y=1.000000, .z=1.000000, .t=0.010000};
__.param.period = {.x=1, .y=0, .z=0};
__.nodes.steps = {.x=0.003906, .y=0.003906, .z=0.003906, .t=0.000500};
__.param.a = {.x=6.283185, .y=3.141593, .z=3.141593, .t=7.695299};

__.param.b = {.x=0.000000, .y=0.000000, .z=0.000000, .t=7.853982};
__.param.period = {.x=1, .y=0, .z=0};

__.param.a = {.x=6.283185, .y=3.141593, .z=3.141593, .t=7.695299};
__.local.rank = 59;
__.param.b = {.x=0.000000, .y=0.000000, .z=0.000000, .t=7.853982};
__.local.shape = {.x=8, .y=4, .z=4};

__.local.coord = {.x=3, .y=2, .z=3};
__.local.rank = 71;

__.local.shape = {.x=8, .y=4, .z=4};
__.block.shape = {.x=34, .y=66, .z=66};
__.local.coord = {.x=4, .y=1, .z=3};
__.block.coord = {.x=96, .y=128, .z=192};

__.block.elems = 148104;
__.block.shape = {.x=34, .y=66, .z=66};

__.block.coord = {.x=128, .y=64, .z=192};
=======================
__.block.elems = 148104;
__.world.size = 128;

__.world.rank = 60;
=======================

__.world.size = 128;
__.nodes.shape = {.x=256, .y=256, .z=256, .t=20};
__.world.rank = 72;
__.nodes.bound = {.x=1.000000, .y=1.000000, .z=1.000000, .t=0.010000};

__.nodes.steps = {.x=0.003906, .y=0.003906, .z=0.003906, .t=0.000500};
__.nodes.shape = {.x=256, .y=256, .z=256, .t=20};

__.nodes.bound = {.x=1.000000, .y=1.000000, .z=1.000000, .t=0.010000};
__.param.period = {.x=1, .y=0, .z=0};
__.nodes.steps = {.x=0.003906, .y=0.003906, .z=0.003906, .t=0.000500};
__.param.a = {.x=6.283185, .y=3.141593, .z=3.141593, .t=7.695299};

__.param.b = {.x=0.000000, .y=0.000000, .z=0.000000, .t=7.853982};
__.param.period = {.x=1, .y=0, .z=0};

__.param.a = {.x=6.283185, .y=3.141593, .z=3.141593, .t=7.695299};
__.local.rank = 60;
__.param.b = {.x=0.000000, .y=0.000000, .z=0.000000, .t=7.853982};
__.local.shape = {.x=8, .y=4, .z=4};

__.local.coord = {.x=3, .y=3, .z=0};
__.local.rank = 72;

__.local.shape = {.x=8, .y=4, .z=4};
__.block.shape = {.x=34, .y=66, .z=66};
__.local.coord = {.x=4, .y=2, .z=0};
__.block.coord = {.x=96, .y=192, .z=0};

__.block.elems = 148104;
__.block.shape = {.x=34, .y=66, .z=66};

__.block.coord = {.x=128, .y=128, .z=0};
=======================
__.block.elems = 148104;
__.world.size = 128;

__.world.rank = 61;
=======================

__.world.size = 128;
__.nodes.shape = {.x=256, .y=256, .z=256, .t=20};
__.world.rank = 73;
__.nodes.bound = {.x=1.000000, .y=1.000000, .z=1.000000, .t=0.010000};

__.nodes.steps = {.x=0.003906, .y=0.003906, .z=0.003906, .t=0.000500};
__.nodes.shape = {.x=256, .y=256, .z=256, .t=20};

__.nodes.bound = {.x=1.000000, .y=1.000000, .z=1.000000, .t=0.010000};
__.param.period = {.x=1, .y=0, .z=0};
__.nodes.steps = {.x=0.003906, .y=0.003906, .z=0.003906, .t=0.000500};
__.param.a = {.x=6.283185, .y=3.141593, .z=3.141593, .t=7.695299};

__.param.b = {.x=0.000000, .y=0.000000, .z=0.000000, .t=7.853982};
__.param.period = {.x=1, .y=0, .z=0};

__.param.a = {.x=6.283185, .y=3.141593, .z=3.141593, .t=7.695299};
__.local.rank = 61;
__.param.b = {.x=0.000000, .y=0.000000, .z=0.000000, .t=7.853982};
__.local.shape = {.x=8, .y=4, .z=4};

__.local.coord = {.x=3, .y=3, .z=1};
__.local.rank = 73;

__.local.shape = {.x=8, .y=4, .z=4};
__.block.shape = {.x=34, .y=66, .z=66};
__.local.coord = {.x=4, .y=2, .z=1};
__.block.coord = {.x=96, .y=192, .z=64};

__.block.elems = 148104;
__.block.shape = {.x=34, .y=66, .z=66};

__.block.coord = {.x=128, .y=128, .z=64};
=======================
__.block.elems = 148104;
__.world.size = 128;

__.world.rank = 62;
=======================

__.world.size = 128;
__.nodes.shape = {.x=256, .y=256, .z=256, .t=20};
__.world.rank = 74;
__.nodes.bound = {.x=1.000000, .y=1.000000, .z=1.000000, .t=0.010000};

__.nodes.steps = {.x=0.003906, .y=0.003906, .z=0.003906, .t=0.000500};
__.nodes.shape = {.x=256, .y=256, .z=256, .t=20};

__.nodes.bound = {.x=1.000000, .y=1.000000, .z=1.000000, .t=0.010000};
__.param.period = {.x=1, .y=0, .z=0};
__.nodes.steps = {.x=0.003906, .y=0.003906, .z=0.003906, .t=0.000500};
__.param.a = {.x=6.283185, .y=3.141593, .z=3.141593, .t=7.695299};

__.param.b = {.x=0.000000, .y=0.000000, .z=0.000000, .t=7.853982};
__.param.period = {.x=1, .y=0, .z=0};

__.param.a = {.x=6.283185, .y=3.141593, .z=3.141593, .t=7.695299};
__.local.rank = 62;
__.param.b = {.x=0.000000, .y=0.000000, .z=0.000000, .t=7.853982};
__.local.shape = {.x=8, .y=4, .z=4};

__.local.coord = {.x=3, .y=3, .z=2};
__.local.rank = 74;

__.local.shape = {.x=8, .y=4, .z=4};
__.block.shape = {.x=34, .y=66, .z=66};
__.local.coord = {.x=4, .y=2, .z=2};
__.block.coord = {.x=96, .y=192, .z=128};

__.block.elems = 148104;
__.block.shape = {.x=34, .y=66, .z=66};

__.block.coord = {.x=128, .y=128, .z=128};
=======================
__.block.elems = 148104;
__.world.size = 128;

__.world.rank = 63;
=======================

__.world.size = 128;
__.nodes.shape = {.x=256, .y=256, .z=256, .t=20};
__.world.rank = 75;
__.nodes.bound = {.x=1.000000, .y=1.000000, .z=1.000000, .t=0.010000};

__.nodes.steps = {.x=0.003906, .y=0.003906, .z=0.003906, .t=0.000500};
__.nodes.shape = {.x=256, .y=256, .z=256, .t=20};

__.nodes.bound = {.x=1.000000, .y=1.000000, .z=1.000000, .t=0.010000};
__.param.period = {.x=1, .y=0, .z=0};
__.nodes.steps = {.x=0.003906, .y=0.003906, .z=0.003906, .t=0.000500};
__.param.a = {.x=6.283185, .y=3.141593, .z=3.141593, .t=7.695299};

__.param.b = {.x=0.000000, .y=0.000000, .z=0.000000, .t=7.853982};
__.param.period = {.x=1, .y=0, .z=0};

__.param.a = {.x=6.283185, .y=3.141593, .z=3.141593, .t=7.695299};
__.local.rank = 63;
__.param.b = {.x=0.000000, .y=0.000000, .z=0.000000, .t=7.853982};
__.local.shape = {.x=8, .y=4, .z=4};

__.local.coord = {.x=3, .y=3, .z=3};
__.local.rank = 75;

__.local.shape = {.x=8, .y=4, .z=4};
__.block.shape = {.x=34, .y=66, .z=66};
__.local.coord = {.x=4, .y=2, .z=3};
__.block.coord = {.x=96, .y=192, .z=192};

__.block.elems = 148104;
__.block.shape = {.x=34, .y=66, .z=66};

__.block.coord = {.x=128, .y=128, .z=192};
__.block.elems = 148104;

=======================
__.world.size = 128;
__.world.rank = 76;

__.nodes.shape = {.x=256, .y=256, .z=256, .t=20};
__.nodes.bound = {.x=1.000000, .y=1.000000, .z=1.000000, .t=0.010000};
__.nodes.steps = {.x=0.003906, .y=0.003906, .z=0.003906, .t=0.000500};

__.param.period = {.x=1, .y=0, .z=0};
__.param.a = {.x=6.283185, .y=3.141593, .z=3.141593, .t=7.695299};
__.param.b = {.x=0.000000, .y=0.000000, .z=0.000000, .t=7.853982};

__.local.rank = 76;
__.local.shape = {.x=8, .y=4, .z=4};
__.local.coord = {.x=4, .y=3, .z=0};

__.block.shape = {.x=34, .y=66, .z=66};
__.block.coord = {.x=128, .y=192, .z=0};
__.block.elems = 148104;

=======================
__.world.size = 128;
__.world.rank = 77;

__.nodes.shape = {.x=256, .y=256, .z=256, .t=20};
__.nodes.bound = {.x=1.000000, .y=1.000000, .z=1.000000, .t=0.010000};
__.nodes.steps = {.x=0.003906, .y=0.003906, .z=0.003906, .t=0.000500};

__.param.period = {.x=1, .y=0, .z=0};
__.param.a = {.x=6.283185, .y=3.141593, .z=3.141593, .t=7.695299};
__.param.b = {.x=0.000000, .y=0.000000, .z=0.000000, .t=7.853982};

__.local.rank = 77;
__.local.shape = {.x=8, .y=4, .z=4};
__.local.coord = {.x=4, .y=3, .z=1};

__.block.shape = {.x=34, .y=66, .z=66};
__.block.coord = {.x=128, .y=192, .z=64};
=======================
__.block.elems = 148104;

__.world.size = 128;
=======================
__.world.rank = 96;
__.world.size = 128;

__.world.rank = 78;
__.nodes.shape = {.x=256, .y=256, .z=256, .t=20};

__.nodes.bound = {.x=1.000000, .y=1.000000, .z=1.000000, .t=0.010000};
__.nodes.shape = {.x=256, .y=256, .z=256, .t=20};
__.nodes.steps = {.x=0.003906, .y=0.003906, .z=0.003906, .t=0.000500};
__.nodes.bound = {.x=1.000000, .y=1.000000, .z=1.000000, .t=0.010000};

__.nodes.steps = {.x=0.003906, .y=0.003906, .z=0.003906, .t=0.000500};
__.param.period = {.x=1, .y=0, .z=0};

__.param.a = {.x=6.283185, .y=3.141593, .z=3.141593, .t=7.695299};
__.param.period = {.x=1, .y=0, .z=0};
__.param.b = {.x=0.000000, .y=0.000000, .z=0.000000, .t=7.853982};
__.param.a = {.x=6.283185, .y=3.141593, .z=3.141593, .t=7.695299};

__.param.b = {.x=0.000000, .y=0.000000, .z=0.000000, .t=7.853982};
__.local.rank = 96;

__.local.shape = {.x=8, .y=4, .z=4};
__.local.rank = 78;
__.local.coord = {.x=6, .y=0, .z=0};
__.local.shape = {.x=8, .y=4, .z=4};

__.local.coord = {.x=4, .y=3, .z=2};
__.block.shape = {.x=34, .y=66, .z=66};

__.block.coord = {.x=192, .y=0, .z=0};
__.block.shape = {.x=34, .y=66, .z=66};
__.block.elems = 148104;
__.block.coord = {.x=128, .y=192, .z=128};

__.block.elems = 148104;
=======================

__.world.size = 128;
=======================
__.world.rank = 97;
__.world.size = 128;

__.world.rank = 79;
__.nodes.shape = {.x=256, .y=256, .z=256, .t=20};

__.nodes.shape = {.x=256, .y=256, .z=256, .t=20};
__.nodes.bound = {.x=1.000000, .y=1.000000, .z=1.000000, .t=0.010000};
__.nodes.bound = {.x=1.000000, .y=1.000000, .z=1.000000, .t=0.010000};
__.nodes.steps = {.x=0.003906, .y=0.003906, .z=0.003906, .t=0.000500};
__.nodes.steps = {.x=0.003906, .y=0.003906, .z=0.003906, .t=0.000500};


__.param.period = {.x=1, .y=0, .z=0};
__.param.period = {.x=1, .y=0, .z=0};
__.param.a = {.x=6.283185, .y=3.141593, .z=3.141593, .t=7.695299};
__.param.a = {.x=6.283185, .y=3.141593, .z=3.141593, .t=7.695299};
__.param.b = {.x=0.000000, .y=0.000000, .z=0.000000, .t=7.853982};
__.param.b = {.x=0.000000, .y=0.000000, .z=0.000000, .t=7.853982};


__.local.rank = 97;
__.local.rank = 79;
__.local.shape = {.x=8, .y=4, .z=4};
__.local.shape = {.x=8, .y=4, .z=4};
__.local.coord = {.x=6, .y=0, .z=1};
__.local.coord = {.x=4, .y=3, .z=3};


__.block.shape = {.x=34, .y=66, .z=66};
__.block.shape = {.x=34, .y=66, .z=66};
__.block.coord = {.x=192, .y=0, .z=64};
__.block.coord = {.x=128, .y=192, .z=192};
__.block.elems = 148104;
__.block.elems = 148104;


=======================
=======================
__.world.size = 128;
__.world.size = 128;
__.world.rank = 98;
__.world.rank = 80;


__.nodes.shape = {.x=256, .y=256, .z=256, .t=20};
__.nodes.shape = {.x=256, .y=256, .z=256, .t=20};
__.nodes.bound = {.x=1.000000, .y=1.000000, .z=1.000000, .t=0.010000};
__.nodes.bound = {.x=1.000000, .y=1.000000, .z=1.000000, .t=0.010000};
__.nodes.steps = {.x=0.003906, .y=0.003906, .z=0.003906, .t=0.000500};
__.nodes.steps = {.x=0.003906, .y=0.003906, .z=0.003906, .t=0.000500};


__.param.period = {.x=1, .y=0, .z=0};
__.param.period = {.x=1, .y=0, .z=0};
__.param.a = {.x=6.283185, .y=3.141593, .z=3.141593, .t=7.695299};
__.param.a = {.x=6.283185, .y=3.141593, .z=3.141593, .t=7.695299};
__.param.b = {.x=0.000000, .y=0.000000, .z=0.000000, .t=7.853982};
__.param.b = {.x=0.000000, .y=0.000000, .z=0.000000, .t=7.853982};


__.local.rank = 98;
__.local.rank = 80;
__.local.shape = {.x=8, .y=4, .z=4};
__.local.shape = {.x=8, .y=4, .z=4};
__.local.coord = {.x=6, .y=0, .z=2};
__.local.coord = {.x=5, .y=0, .z=0};


__.block.shape = {.x=34, .y=66, .z=66};
__.block.shape = {.x=34, .y=66, .z=66};
__.block.coord = {.x=192, .y=0, .z=128};
__.block.coord = {.x=160, .y=0, .z=0};
__.block.elems = 148104;
__.block.elems = 148104;


=======================
=======================
__.world.size = 128;
__.world.size = 128;
__.world.rank = 99;
__.world.rank = 81;


__.nodes.shape = {.x=256, .y=256, .z=256, .t=20};
__.nodes.shape = {.x=256, .y=256, .z=256, .t=20};
__.nodes.bound = {.x=1.000000, .y=1.000000, .z=1.000000, .t=0.010000};
__.nodes.bound = {.x=1.000000, .y=1.000000, .z=1.000000, .t=0.010000};
__.nodes.steps = {.x=0.003906, .y=0.003906, .z=0.003906, .t=0.000500};
__.nodes.steps = {.x=0.003906, .y=0.003906, .z=0.003906, .t=0.000500};


__.param.period = {.x=1, .y=0, .z=0};
__.param.period = {.x=1, .y=0, .z=0};
__.param.a = {.x=6.283185, .y=3.141593, .z=3.141593, .t=7.695299};
__.param.a = {.x=6.283185, .y=3.141593, .z=3.141593, .t=7.695299};
__.param.b = {.x=0.000000, .y=0.000000, .z=0.000000, .t=7.853982};
__.param.b = {.x=0.000000, .y=0.000000, .z=0.000000, .t=7.853982};


__.local.rank = 81;
__.local.rank = 99;
__.local.shape = {.x=8, .y=4, .z=4};
__.local.shape = {.x=8, .y=4, .z=4};
__.local.coord = {.x=5, .y=0, .z=1};
__.local.coord = {.x=6, .y=0, .z=3};


__.block.shape = {.x=34, .y=66, .z=66};
__.block.shape = {.x=34, .y=66, .z=66};
__.block.coord = {.x=160, .y=0, .z=64};
__.block.coord = {.x=192, .y=0, .z=192};
__.block.elems = 148104;
__.block.elems = 148104;


=======================
=======================
__.world.size = 128;
__.world.size = 128;
__.world.rank = 82;
__.world.rank = 100;


__.nodes.shape = {.x=256, .y=256, .z=256, .t=20};
__.nodes.shape = {.x=256, .y=256, .z=256, .t=20};
__.nodes.bound = {.x=1.000000, .y=1.000000, .z=1.000000, .t=0.010000};
__.nodes.bound = {.x=1.000000, .y=1.000000, .z=1.000000, .t=0.010000};
__.nodes.steps = {.x=0.003906, .y=0.003906, .z=0.003906, .t=0.000500};
__.nodes.steps = {.x=0.003906, .y=0.003906, .z=0.003906, .t=0.000500};


__.param.period = {.x=1, .y=0, .z=0};
__.param.period = {.x=1, .y=0, .z=0};
__.param.a = {.x=6.283185, .y=3.141593, .z=3.141593, .t=7.695299};
__.param.a = {.x=6.283185, .y=3.141593, .z=3.141593, .t=7.695299};
__.param.b = {.x=0.000000, .y=0.000000, .z=0.000000, .t=7.853982};
__.param.b = {.x=0.000000, .y=0.000000, .z=0.000000, .t=7.853982};


__.local.rank = 82;
__.local.rank = 100;
__.local.shape = {.x=8, .y=4, .z=4};
__.local.shape = {.x=8, .y=4, .z=4};
__.local.coord = {.x=5, .y=0, .z=2};
__.local.coord = {.x=6, .y=1, .z=0};


__.block.shape = {.x=34, .y=66, .z=66};
__.block.shape = {.x=34, .y=66, .z=66};
__.block.coord = {.x=160, .y=0, .z=128};
__.block.coord = {.x=192, .y=64, .z=0};
__.block.elems = 148104;
__.block.elems = 148104;


=======================
=======================
__.world.size = 128;
__.world.size = 128;
__.world.rank = 83;
__.world.rank = 101;


__.nodes.shape = {.x=256, .y=256, .z=256, .t=20};
__.nodes.shape = {.x=256, .y=256, .z=256, .t=20};
__.nodes.bound = {.x=1.000000, .y=1.000000, .z=1.000000, .t=0.010000};
__.nodes.bound = {.x=1.000000, .y=1.000000, .z=1.000000, .t=0.010000};
__.nodes.steps = {.x=0.003906, .y=0.003906, .z=0.003906, .t=0.000500};
__.nodes.steps = {.x=0.003906, .y=0.003906, .z=0.003906, .t=0.000500};


__.param.period = {.x=1, .y=0, .z=0};
__.param.period = {.x=1, .y=0, .z=0};
__.param.a = {.x=6.283185, .y=3.141593, .z=3.141593, .t=7.695299};
__.param.a = {.x=6.283185, .y=3.141593, .z=3.141593, .t=7.695299};
__.param.b = {.x=0.000000, .y=0.000000, .z=0.000000, .t=7.853982};
__.param.b = {.x=0.000000, .y=0.000000, .z=0.000000, .t=7.853982};


__.local.rank = 83;
__.local.rank = 101;
__.local.shape = {.x=8, .y=4, .z=4};
__.local.shape = {.x=8, .y=4, .z=4};
__.local.coord = {.x=5, .y=0, .z=3};
__.local.coord = {.x=6, .y=1, .z=1};


__.block.shape = {.x=34, .y=66, .z=66};
__.block.shape = {.x=34, .y=66, .z=66};
__.block.coord = {.x=160, .y=0, .z=192};
__.block.coord = {.x=192, .y=64, .z=64};
__.block.elems = 148104;
__.block.elems = 148104;


=======================
=======================
__.world.size = 128;
__.world.size = 128;
__.world.rank = 84;
__.world.rank = 102;


__.nodes.shape = {.x=256, .y=256, .z=256, .t=20};
__.nodes.shape = {.x=256, .y=256, .z=256, .t=20};
__.nodes.bound = {.x=1.000000, .y=1.000000, .z=1.000000, .t=0.010000};
__.nodes.bound = {.x=1.000000, .y=1.000000, .z=1.000000, .t=0.010000};
__.nodes.steps = {.x=0.003906, .y=0.003906, .z=0.003906, .t=0.000500};
__.nodes.steps = {.x=0.003906, .y=0.003906, .z=0.003906, .t=0.000500};


__.param.period = {.x=1, .y=0, .z=0};
__.param.period = {.x=1, .y=0, .z=0};
__.param.a = {.x=6.283185, .y=3.141593, .z=3.141593, .t=7.695299};
__.param.a = {.x=6.283185, .y=3.141593, .z=3.141593, .t=7.695299};
__.param.b = {.x=0.000000, .y=0.000000, .z=0.000000, .t=7.853982};
__.param.b = {.x=0.000000, .y=0.000000, .z=0.000000, .t=7.853982};


__.local.rank = 84;
__.local.rank = 102;
__.local.shape = {.x=8, .y=4, .z=4};
__.local.shape = {.x=8, .y=4, .z=4};
__.local.coord = {.x=5, .y=1, .z=0};
__.local.coord = {.x=6, .y=1, .z=2};


__.block.shape = {.x=34, .y=66, .z=66};
__.block.shape = {.x=34, .y=66, .z=66};
__.block.coord = {.x=160, .y=64, .z=0};
__.block.coord = {.x=192, .y=64, .z=128};
__.block.elems = 148104;
__.block.elems = 148104;


=======================
=======================
__.world.size = 128;
__.world.size = 128;
__.world.rank = 85;
__.world.rank = 103;


__.nodes.shape = {.x=256, .y=256, .z=256, .t=20};
__.nodes.shape = {.x=256, .y=256, .z=256, .t=20};
__.nodes.bound = {.x=1.000000, .y=1.000000, .z=1.000000, .t=0.010000};
__.nodes.bound = {.x=1.000000, .y=1.000000, .z=1.000000, .t=0.010000};
__.nodes.steps = {.x=0.003906, .y=0.003906, .z=0.003906, .t=0.000500};
__.nodes.steps = {.x=0.003906, .y=0.003906, .z=0.003906, .t=0.000500};


__.param.period = {.x=1, .y=0, .z=0};
__.param.period = {.x=1, .y=0, .z=0};
__.param.a = {.x=6.283185, .y=3.141593, .z=3.141593, .t=7.695299};
__.param.a = {.x=6.283185, .y=3.141593, .z=3.141593, .t=7.695299};
__.param.b = {.x=0.000000, .y=0.000000, .z=0.000000, .t=7.853982};
__.param.b = {.x=0.000000, .y=0.000000, .z=0.000000, .t=7.853982};


__.local.rank = 85;
__.local.rank = 103;
__.local.shape = {.x=8, .y=4, .z=4};
__.local.shape = {.x=8, .y=4, .z=4};
__.local.coord = {.x=5, .y=1, .z=1};
__.local.coord = {.x=6, .y=1, .z=3};


__.block.shape = {.x=34, .y=66, .z=66};
__.block.shape = {.x=34, .y=66, .z=66};
__.block.coord = {.x=160, .y=64, .z=64};
__.block.coord = {.x=192, .y=64, .z=192};
__.block.elems = 148104;
__.block.elems = 148104;


=======================
=======================
__.world.size = 128;
__.world.size = 128;
__.world.rank = 86;
__.world.rank = 104;


__.nodes.shape = {.x=256, .y=256, .z=256, .t=20};
__.nodes.shape = {.x=256, .y=256, .z=256, .t=20};
__.nodes.bound = {.x=1.000000, .y=1.000000, .z=1.000000, .t=0.010000};
__.nodes.bound = {.x=1.000000, .y=1.000000, .z=1.000000, .t=0.010000};
__.nodes.steps = {.x=0.003906, .y=0.003906, .z=0.003906, .t=0.000500};
__.nodes.steps = {.x=0.003906, .y=0.003906, .z=0.003906, .t=0.000500};


__.param.period = {.x=1, .y=0, .z=0};
__.param.period = {.x=1, .y=0, .z=0};
__.param.a = {.x=6.283185, .y=3.141593, .z=3.141593, .t=7.695299};
__.param.a = {.x=6.283185, .y=3.141593, .z=3.141593, .t=7.695299};
__.param.b = {.x=0.000000, .y=0.000000, .z=0.000000, .t=7.853982};
__.param.b = {.x=0.000000, .y=0.000000, .z=0.000000, .t=7.853982};


__.local.rank = 86;
__.local.rank = 104;
__.local.shape = {.x=8, .y=4, .z=4};
__.local.shape = {.x=8, .y=4, .z=4};
__.local.coord = {.x=5, .y=1, .z=2};
__.local.coord = {.x=6, .y=2, .z=0};


__.block.shape = {.x=34, .y=66, .z=66};
__.block.shape = {.x=34, .y=66, .z=66};
__.block.coord = {.x=160, .y=64, .z=128};
__.block.coord = {.x=192, .y=128, .z=0};
__.block.elems = 148104;
__.block.elems = 148104;


=======================
=======================
__.world.size = 128;
__.world.size = 128;
__.world.rank = 87;
__.world.rank = 105;


__.nodes.shape = {.x=256, .y=256, .z=256, .t=20};
__.nodes.shape = {.x=256, .y=256, .z=256, .t=20};
__.nodes.bound = {.x=1.000000, .y=1.000000, .z=1.000000, .t=0.010000};
__.nodes.bound = {.x=1.000000, .y=1.000000, .z=1.000000, .t=0.010000};
__.nodes.steps = {.x=0.003906, .y=0.003906, .z=0.003906, .t=0.000500};
__.nodes.steps = {.x=0.003906, .y=0.003906, .z=0.003906, .t=0.000500};


__.param.period = {.x=1, .y=0, .z=0};
__.param.period = {.x=1, .y=0, .z=0};
__.param.a = {.x=6.283185, .y=3.141593, .z=3.141593, .t=7.695299};
__.param.a = {.x=6.283185, .y=3.141593, .z=3.141593, .t=7.695299};
__.param.b = {.x=0.000000, .y=0.000000, .z=0.000000, .t=7.853982};
__.param.b = {.x=0.000000, .y=0.000000, .z=0.000000, .t=7.853982};


__.local.rank = 87;
__.local.rank = 105;
__.local.shape = {.x=8, .y=4, .z=4};
__.local.shape = {.x=8, .y=4, .z=4};
__.local.coord = {.x=5, .y=1, .z=3};
__.local.coord = {.x=6, .y=2, .z=1};


__.block.shape = {.x=34, .y=66, .z=66};
__.block.shape = {.x=34, .y=66, .z=66};
__.block.coord = {.x=160, .y=64, .z=192};
__.block.coord = {.x=192, .y=128, .z=64};
__.block.elems = 148104;
__.block.elems = 148104;


=======================
=======================
__.world.size = 128;
__.world.size = 128;
__.world.rank = 88;
__.world.rank = 106;


__.nodes.shape = {.x=256, .y=256, .z=256, .t=20};
__.nodes.shape = {.x=256, .y=256, .z=256, .t=20};
__.nodes.bound = {.x=1.000000, .y=1.000000, .z=1.000000, .t=0.010000};
__.nodes.bound = {.x=1.000000, .y=1.000000, .z=1.000000, .t=0.010000};
__.nodes.steps = {.x=0.003906, .y=0.003906, .z=0.003906, .t=0.000500};
__.nodes.steps = {.x=0.003906, .y=0.003906, .z=0.003906, .t=0.000500};


__.param.period = {.x=1, .y=0, .z=0};
__.param.period = {.x=1, .y=0, .z=0};
__.param.a = {.x=6.283185, .y=3.141593, .z=3.141593, .t=7.695299};
__.param.a = {.x=6.283185, .y=3.141593, .z=3.141593, .t=7.695299};
__.param.b = {.x=0.000000, .y=0.000000, .z=0.000000, .t=7.853982};
__.param.b = {.x=0.000000, .y=0.000000, .z=0.000000, .t=7.853982};


__.local.rank = 88;
__.local.rank = 106;
__.local.shape = {.x=8, .y=4, .z=4};
__.local.shape = {.x=8, .y=4, .z=4};
__.local.coord = {.x=5, .y=2, .z=0};
__.local.coord = {.x=6, .y=2, .z=2};


__.block.shape = {.x=34, .y=66, .z=66};
__.block.shape = {.x=34, .y=66, .z=66};
__.block.coord = {.x=160, .y=128, .z=0};
__.block.coord = {.x=192, .y=128, .z=128};
__.block.elems = 148104;
__.block.elems = 148104;


=======================
=======================
__.world.size = 128;
__.world.size = 128;
__.world.rank = 89;
__.world.rank = 107;


__.nodes.shape = {.x=256, .y=256, .z=256, .t=20};
__.nodes.shape = {.x=256, .y=256, .z=256, .t=20};
__.nodes.bound = {.x=1.000000, .y=1.000000, .z=1.000000, .t=0.010000};
__.nodes.bound = {.x=1.000000, .y=1.000000, .z=1.000000, .t=0.010000};
__.nodes.steps = {.x=0.003906, .y=0.003906, .z=0.003906, .t=0.000500};
__.nodes.steps = {.x=0.003906, .y=0.003906, .z=0.003906, .t=0.000500};


__.param.period = {.x=1, .y=0, .z=0};
__.param.period = {.x=1, .y=0, .z=0};
__.param.a = {.x=6.283185, .y=3.141593, .z=3.141593, .t=7.695299};
__.param.a = {.x=6.283185, .y=3.141593, .z=3.141593, .t=7.695299};
__.param.b = {.x=0.000000, .y=0.000000, .z=0.000000, .t=7.853982};
__.param.b = {.x=0.000000, .y=0.000000, .z=0.000000, .t=7.853982};


__.local.rank = 89;
__.local.rank = 107;
__.local.shape = {.x=8, .y=4, .z=4};
__.local.shape = {.x=8, .y=4, .z=4};
__.local.coord = {.x=5, .y=2, .z=1};
__.local.coord = {.x=6, .y=2, .z=3};


__.block.shape = {.x=34, .y=66, .z=66};
__.block.shape = {.x=34, .y=66, .z=66};
__.block.coord = {.x=160, .y=128, .z=64};
__.block.coord = {.x=192, .y=128, .z=192};
__.block.elems = 148104;
__.block.elems = 148104;


=======================
=======================
__.world.size = 128;
__.world.size = 128;
__.world.rank = 90;
__.world.rank = 108;


__.nodes.shape = {.x=256, .y=256, .z=256, .t=20};
__.nodes.shape = {.x=256, .y=256, .z=256, .t=20};
__.nodes.bound = {.x=1.000000, .y=1.000000, .z=1.000000, .t=0.010000};
__.nodes.bound = {.x=1.000000, .y=1.000000, .z=1.000000, .t=0.010000};
__.nodes.steps = {.x=0.003906, .y=0.003906, .z=0.003906, .t=0.000500};
__.nodes.steps = {.x=0.003906, .y=0.003906, .z=0.003906, .t=0.000500};


__.param.period = {.x=1, .y=0, .z=0};
__.param.period = {.x=1, .y=0, .z=0};
__.param.a = {.x=6.283185, .y=3.141593, .z=3.141593, .t=7.695299};
__.param.a = {.x=6.283185, .y=3.141593, .z=3.141593, .t=7.695299};
__.param.b = {.x=0.000000, .y=0.000000, .z=0.000000, .t=7.853982};
__.param.b = {.x=0.000000, .y=0.000000, .z=0.000000, .t=7.853982};


__.local.rank = 90;
__.local.rank = 108;
__.local.shape = {.x=8, .y=4, .z=4};
__.local.shape = {.x=8, .y=4, .z=4};
__.local.coord = {.x=5, .y=2, .z=2};
__.local.coord = {.x=6, .y=3, .z=0};


__.block.shape = {.x=34, .y=66, .z=66};
__.block.shape = {.x=34, .y=66, .z=66};
__.block.coord = {.x=160, .y=128, .z=128};
__.block.coord = {.x=192, .y=192, .z=0};
__.block.elems = 148104;
__.block.elems = 148104;


=======================
=======================
__.world.size = 128;
__.world.size = 128;
__.world.rank = 91;
__.world.rank = 109;


__.nodes.shape = {.x=256, .y=256, .z=256, .t=20};
__.nodes.shape = {.x=256, .y=256, .z=256, .t=20};
__.nodes.bound = {.x=1.000000, .y=1.000000, .z=1.000000, .t=0.010000};
__.nodes.bound = {.x=1.000000, .y=1.000000, .z=1.000000, .t=0.010000};
__.nodes.steps = {.x=0.003906, .y=0.003906, .z=0.003906, .t=0.000500};
__.nodes.steps = {.x=0.003906, .y=0.003906, .z=0.003906, .t=0.000500};


__.param.period = {.x=1, .y=0, .z=0};
__.param.period = {.x=1, .y=0, .z=0};
__.param.a = {.x=6.283185, .y=3.141593, .z=3.141593, .t=7.695299};
__.param.a = {.x=6.283185, .y=3.141593, .z=3.141593, .t=7.695299};
__.param.b = {.x=0.000000, .y=0.000000, .z=0.000000, .t=7.853982};
__.param.b = {.x=0.000000, .y=0.000000, .z=0.000000, .t=7.853982};


__.local.rank = 91;
__.local.rank = 109;
__.local.shape = {.x=8, .y=4, .z=4};
__.local.shape = {.x=8, .y=4, .z=4};
__.local.coord = {.x=5, .y=2, .z=3};
__.local.coord = {.x=6, .y=3, .z=1};


__.block.shape = {.x=34, .y=66, .z=66};
__.block.shape = {.x=34, .y=66, .z=66};
__.block.coord = {.x=160, .y=128, .z=192};
__.block.coord = {.x=192, .y=192, .z=64};
__.block.elems = 148104;
__.block.elems = 148104;


=======================
=======================
__.world.size = 128;
__.world.size = 128;
__.world.rank = 92;
__.world.rank = 110;


__.nodes.shape = {.x=256, .y=256, .z=256, .t=20};
__.nodes.shape = {.x=256, .y=256, .z=256, .t=20};
__.nodes.bound = {.x=1.000000, .y=1.000000, .z=1.000000, .t=0.010000};
__.nodes.bound = {.x=1.000000, .y=1.000000, .z=1.000000, .t=0.010000};
__.nodes.steps = {.x=0.003906, .y=0.003906, .z=0.003906, .t=0.000500};
__.nodes.steps = {.x=0.003906, .y=0.003906, .z=0.003906, .t=0.000500};


__.param.period = {.x=1, .y=0, .z=0};
__.param.period = {.x=1, .y=0, .z=0};
__.param.a = {.x=6.283185, .y=3.141593, .z=3.141593, .t=7.695299};
__.param.a = {.x=6.283185, .y=3.141593, .z=3.141593, .t=7.695299};
__.param.b = {.x=0.000000, .y=0.000000, .z=0.000000, .t=7.853982};
__.param.b = {.x=0.000000, .y=0.000000, .z=0.000000, .t=7.853982};


__.local.rank = 92;
__.local.rank = 110;
__.local.shape = {.x=8, .y=4, .z=4};
__.local.shape = {.x=8, .y=4, .z=4};
__.local.coord = {.x=5, .y=3, .z=0};
__.local.coord = {.x=6, .y=3, .z=2};


__.block.shape = {.x=34, .y=66, .z=66};
__.block.shape = {.x=34, .y=66, .z=66};
__.block.coord = {.x=160, .y=192, .z=0};
__.block.coord = {.x=192, .y=192, .z=128};
__.block.elems = 148104;
__.block.elems = 148104;


=======================
=======================
__.world.size = 128;
__.world.size = 128;
__.world.rank = 93;
__.world.rank = 111;


__.nodes.shape = {.x=256, .y=256, .z=256, .t=20};
__.nodes.shape = {.x=256, .y=256, .z=256, .t=20};
__.nodes.bound = {.x=1.000000, .y=1.000000, .z=1.000000, .t=0.010000};
__.nodes.bound = {.x=1.000000, .y=1.000000, .z=1.000000, .t=0.010000};
__.nodes.steps = {.x=0.003906, .y=0.003906, .z=0.003906, .t=0.000500};
__.nodes.steps = {.x=0.003906, .y=0.003906, .z=0.003906, .t=0.000500};


__.param.period = {.x=1, .y=0, .z=0};
__.param.period = {.x=1, .y=0, .z=0};
__.param.a = {.x=6.283185, .y=3.141593, .z=3.141593, .t=7.695299};
__.param.a = {.x=6.283185, .y=3.141593, .z=3.141593, .t=7.695299};
__.param.b = {.x=0.000000, .y=0.000000, .z=0.000000, .t=7.853982};
__.param.b = {.x=0.000000, .y=0.000000, .z=0.000000, .t=7.853982};


__.local.rank = 93;
__.local.rank = 111;
__.local.shape = {.x=8, .y=4, .z=4};
__.local.shape = {.x=8, .y=4, .z=4};
__.local.coord = {.x=5, .y=3, .z=1};
__.local.coord = {.x=6, .y=3, .z=3};


__.block.shape = {.x=34, .y=66, .z=66};
__.block.shape = {.x=34, .y=66, .z=66};
__.block.coord = {.x=160, .y=192, .z=64};
__.block.coord = {.x=192, .y=192, .z=192};
__.block.elems = 148104;
__.block.elems = 148104;


=======================
=======================
__.world.size = 128;
__.world.size = 128;
__.world.rank = 94;
__.world.rank = 112;


__.nodes.shape = {.x=256, .y=256, .z=256, .t=20};
__.nodes.shape = {.x=256, .y=256, .z=256, .t=20};
__.nodes.bound = {.x=1.000000, .y=1.000000, .z=1.000000, .t=0.010000};
__.nodes.bound = {.x=1.000000, .y=1.000000, .z=1.000000, .t=0.010000};
__.nodes.steps = {.x=0.003906, .y=0.003906, .z=0.003906, .t=0.000500};
__.nodes.steps = {.x=0.003906, .y=0.003906, .z=0.003906, .t=0.000500};


__.param.period = {.x=1, .y=0, .z=0};
__.param.period = {.x=1, .y=0, .z=0};
__.param.a = {.x=6.283185, .y=3.141593, .z=3.141593, .t=7.695299};
__.param.a = {.x=6.283185, .y=3.141593, .z=3.141593, .t=7.695299};
__.param.b = {.x=0.000000, .y=0.000000, .z=0.000000, .t=7.853982};
__.param.b = {.x=0.000000, .y=0.000000, .z=0.000000, .t=7.853982};


__.local.rank = 94;
__.local.rank = 112;
__.local.shape = {.x=8, .y=4, .z=4};
__.local.shape = {.x=8, .y=4, .z=4};
__.local.coord = {.x=5, .y=3, .z=2};
__.local.coord = {.x=7, .y=0, .z=0};


__.block.shape = {.x=34, .y=66, .z=66};
__.block.shape = {.x=34, .y=66, .z=66};
__.block.coord = {.x=160, .y=192, .z=128};
__.block.coord = {.x=224, .y=0, .z=0};
__.block.elems = 148104;
__.block.elems = 148104;


=======================
=======================
__.world.size = 128;
__.world.size = 128;
__.world.rank = 95;
__.world.rank = 113;


__.nodes.shape = {.x=256, .y=256, .z=256, .t=20};
__.nodes.shape = {.x=256, .y=256, .z=256, .t=20};
__.nodes.bound = {.x=1.000000, .y=1.000000, .z=1.000000, .t=0.010000};
__.nodes.bound = {.x=1.000000, .y=1.000000, .z=1.000000, .t=0.010000};
__.nodes.steps = {.x=0.003906, .y=0.003906, .z=0.003906, .t=0.000500};
__.nodes.steps = {.x=0.003906, .y=0.003906, .z=0.003906, .t=0.000500};


__.param.period = {.x=1, .y=0, .z=0};
__.param.period = {.x=1, .y=0, .z=0};
__.param.a = {.x=6.283185, .y=3.141593, .z=3.141593, .t=7.695299};
__.param.a = {.x=6.283185, .y=3.141593, .z=3.141593, .t=7.695299};
__.param.b = {.x=0.000000, .y=0.000000, .z=0.000000, .t=7.853982};
__.param.b = {.x=0.000000, .y=0.000000, .z=0.000000, .t=7.853982};


__.local.rank = 95;
__.local.rank = 113;
__.local.shape = {.x=8, .y=4, .z=4};
__.local.shape = {.x=8, .y=4, .z=4};
__.local.coord = {.x=5, .y=3, .z=3};
__.local.coord = {.x=7, .y=0, .z=1};


__.block.shape = {.x=34, .y=66, .z=66};
__.block.shape = {.x=34, .y=66, .z=66};
__.block.coord = {.x=160, .y=192, .z=192};
__.block.coord = {.x=224, .y=0, .z=64};
__.block.elems = 148104;
__.block.elems = 148104;


=======================
__.world.size = 128;
__.world.rank = 114;

__.nodes.shape = {.x=256, .y=256, .z=256, .t=20};
__.nodes.bound = {.x=1.000000, .y=1.000000, .z=1.000000, .t=0.010000};
__.nodes.steps = {.x=0.003906, .y=0.003906, .z=0.003906, .t=0.000500};

__.param.period = {.x=1, .y=0, .z=0};
__.param.a = {.x=6.283185, .y=3.141593, .z=3.141593, .t=7.695299};
__.param.b = {.x=0.000000, .y=0.000000, .z=0.000000, .t=7.853982};

__.local.rank = 114;
__.local.shape = {.x=8, .y=4, .z=4};
__.local.coord = {.x=7, .y=0, .z=2};

__.block.shape = {.x=34, .y=66, .z=66};
__.block.coord = {.x=224, .y=0, .z=128};
__.block.elems = 148104;

=======================
__.world.size = 128;
__.world.rank = 115;

__.nodes.shape = {.x=256, .y=256, .z=256, .t=20};
__.nodes.bound = {.x=1.000000, .y=1.000000, .z=1.000000, .t=0.010000};
__.nodes.steps = {.x=0.003906, .y=0.003906, .z=0.003906, .t=0.000500};

__.param.period = {.x=1, .y=0, .z=0};
__.param.a = {.x=6.283185, .y=3.141593, .z=3.141593, .t=7.695299};
__.param.b = {.x=0.000000, .y=0.000000, .z=0.000000, .t=7.853982};

__.local.rank = 115;
__.local.shape = {.x=8, .y=4, .z=4};
__.local.coord = {.x=7, .y=0, .z=3};

__.block.shape = {.x=34, .y=66, .z=66};
__.block.coord = {.x=224, .y=0, .z=192};
__.block.elems = 148104;

=======================
__.world.size = 128;
__.world.rank = 116;

__.nodes.shape = {.x=256, .y=256, .z=256, .t=20};
__.nodes.bound = {.x=1.000000, .y=1.000000, .z=1.000000, .t=0.010000};
__.nodes.steps = {.x=0.003906, .y=0.003906, .z=0.003906, .t=0.000500};

__.param.period = {.x=1, .y=0, .z=0};
__.param.a = {.x=6.283185, .y=3.141593, .z=3.141593, .t=7.695299};
__.param.b = {.x=0.000000, .y=0.000000, .z=0.000000, .t=7.853982};

__.local.rank = 116;
__.local.shape = {.x=8, .y=4, .z=4};
__.local.coord = {.x=7, .y=1, .z=0};

__.block.shape = {.x=34, .y=66, .z=66};
__.block.coord = {.x=224, .y=64, .z=0};
__.block.elems = 148104;

=======================
__.world.size = 128;
__.world.rank = 117;

__.nodes.shape = {.x=256, .y=256, .z=256, .t=20};
__.nodes.bound = {.x=1.000000, .y=1.000000, .z=1.000000, .t=0.010000};
__.nodes.steps = {.x=0.003906, .y=0.003906, .z=0.003906, .t=0.000500};

__.param.period = {.x=1, .y=0, .z=0};
__.param.a = {.x=6.283185, .y=3.141593, .z=3.141593, .t=7.695299};
__.param.b = {.x=0.000000, .y=0.000000, .z=0.000000, .t=7.853982};

__.local.rank = 117;
__.local.shape = {.x=8, .y=4, .z=4};
__.local.coord = {.x=7, .y=1, .z=1};

__.block.shape = {.x=34, .y=66, .z=66};
__.block.coord = {.x=224, .y=64, .z=64};
__.block.elems = 148104;

=======================
__.world.size = 128;
__.world.rank = 118;

__.nodes.shape = {.x=256, .y=256, .z=256, .t=20};
__.nodes.bound = {.x=1.000000, .y=1.000000, .z=1.000000, .t=0.010000};
__.nodes.steps = {.x=0.003906, .y=0.003906, .z=0.003906, .t=0.000500};

__.param.period = {.x=1, .y=0, .z=0};
__.param.a = {.x=6.283185, .y=3.141593, .z=3.141593, .t=7.695299};
__.param.b = {.x=0.000000, .y=0.000000, .z=0.000000, .t=7.853982};

__.local.rank = 118;
__.local.shape = {.x=8, .y=4, .z=4};
__.local.coord = {.x=7, .y=1, .z=2};

__.block.shape = {.x=34, .y=66, .z=66};
__.block.coord = {.x=224, .y=64, .z=128};
__.block.elems = 148104;

=======================
__.world.size = 128;
__.world.rank = 119;

__.nodes.shape = {.x=256, .y=256, .z=256, .t=20};
__.nodes.bound = {.x=1.000000, .y=1.000000, .z=1.000000, .t=0.010000};
__.nodes.steps = {.x=0.003906, .y=0.003906, .z=0.003906, .t=0.000500};

__.param.period = {.x=1, .y=0, .z=0};
__.param.a = {.x=6.283185, .y=3.141593, .z=3.141593, .t=7.695299};
__.param.b = {.x=0.000000, .y=0.000000, .z=0.000000, .t=7.853982};

__.local.rank = 119;
__.local.shape = {.x=8, .y=4, .z=4};
__.local.coord = {.x=7, .y=1, .z=3};

__.block.shape = {.x=34, .y=66, .z=66};
__.block.coord = {.x=224, .y=64, .z=192};
__.block.elems = 148104;

=======================
__.world.size = 128;
__.world.rank = 120;

__.nodes.shape = {.x=256, .y=256, .z=256, .t=20};
__.nodes.bound = {.x=1.000000, .y=1.000000, .z=1.000000, .t=0.010000};
__.nodes.steps = {.x=0.003906, .y=0.003906, .z=0.003906, .t=0.000500};

__.param.period = {.x=1, .y=0, .z=0};
__.param.a = {.x=6.283185, .y=3.141593, .z=3.141593, .t=7.695299};
__.param.b = {.x=0.000000, .y=0.000000, .z=0.000000, .t=7.853982};

__.local.rank = 120;
__.local.shape = {.x=8, .y=4, .z=4};
__.local.coord = {.x=7, .y=2, .z=0};

__.block.shape = {.x=34, .y=66, .z=66};
__.block.coord = {.x=224, .y=128, .z=0};
__.block.elems = 148104;

=======================
__.world.size = 128;
__.world.rank = 121;

__.nodes.shape = {.x=256, .y=256, .z=256, .t=20};
__.nodes.bound = {.x=1.000000, .y=1.000000, .z=1.000000, .t=0.010000};
__.nodes.steps = {.x=0.003906, .y=0.003906, .z=0.003906, .t=0.000500};

__.param.period = {.x=1, .y=0, .z=0};
__.param.a = {.x=6.283185, .y=3.141593, .z=3.141593, .t=7.695299};
__.param.b = {.x=0.000000, .y=0.000000, .z=0.000000, .t=7.853982};

__.local.rank = 121;
__.local.shape = {.x=8, .y=4, .z=4};
__.local.coord = {.x=7, .y=2, .z=1};

__.block.shape = {.x=34, .y=66, .z=66};
__.block.coord = {.x=224, .y=128, .z=64};
__.block.elems = 148104;

=======================
__.world.size = 128;
__.world.rank = 122;

__.nodes.shape = {.x=256, .y=256, .z=256, .t=20};
__.nodes.bound = {.x=1.000000, .y=1.000000, .z=1.000000, .t=0.010000};
__.nodes.steps = {.x=0.003906, .y=0.003906, .z=0.003906, .t=0.000500};

__.param.period = {.x=1, .y=0, .z=0};
__.param.a = {.x=6.283185, .y=3.141593, .z=3.141593, .t=7.695299};
__.param.b = {.x=0.000000, .y=0.000000, .z=0.000000, .t=7.853982};

__.local.rank = 122;
__.local.shape = {.x=8, .y=4, .z=4};
__.local.coord = {.x=7, .y=2, .z=2};

__.block.shape = {.x=34, .y=66, .z=66};
__.block.coord = {.x=224, .y=128, .z=128};
__.block.elems = 148104;

=======================
__.world.size = 128;
__.world.rank = 123;

__.nodes.shape = {.x=256, .y=256, .z=256, .t=20};
__.nodes.bound = {.x=1.000000, .y=1.000000, .z=1.000000, .t=0.010000};
__.nodes.steps = {.x=0.003906, .y=0.003906, .z=0.003906, .t=0.000500};

__.param.period = {.x=1, .y=0, .z=0};
__.param.a = {.x=6.283185, .y=3.141593, .z=3.141593, .t=7.695299};
__.param.b = {.x=0.000000, .y=0.000000, .z=0.000000, .t=7.853982};

__.local.rank = 123;
__.local.shape = {.x=8, .y=4, .z=4};
__.local.coord = {.x=7, .y=2, .z=3};

__.block.shape = {.x=34, .y=66, .z=66};
__.block.coord = {.x=224, .y=128, .z=192};
__.block.elems = 148104;

=======================
__.world.size = 128;
__.world.rank = 124;

__.nodes.shape = {.x=256, .y=256, .z=256, .t=20};
__.nodes.bound = {.x=1.000000, .y=1.000000, .z=1.000000, .t=0.010000};
__.nodes.steps = {.x=0.003906, .y=0.003906, .z=0.003906, .t=0.000500};

__.param.period = {.x=1, .y=0, .z=0};
__.param.a = {.x=6.283185, .y=3.141593, .z=3.141593, .t=7.695299};
__.param.b = {.x=0.000000, .y=0.000000, .z=0.000000, .t=7.853982};

__.local.rank = 124;
__.local.shape = {.x=8, .y=4, .z=4};
__.local.coord = {.x=7, .y=3, .z=0};

__.block.shape = {.x=34, .y=66, .z=66};
__.block.coord = {.x=224, .y=192, .z=0};
__.block.elems = 148104;

=======================
__.world.size = 128;
__.world.rank = 125;

__.nodes.shape = {.x=256, .y=256, .z=256, .t=20};
__.nodes.bound = {.x=1.000000, .y=1.000000, .z=1.000000, .t=0.010000};
__.nodes.steps = {.x=0.003906, .y=0.003906, .z=0.003906, .t=0.000500};

__.param.period = {.x=1, .y=0, .z=0};
__.param.a = {.x=6.283185, .y=3.141593, .z=3.141593, .t=7.695299};
__.param.b = {.x=0.000000, .y=0.000000, .z=0.000000, .t=7.853982};

__.local.rank = 125;
__.local.shape = {.x=8, .y=4, .z=4};
__.local.coord = {.x=7, .y=3, .z=1};

__.block.shape = {.x=34, .y=66, .z=66};
__.block.coord = {.x=224, .y=192, .z=64};
__.block.elems = 148104;

=======================
__.world.size = 128;
__.world.rank = 126;

__.nodes.shape = {.x=256, .y=256, .z=256, .t=20};
__.nodes.bound = {.x=1.000000, .y=1.000000, .z=1.000000, .t=0.010000};
__.nodes.steps = {.x=0.003906, .y=0.003906, .z=0.003906, .t=0.000500};

__.param.period = {.x=1, .y=0, .z=0};
__.param.a = {.x=6.283185, .y=3.141593, .z=3.141593, .t=7.695299};
__.param.b = {.x=0.000000, .y=0.000000, .z=0.000000, .t=7.853982};

__.local.rank = 126;
__.local.shape = {.x=8, .y=4, .z=4};
__.local.coord = {.x=7, .y=3, .z=2};

__.block.shape = {.x=34, .y=66, .z=66};
__.block.coord = {.x=224, .y=192, .z=128};
__.block.elems = 148104;

=======================
__.world.size = 128;
__.world.rank = 127;

__.nodes.shape = {.x=256, .y=256, .z=256, .t=20};
__.nodes.bound = {.x=1.000000, .y=1.000000, .z=1.000000, .t=0.010000};
__.nodes.steps = {.x=0.003906, .y=0.003906, .z=0.003906, .t=0.000500};

__.param.period = {.x=1, .y=0, .z=0};
__.param.a = {.x=6.283185, .y=3.141593, .z=3.141593, .t=7.695299};
__.param.b = {.x=0.000000, .y=0.000000, .z=0.000000, .t=7.853982};

__.local.rank = 127;
__.local.shape = {.x=8, .y=4, .z=4};
__.local.coord = {.x=7, .y=3, .z=3};

__.block.shape = {.x=34, .y=66, .z=66};
__.block.coord = {.x=224, .y=192, .z=192};
__.block.elems = 148104;

__TRIALS__.append((5.317897e-01, [0.000000e+00, 2.695524e-10, 1.078202e-09, 2.425924e-09, 4.312679e-09, 6.738411e-09, 9.703048e-09, 1.320650e-08, 1.724867e-08, 2.182944e-08, 2.694866e-08, 3.260619e-08, 3.880185e-08, 4.553548e-08, 5.280686e-08, 6.061578e-08, 6.896201e-08, 7.784531e-08, 8.726540e-08, 9.722201e-08, 1.077149e-07, ]))
__TRIALS__.append((5.303493e-01, [0.000000e+00, 2.695524e-10, 1.078202e-09, 2.425924e-09, 4.312679e-09, 6.738411e-09, 9.703048e-09, 1.320650e-08, 1.724867e-08, 2.182944e-08, 2.694866e-08, 3.260619e-08, 3.880185e-08, 4.553548e-08, 5.280686e-08, 6.061578e-08, 6.896201e-08, 7.784531e-08, 8.726540e-08, 9.722201e-08, 1.077149e-07, ]))
__TRIALS__.append((5.302291e-01, [0.000000e+00, 2.695524e-10, 1.078202e-09, 2.425924e-09, 4.312679e-09, 6.738411e-09, 9.703048e-09, 1.320650e-08, 1.724867e-08, 2.182944e-08, 2.694866e-08, 3.260619e-08, 3.880185e-08, 4.553548e-08, 5.280686e-08, 6.061578e-08, 6.896201e-08, 7.784531e-08, 8.726540e-08, 9.722201e-08, 1.077149e-07, ]))
__TRIALS__.append((5.302418e-01, [0.000000e+00, 2.695524e-10, 1.078202e-09, 2.425924e-09, 4.312679e-09, 6.738411e-09, 9.703048e-09, 1.320650e-08, 1.724867e-08, 2.182944e-08, 2.694866e-08, 3.260619e-08, 3.880185e-08, 4.553548e-08, 5.280686e-08, 6.061578e-08, 6.896201e-08, 7.784531e-08, 8.726540e-08, 9.722201e-08, 1.077149e-07, ]))
__TRIALS__.append((5.302612e-01, [0.000000e+00, 2.695524e-10, 1.078202e-09, 2.425924e-09, 4.312679e-09, 6.738411e-09, 9.703048e-09, 1.320650e-08, 1.724867e-08, 2.182944e-08, 2.694866e-08, 3.260619e-08, 3.880185e-08, 4.553548e-08, 5.280686e-08, 6.061578e-08, 6.896201e-08, 7.784531e-08, 8.726540e-08, 9.722201e-08, 1.077149e-07, ]))
__TRIALS__.append((5.302777e-01, [0.000000e+00, 2.695524e-10, 1.078202e-09, 2.425924e-09, 4.312679e-09, 6.738411e-09, 9.703048e-09, 1.320650e-08, 1.724867e-08, 2.182944e-08, 2.694866e-08, 3.260619e-08, 3.880185e-08, 4.553548e-08, 5.280686e-08, 6.061578e-08, 6.896201e-08, 7.784531e-08, 8.726540e-08, 9.722201e-08, 1.077149e-07, ]))
__TRIALS__.append((5.302150e-01, [0.000000e+00, 2.695524e-10, 1.078202e-09, 2.425924e-09, 4.312679e-09, 6.738411e-09, 9.703048e-09, 1.320650e-08, 1.724867e-08, 2.182944e-08, 2.694866e-08, 3.260619e-08, 3.880185e-08, 4.553548e-08, 5.280686e-08, 6.061578e-08, 6.896201e-08, 7.784531e-08, 8.726540e-08, 9.722201e-08, 1.077149e-07, ]))
__TRIALS__.append((5.302874e-01, [0.000000e+00, 2.695524e-10, 1.078202e-09, 2.425924e-09, 4.312679e-09, 6.738411e-09, 9.703048e-09, 1.320650e-08, 1.724867e-08, 2.182944e-08, 2.694866e-08, 3.260619e-08, 3.880185e-08, 4.553548e-08, 5.280686e-08, 6.061578e-08, 6.896201e-08, 7.784531e-08, 8.726540e-08, 9.722201e-08, 1.077149e-07, ]))
__TRIALS__.append((5.302879e-01, [0.000000e+00, 2.695524e-10, 1.078202e-09, 2.425924e-09, 4.312679e-09, 6.738411e-09, 9.703048e-09, 1.320650e-08, 1.724867e-08, 2.182944e-08, 2.694866e-08, 3.260619e-08, 3.880185e-08, 4.553548e-08, 5.280686e-08, 6.061578e-08, 6.896201e-08, 7.784531e-08, 8.726540e-08, 9.722201e-08, 1.077149e-07, ]))
__TRIALS__.append((5.302989e-01, [0.000000e+00, 2.695524e-10, 1.078202e-09, 2.425924e-09, 4.312679e-09, 6.738411e-09, 9.703048e-09, 1.320650e-08, 1.724867e-08, 2.182944e-08, 2.694866e-08, 3.260619e-08, 3.880185e-08, 4.553548e-08, 5.280686e-08, 6.061578e-08, 6.896201e-08, 7.784531e-08, 8.726540e-08, 9.722201e-08, 1.077149e-07, ]))
