Sender: LSF System <lsfadmin@polus-c4-ib.bmc.hpc.cs.msu.ru>
Subject: Job 798496: <# this file was automaticly created by mpisubmit.pl script for edu-cmc-skmodel21-622-16 #;source /polusfs/setenv/setup.SMPI;#BSUB -n 1;#BSUB -W 00:15;#BSUB -o main_filtered_error.%J.out;#BSUB -e main_filtered_error.%J.err;OMP_NUM_THREADS=1 mpiexec main_filtered_error 1.5e-6 42> in cluster <MSUCluster> Done

Job <# this file was automaticly created by mpisubmit.pl script for edu-cmc-skmodel21-622-16 #;source /polusfs/setenv/setup.SMPI;#BSUB -n 1;#BSUB -W 00:15;#BSUB -o main_filtered_error.%J.out;#BSUB -e main_filtered_error.%J.err;OMP_NUM_THREADS=1 mpiexec main_filtered_error 1.5e-6 42> was submitted from host <polus-ib.bmc.hpc.cs.msu.ru> by user <edu-cmc-skmodel21-622-16> in cluster <MSUCluster> at Sun Nov  7 06:34:59 2021
Job was executed on host(s) <polus-c4-ib.bmc.hpc.cs.msu.ru>, in queue <short>, as user <edu-cmc-skmodel21-622-16> in cluster <MSUCluster> at Sun Nov  7 06:35:00 2021
</home_edu/edu-cmc-skmodel21-622/edu-cmc-skmodel21-622-16> was used as the home directory.
</home_edu/edu-cmc-skmodel21-622/edu-cmc-skmodel21-622-16/solution> was used as the working directory.
Started at Sun Nov  7 06:35:00 2021
Terminated at Sun Nov  7 06:35:06 2021
Results reported at Sun Nov  7 06:35:06 2021

Your job looked like:

------------------------------------------------------------
# LSBATCH: User input
# this file was automaticly created by mpisubmit.pl script for edu-cmc-skmodel21-622-16 #
source /polusfs/setenv/setup.SMPI
#BSUB -n 1
#BSUB -W 00:15
#BSUB -o main_filtered_error.%J.out
#BSUB -e main_filtered_error.%J.err
OMP_NUM_THREADS=1 mpiexec main_filtered_error 1.5e-6 42

------------------------------------------------------------

Successfully completed.

Resource usage summary:

    CPU time :                                   5.94 sec.
    Max Memory :                                 70 MB
    Average Memory :                             47.00 MB
    Total Requested Memory :                     -
    Delta Memory :                               -
    Max Swap :                                   -
    Max Processes :                              5
    Max Threads :                                12
    Run time :                                   10 sec.
    Turnaround time :                            7 sec.

The output (if any) follows:

# Running __TRIALS__ with FILTERED_SAMPLING/ERROR_STOPPING and epsilon=1.500000e-06, comm_size=1, seed=42
__TRIALS__ = [
#   (trial_time, trial_iters, trial_points, trial_error),
    (2.847472e-02, 309120, 80833, 4.406536e-07),  # __TRIALS__
    (4.888885e-01, 4838400, 1266259, 5.279713e-07),  # __TRIALS__
    (1.993349e-01, 1854720, 485790, 4.978810e-07),  # __TRIALS__
    (1.409142e-01, 1444800, 378344, 8.110726e-07),  # __TRIALS__
    (3.060240e-01, 3104640, 812725, 6.039749e-07),  # __TRIALS__
    (1.560842e-01, 1565760, 410178, 1.133432e-06),  # __TRIALS__
    (1.788298e-01, 1794240, 469636, 9.467169e-07),  # __TRIALS__
    (4.856579e-01, 4885440, 1278397, 1.309078e-06),  # __TRIALS__
    (3.430882e+00, 34419840, 9010864, 2.307171e-07),  # __TRIALS__
    (2.110607e-01, 2116800, 553890, 1.293912e-06),  # __TRIALS__
]  # __TRIALS__
# Done.


PS:

Read file <main_filtered_error.798496.err> for stderr output of this job.

