Sender: LSF System <lsfadmin@polus-c3-ib.bmc.hpc.cs.msu.ru>
Subject: Job 836933: <# this file was automaticly created by mpisubmit.pl script for edu-cmc-skmodel21-622-16 #;source /polusfs/setenv/setup.SMPI;#BSUB -n 20;#BSUB -W 00:15;#BSUB -o main.%J.out;#BSUB -e main.%J.err;OMP_NUM_THREADS=1 mpiexec main 3.141592653589793 0.01 256 20> in cluster <MSUCluster> Done

Job <# this file was automaticly created by mpisubmit.pl script for edu-cmc-skmodel21-622-16 #;source /polusfs/setenv/setup.SMPI;#BSUB -n 20;#BSUB -W 00:15;#BSUB -o main.%J.out;#BSUB -e main.%J.err;OMP_NUM_THREADS=1 mpiexec main 3.141592653589793 0.01 256 20> was submitted from host <polus-ib.bmc.hpc.cs.msu.ru> by user <edu-cmc-skmodel21-622-16> in cluster <MSUCluster> at Mon Dec 13 23:14:05 2021
Job was executed on host(s) <9*polus-c3-ib.bmc.hpc.cs.msu.ru>, in queue <short>, as user <edu-cmc-skmodel21-622-16> in cluster <MSUCluster> at Mon Dec 13 23:16:28 2021
                            <11*polus-c2-ib.bmc.hpc.cs.msu.ru>
</home_edu/edu-cmc-skmodel21-622/edu-cmc-skmodel21-622-16> was used as the home directory.
</home_edu/edu-cmc-skmodel21-622/edu-cmc-skmodel21-622-16/solution> was used as the working directory.
Started at Mon Dec 13 23:16:28 2021
Terminated at Mon Dec 13 23:16:36 2021
Results reported at Mon Dec 13 23:16:36 2021

Your job looked like:

------------------------------------------------------------
# LSBATCH: User input
# this file was automaticly created by mpisubmit.pl script for edu-cmc-skmodel21-622-16 #
source /polusfs/setenv/setup.SMPI
#BSUB -n 20
#BSUB -W 00:15
#BSUB -o main.%J.out
#BSUB -e main.%J.err
OMP_NUM_THREADS=1 mpiexec main 3.141592653589793 0.01 256 20

------------------------------------------------------------

Successfully completed.

Resource usage summary:

    CPU time :                                   114.00 sec.
    Max Memory :                                 681 MB
    Average Memory :                             454.33 MB
    Total Requested Memory :                     -
    Delta Memory :                               -
    Max Swap :                                   -
    Max Processes :                              13
    Max Threads :                                36
    Run time :                                   7 sec.
    Turnaround time :                            151 sec.

The output (if any) follows:

__PARAMS__ = {'P': 20, 'O': 0, 'L': 3.141593e+00, 'T': 1.000000e-02, 'N': 256, 'K': 20}
=======================
__.world.size = 20;
__.world.rank = 0;

__.nodes.shape = {.x=256, .y=256, .z=256, .t=20};
__.nodes.bound = {.x=3.141593, .y=3.141593, .z=3.141593, .t=0.010000};
__.nodes.steps = {.x=0.012272, .y=0.012272, .z=0.012272, .t=0.000500};

__.param.period = {.x=1, .y=0, .z=0};
__.param.a = {.x=2.000000, .y=1.000000, .z=1.000000, .t=2.449490};
__.param.b = {.x=0.000000, .y=0.000000, .z=0.000000, .t=7.853982};

__.local.rank = 0;
__.local.shape = {.x=5, .y=2, .z=2};
__.local.coord = {.x=0, .y=0, .z=0};

__.block.shape = {.x=54, .y=130, .z=130};
__.block.coord = {.x=0, .y=0, .z=0};
__.block.elems = 912600;

=======================
__.world.size = 20;
__.world.rank = 1;

__.nodes.shape = {.x=256, .y=256, .z=256, .t=20};
__.nodes.bound = {.x=3.141593, .y=3.141593, .z=3.141593, .t=0.010000};
__.nodes.steps = {.x=0.012272, .y=0.012272, .z=0.012272, .t=0.000500};

__.param.period = {.x=1, .y=0, .z=0};
__.param.a = {.x=2.000000, .y=1.000000, .z=1.000000, .t=2.449490};
__.param.b = {.x=0.000000, .y=0.000000, .z=0.000000, .t=7.853982};

__.local.rank = 1;
__.local.shape = {.x=5, .y=2, .z=2};
__.local.coord = {.x=0, .y=0, .z=1};

__.block.shape = {.x=54, .y=130, .z=130};
__.block.coord = {.x=0, .y=0, .z=128};
__.block.elems = 912600;

=======================
__.world.size = 20;
__.world.rank = 2;

__.nodes.shape = {.x=256, .y=256, .z=256, .t=20};
__.nodes.bound = {.x=3.141593, .y=3.141593, .z=3.141593, .t=0.010000};
__.nodes.steps = {.x=0.012272, .y=0.012272, .z=0.012272, .t=0.000500};

__.param.period = {.x=1, .y=0, .z=0};
__.param.a = {.x=2.000000, .y=1.000000, .z=1.000000, .t=2.449490};
__.param.b = {.x=0.000000, .y=0.000000, .z=0.000000, .t=7.853982};

__.local.rank = 2;
__.local.shape = {.x=5, .y=2, .z=2};
__.local.coord = {.x=0, .y=1, .z=0};

__.block.shape = {.x=54, .y=130, .z=130};
__.block.coord = {.x=0, .y=128, .z=0};
__.block.elems = 912600;

=======================
__.world.size = 20;
__.world.rank = 3;

__.nodes.shape = {.x=256, .y=256, .z=256, .t=20};
__.nodes.bound = {.x=3.141593, .y=3.141593, .z=3.141593, .t=0.010000};
__.nodes.steps = {.x=0.012272, .y=0.012272, .z=0.012272, .t=0.000500};

__.param.period = {.x=1, .y=0, .z=0};
__.param.a = {.x=2.000000, .y=1.000000, .z=1.000000, .t=2.449490};
__.param.b = {.x=0.000000, .y=0.000000, .z=0.000000, .t=7.853982};

__.local.rank = 3;
__.local.shape = {.x=5, .y=2, .z=2};
__.local.coord = {.x=0, .y=1, .z=1};

__.block.shape = {.x=54, .y=130, .z=130};
__.block.coord = {.x=0, .y=128, .z=128};
__.block.elems = 912600;

=======================
__.world.size = 20;
__.world.rank = 4;

__.nodes.shape = {.x=256, .y=256, .z=256, .t=20};
__.nodes.bound = {.x=3.141593, .y=3.141593, .z=3.141593, .t=0.010000};
__.nodes.steps = {.x=0.012272, .y=0.012272, .z=0.012272, .t=0.000500};

__.param.period = {.x=1, .y=0, .z=0};
__.param.a = {.x=2.000000, .y=1.000000, .z=1.000000, .t=2.449490};
__.param.b = {.x=0.000000, .y=0.000000, .z=0.000000, .t=7.853982};

__.local.rank = 4;
__.local.shape = {.x=5, .y=2, .z=2};
__.local.coord = {.x=1, .y=0, .z=0};

__.block.shape = {.x=54, .y=130, .z=130};
__.block.coord = {.x=52, .y=0, .z=0};
__.block.elems = 912600;

=======================
__.world.size = 20;
__.world.rank = 5;

__.nodes.shape = {.x=256, .y=256, .z=256, .t=20};
__.nodes.bound = {.x=3.141593, .y=3.141593, .z=3.141593, .t=0.010000};
__.nodes.steps = {.x=0.012272, .y=0.012272, .z=0.012272, .t=0.000500};

__.param.period = {.x=1, .y=0, .z=0};
__.param.a = {.x=2.000000, .y=1.000000, .z=1.000000, .t=2.449490};
__.param.b = {.x=0.000000, .y=0.000000, .z=0.000000, .t=7.853982};

__.local.rank = 5;
__.local.shape = {.x=5, .y=2, .z=2};
__.local.coord = {.x=1, .y=0, .z=1};

__.block.shape = {.x=54, .y=130, .z=130};
__.block.coord = {.x=52, .y=0, .z=128};
__.block.elems = 912600;

=======================
__.world.size = 20;
__.world.rank = 6;

__.nodes.shape = {.x=256, .y=256, .z=256, .t=20};
__.nodes.bound = {.x=3.141593, .y=3.141593, .z=3.141593, .t=0.010000};
__.nodes.steps = {.x=0.012272, .y=0.012272, .z=0.012272, .t=0.000500};

__.param.period = {.x=1, .y=0, .z=0};
__.param.a = {.x=2.000000, .y=1.000000, .z=1.000000, .t=2.449490};
__.param.b = {.x=0.000000, .y=0.000000, .z=0.000000, .t=7.853982};

__.local.rank = 6;
__.local.shape = {.x=5, .y=2, .z=2};
__.local.coord = {.x=1, .y=1, .z=0};

__.block.shape = {.x=54, .y=130, .z=130};
__.block.coord = {.x=52, .y=128, .z=0};
__.block.elems = 912600;

=======================
__.world.size = 20;
__.world.rank = 7;

__.nodes.shape = {.x=256, .y=256, .z=256, .t=20};
__.nodes.bound = {.x=3.141593, .y=3.141593, .z=3.141593, .t=0.010000};
__.nodes.steps = {.x=0.012272, .y=0.012272, .z=0.012272, .t=0.000500};

__.param.period = {.x=1, .y=0, .z=0};
__.param.a = {.x=2.000000, .y=1.000000, .z=1.000000, .t=2.449490};
__.param.b = {.x=0.000000, .y=0.000000, .z=0.000000, .t=7.853982};

__.local.rank = 7;
__.local.shape = {.x=5, .y=2, .z=2};
__.local.coord = {.x=1, .y=1, .z=1};

__.block.shape = {.x=54, .y=130, .z=130};
__.block.coord = {.x=52, .y=128, .z=128};
__.block.elems = 912600;

=======================
__.world.size = 20;
__.world.rank = 8;

__.nodes.shape = {.x=256, .y=256, .z=256, .t=20};
__.nodes.bound = {.x=3.141593, .y=3.141593, .z=3.141593, .t=0.010000};
__.nodes.steps = {.x=0.012272, .y=0.012272, .z=0.012272, .t=0.000500};

__.param.period = {.x=1, .y=0, .z=0};
__.param.a = {.x=2.000000, .y=1.000000, .z=1.000000, .t=2.449490};
__.param.b = {.x=0.000000, .y=0.000000, .z=0.000000, .t=7.853982};

__.local.rank = 8;
__.local.shape = {.x=5, .y=2, .z=2};
__.local.coord = {.x=2, .y=0, .z=0};

__.block.shape = {.x=54, .y=130, .z=130};
__.block.coord = {.x=104, .y=0, .z=0};
__.block.elems = 912600;

=======================
__.world.size = 20;
__.world.rank = 11;

__.nodes.shape = {.x=256, .y=256, .z=256, .t=20};
__.nodes.bound = {.x=3.141593, .y=3.141593, .z=3.141593, .t=0.010000};
__.nodes.steps = {.x=0.012272, .y=0.012272, .z=0.012272, .t=0.000500};

__.param.period = {.x=1, .y=0, .z=0};
__.param.a = {.x=2.000000, .y=1.000000, .z=1.000000, .t=2.449490};
__.param.b = {.x=0.000000, .y=0.000000, .z=0.000000, .t=7.853982};

__.local.rank = 11;
__.local.shape = {.x=5, .y=2, .z=2};
__.local.coord = {.x=2, .y=1, .z=1};

__.block.shape = {.x=54, .y=130, .z=130};
__.block.coord = {.x=104, .y=128, .z=128};
__.block.elems = 912600;

=======================
__.world.size = 20;
__.world.rank = 12;

__.nodes.shape = {.x=256, .y=256, .z=256, .t=20};
__.nodes.bound = {.x=3.141593, .y=3.141593, .z=3.141593, .t=0.010000};
__.nodes.steps = {.x=0.012272, .y=0.012272, .z=0.012272, .t=0.000500};

__.param.period = {.x=1, .y=0, .z=0};
__.param.a = {.x=2.000000, .y=1.000000, .z=1.000000, .t=2.449490};
__.param.b = {.x=0.000000, .y=0.000000, .z=0.000000, .t=7.853982};

__.local.rank = 12;
__.local.shape = {.x=5, .y=2, .z=2};
__.local.coord = {.x=3, .y=0, .z=0};

__.block.shape = {.x=54, .y=130, .z=130};
__.block.coord = {.x=156, .y=0, .z=0};
__.block.elems = 912600;

=======================
__.world.size = 20;
__.world.rank = 13;

__.nodes.shape = {.x=256, .y=256, .z=256, .t=20};
__.nodes.bound = {.x=3.141593, .y=3.141593, .z=3.141593, .t=0.010000};
__.nodes.steps = {.x=0.012272, .y=0.012272, .z=0.012272, .t=0.000500};

__.param.period = {.x=1, .y=0, .z=0};
__.param.a = {.x=2.000000, .y=1.000000, .z=1.000000, .t=2.449490};
__.param.b = {.x=0.000000, .y=0.000000, .z=0.000000, .t=7.853982};

__.local.rank = 13;
__.local.shape = {.x=5, .y=2, .z=2};
__.local.coord = {.x=3, .y=0, .z=1};

__.block.shape = {.x=54, .y=130, .z=130};
__.block.coord = {.x=156, .y=0, .z=128};
__.block.elems = 912600;

=======================
__.world.size = 20;
__.world.rank = 14;

__.nodes.shape = {.x=256, .y=256, .z=256, .t=20};
__.nodes.bound = {.x=3.141593, .y=3.141593, .z=3.141593, .t=0.010000};
__.nodes.steps = {.x=0.012272, .y=0.012272, .z=0.012272, .t=0.000500};

__.param.period = {.x=1, .y=0, .z=0};
__.param.a = {.x=2.000000, .y=1.000000, .z=1.000000, .t=2.449490};
__.param.b = {.x=0.000000, .y=0.000000, .z=0.000000, .t=7.853982};

__.local.rank = 14;
__.local.shape = {.x=5, .y=2, .z=2};
__.local.coord = {.x=3, .y=1, .z=0};

__.block.shape = {.x=54, .y=130, .z=130};
__.block.coord = {.x=156, .y=128, .z=0};
__.block.elems = 912600;

=======================
__.world.size = 20;
__.world.rank = 15;

__.nodes.shape = {.x=256, .y=256, .z=256, .t=20};
__.nodes.bound = {.x=3.141593, .y=3.141593, .z=3.141593, .t=0.010000};
__.nodes.steps = {.x=0.012272, .y=0.012272, .z=0.012272, .t=0.000500};

__.param.period = {.x=1, .y=0, .z=0};
__.param.a = {.x=2.000000, .y=1.000000, .z=1.000000, .t=2.449490};
__.param.b = {.x=0.000000, .y=0.000000, .z=0.000000, .t=7.853982};

__.local.rank = 15;
__.local.shape = {.x=5, .y=2, .z=2};
__.local.coord = {.x=3, .y=1, .z=1};

__.block.shape = {.x=54, .y=130, .z=130};
__.block.coord = {.x=156, .y=128, .z=128};
__.block.elems = 912600;

=======================
__.world.size = 20;
__.world.rank = 9;

__.nodes.shape = {.x=256, .y=256, .z=256, .t=20};
__.nodes.bound = {.x=3.141593, .y=3.141593, .z=3.141593, .t=0.010000};
__.nodes.steps = {.x=0.012272, .y=0.012272, .z=0.012272, .t=0.000500};

__.param.period = {.x=1, .y=0, .z=0};
__.param.a = {.x=2.000000, .y=1.000000, .z=1.000000, .t=2.449490};
__.param.b = {.x=0.000000, .y=0.000000, .z=0.000000, .t=7.853982};

__.local.rank = 9;
__.local.shape = {.x=5, .y=2, .z=2};
__.local.coord = {.x=2, .y=0, .z=1};

__.block.shape = {.x=54, .y=130, .z=130};
__.block.coord = {.x=104, .y=0, .z=128};
__.block.elems = 912600;

=======================
__.world.size = 20;
__.world.rank = 10;

__.nodes.shape = {.x=256, .y=256, .z=256, .t=20};
__.nodes.bound = {.x=3.141593, .y=3.141593, .z=3.141593, .t=0.010000};
__.nodes.steps = {.x=0.012272, .y=0.012272, .z=0.012272, .t=0.000500};

__.param.period = {.x=1, .y=0, .z=0};
__.param.a = {.x=2.000000, .y=1.000000, .z=1.000000, .t=2.449490};
__.param.b = {.x=0.000000, .y=0.000000, .z=0.000000, .t=7.853982};

__.local.rank = 10;
__.local.shape = {.x=5, .y=2, .z=2};
__.local.coord = {.x=2, .y=1, .z=0};

__.block.shape = {.x=54, .y=130, .z=130};
__.block.coord = {.x=104, .y=128, .z=0};
__.block.elems = 912600;

=======================
__.world.size = 20;
__.world.rank = 16;

__.nodes.shape = {.x=256, .y=256, .z=256, .t=20};
__.nodes.bound = {.x=3.141593, .y=3.141593, .z=3.141593, .t=0.010000};
__.nodes.steps = {.x=0.012272, .y=0.012272, .z=0.012272, .t=0.000500};

__.param.period = {.x=1, .y=0, .z=0};
__.param.a = {.x=2.000000, .y=1.000000, .z=1.000000, .t=2.449490};
__.param.b = {.x=0.000000, .y=0.000000, .z=0.000000, .t=7.853982};

__.local.rank = 16;
__.local.shape = {.x=5, .y=2, .z=2};
__.local.coord = {.x=4, .y=0, .z=0};

__.block.shape = {.x=50, .y=130, .z=130};
__.block.coord = {.x=208, .y=0, .z=0};
__.block.elems = 845000;

=======================
__.world.size = 20;
__.world.rank = 17;

__.nodes.shape = {.x=256, .y=256, .z=256, .t=20};
__.nodes.bound = {.x=3.141593, .y=3.141593, .z=3.141593, .t=0.010000};
__.nodes.steps = {.x=0.012272, .y=0.012272, .z=0.012272, .t=0.000500};

__.param.period = {.x=1, .y=0, .z=0};
__.param.a = {.x=2.000000, .y=1.000000, .z=1.000000, .t=2.449490};
__.param.b = {.x=0.000000, .y=0.000000, .z=0.000000, .t=7.853982};

__.local.rank = 17;
__.local.shape = {.x=5, .y=2, .z=2};
__.local.coord = {.x=4, .y=0, .z=1};

__.block.shape = {.x=50, .y=130, .z=130};
__.block.coord = {.x=208, .y=0, .z=128};
__.block.elems = 845000;

=======================
__.world.size = 20;
__.world.rank = 18;

__.nodes.shape = {.x=256, .y=256, .z=256, .t=20};
__.nodes.bound = {.x=3.141593, .y=3.141593, .z=3.141593, .t=0.010000};
__.nodes.steps = {.x=0.012272, .y=0.012272, .z=0.012272, .t=0.000500};

__.param.period = {.x=1, .y=0, .z=0};
__.param.a = {.x=2.000000, .y=1.000000, .z=1.000000, .t=2.449490};
__.param.b = {.x=0.000000, .y=0.000000, .z=0.000000, .t=7.853982};

__.local.rank = 18;
__.local.shape = {.x=5, .y=2, .z=2};
__.local.coord = {.x=4, .y=1, .z=0};

__.block.shape = {.x=50, .y=130, .z=130};
__.block.coord = {.x=208, .y=128, .z=0};
__.block.elems = 845000;

=======================
__.world.size = 20;
__.world.rank = 19;

__.nodes.shape = {.x=256, .y=256, .z=256, .t=20};
__.nodes.bound = {.x=3.141593, .y=3.141593, .z=3.141593, .t=0.010000};
__.nodes.steps = {.x=0.012272, .y=0.012272, .z=0.012272, .t=0.000500};

__.param.period = {.x=1, .y=0, .z=0};
__.param.a = {.x=2.000000, .y=1.000000, .z=1.000000, .t=2.449490};
__.param.b = {.x=0.000000, .y=0.000000, .z=0.000000, .t=7.853982};

__.local.rank = 19;
__.local.shape = {.x=5, .y=2, .z=2};
__.local.coord = {.x=4, .y=1, .z=1};

__.block.shape = {.x=50, .y=130, .z=130};
__.block.coord = {.x=208, .y=128, .z=128};
__.block.elems = 845000;

__TRIALS__.append((8.256746e-01, [0.000000e+00, 2.814293e-11, 1.125714e-10, 2.532855e-10, 4.502845e-10, 7.035680e-10, 1.013135e-09, 1.378985e-09, 1.801117e-09, 2.279529e-09, 2.814220e-09, 3.405188e-09, 4.052432e-09, 4.755950e-09, 5.515739e-09, 6.331797e-09, 7.204122e-09, 8.132712e-09, 9.117562e-09, 1.015867e-08, 1.125604e-08, ]))
__TRIALS__.append((5.839731e-01, [0.000000e+00, 2.814293e-11, 1.125714e-10, 2.532855e-10, 4.502845e-10, 7.035680e-10, 1.013135e-09, 1.378985e-09, 1.801117e-09, 2.279529e-09, 2.814220e-09, 3.405188e-09, 4.052432e-09, 4.755950e-09, 5.515739e-09, 6.331797e-09, 7.204122e-09, 8.132712e-09, 9.117562e-09, 1.015867e-08, 1.125604e-08, ]))
__TRIALS__.append((6.365390e-01, [0.000000e+00, 2.814293e-11, 1.125714e-10, 2.532855e-10, 4.502845e-10, 7.035680e-10, 1.013135e-09, 1.378985e-09, 1.801117e-09, 2.279529e-09, 2.814220e-09, 3.405188e-09, 4.052432e-09, 4.755950e-09, 5.515739e-09, 6.331797e-09, 7.204122e-09, 8.132712e-09, 9.117562e-09, 1.015867e-08, 1.125604e-08, ]))
__TRIALS__.append((5.212820e-01, [0.000000e+00, 2.814293e-11, 1.125714e-10, 2.532855e-10, 4.502845e-10, 7.035680e-10, 1.013135e-09, 1.378985e-09, 1.801117e-09, 2.279529e-09, 2.814220e-09, 3.405188e-09, 4.052432e-09, 4.755950e-09, 5.515739e-09, 6.331797e-09, 7.204122e-09, 8.132712e-09, 9.117562e-09, 1.015867e-08, 1.125604e-08, ]))
__TRIALS__.append((5.032317e-01, [0.000000e+00, 2.814293e-11, 1.125714e-10, 2.532855e-10, 4.502845e-10, 7.035680e-10, 1.013135e-09, 1.378985e-09, 1.801117e-09, 2.279529e-09, 2.814220e-09, 3.405188e-09, 4.052432e-09, 4.755950e-09, 5.515739e-09, 6.331797e-09, 7.204122e-09, 8.132712e-09, 9.117562e-09, 1.015867e-08, 1.125604e-08, ]))
__TRIALS__.append((5.380253e-01, [0.000000e+00, 2.814293e-11, 1.125714e-10, 2.532855e-10, 4.502845e-10, 7.035680e-10, 1.013135e-09, 1.378985e-09, 1.801117e-09, 2.279529e-09, 2.814220e-09, 3.405188e-09, 4.052432e-09, 4.755950e-09, 5.515739e-09, 6.331797e-09, 7.204122e-09, 8.132712e-09, 9.117562e-09, 1.015867e-08, 1.125604e-08, ]))
__TRIALS__.append((5.081666e-01, [0.000000e+00, 2.814293e-11, 1.125714e-10, 2.532855e-10, 4.502845e-10, 7.035680e-10, 1.013135e-09, 1.378985e-09, 1.801117e-09, 2.279529e-09, 2.814220e-09, 3.405188e-09, 4.052432e-09, 4.755950e-09, 5.515739e-09, 6.331797e-09, 7.204122e-09, 8.132712e-09, 9.117562e-09, 1.015867e-08, 1.125604e-08, ]))
__TRIALS__.append((4.734578e-01, [0.000000e+00, 2.814293e-11, 1.125714e-10, 2.532855e-10, 4.502845e-10, 7.035680e-10, 1.013135e-09, 1.378985e-09, 1.801117e-09, 2.279529e-09, 2.814220e-09, 3.405188e-09, 4.052432e-09, 4.755950e-09, 5.515739e-09, 6.331797e-09, 7.204122e-09, 8.132712e-09, 9.117562e-09, 1.015867e-08, 1.125604e-08, ]))
__TRIALS__.append((4.896703e-01, [0.000000e+00, 2.814293e-11, 1.125714e-10, 2.532855e-10, 4.502845e-10, 7.035680e-10, 1.013135e-09, 1.378985e-09, 1.801117e-09, 2.279529e-09, 2.814220e-09, 3.405188e-09, 4.052432e-09, 4.755950e-09, 5.515739e-09, 6.331797e-09, 7.204122e-09, 8.132712e-09, 9.117562e-09, 1.015867e-08, 1.125604e-08, ]))
__TRIALS__.append((5.201120e-01, [0.000000e+00, 2.814293e-11, 1.125714e-10, 2.532855e-10, 4.502845e-10, 7.035680e-10, 1.013135e-09, 1.378985e-09, 1.801117e-09, 2.279529e-09, 2.814220e-09, 3.405188e-09, 4.052432e-09, 4.755950e-09, 5.515739e-09, 6.331797e-09, 7.204122e-09, 8.132712e-09, 9.117562e-09, 1.015867e-08, 1.125604e-08, ]))


PS:

Read file <main.836933.err> for stderr output of this job.

