Sender: LSF System <lsfadmin@polus-c1-ib.bmc.hpc.cs.msu.ru>
Subject: Job 805243: <# this file was automaticly created by mpisubmit.pl script for edu-cmc-skmodel21-622-16 #;source /polusfs/setenv/setup.SMPI;#BSUB -n 64;#BSUB -W 00:15;#BSUB -o main_filtered_delta.%J.out;#BSUB -e main_filtered_delta.%J.err;OMP_NUM_THREADS=1 mpiexec main_filtered_delta 3.0e-5 42> in cluster <MSUCluster> Done

Job <# this file was automaticly created by mpisubmit.pl script for edu-cmc-skmodel21-622-16 #;source /polusfs/setenv/setup.SMPI;#BSUB -n 64;#BSUB -W 00:15;#BSUB -o main_filtered_delta.%J.out;#BSUB -e main_filtered_delta.%J.err;OMP_NUM_THREADS=1 mpiexec main_filtered_delta 3.0e-5 42> was submitted from host <polus-ib.bmc.hpc.cs.msu.ru> by user <edu-cmc-skmodel21-622-16> in cluster <MSUCluster> at Mon Nov  8 23:34:15 2021
Job was executed on host(s) <20*polus-c1-ib.bmc.hpc.cs.msu.ru>, in queue <short>, as user <edu-cmc-skmodel21-622-16> in cluster <MSUCluster> at Mon Nov  8 23:34:18 2021
                            <20*polus-c3-ib.bmc.hpc.cs.msu.ru>
                            <20*polus-c2-ib.bmc.hpc.cs.msu.ru>
                            <4*polus-c4-ib.bmc.hpc.cs.msu.ru>
</home_edu/edu-cmc-skmodel21-622/edu-cmc-skmodel21-622-16> was used as the home directory.
</home_edu/edu-cmc-skmodel21-622/edu-cmc-skmodel21-622-16/solution> was used as the working directory.
Started at Mon Nov  8 23:34:18 2021
Terminated at Mon Nov  8 23:34:47 2021
Results reported at Mon Nov  8 23:34:47 2021

Your job looked like:

------------------------------------------------------------
# LSBATCH: User input
# this file was automaticly created by mpisubmit.pl script for edu-cmc-skmodel21-622-16 #
source /polusfs/setenv/setup.SMPI
#BSUB -n 64
#BSUB -W 00:15
#BSUB -o main_filtered_delta.%J.out
#BSUB -e main_filtered_delta.%J.err
OMP_NUM_THREADS=1 mpiexec main_filtered_delta 3.0e-5 42

------------------------------------------------------------

Successfully completed.

Resource usage summary:

    CPU time :                                   1757.82 sec.
    Max Memory :                                 1102 MB
    Average Memory :                             917.67 MB
    Total Requested Memory :                     -
    Delta Memory :                               -
    Max Swap :                                   -
    Max Processes :                              24
    Max Threads :                                69
    Run time :                                   29 sec.
    Turnaround time :                            32 sec.

The output (if any) follows:

# Running __TRIALS__ with FILTERED_SAMPLING/DELTA_STOPPING and epsilon=3.000000e-05, comm_size=64, seed=42
__TRIALS__ = [
#   (trial_time, trial_iters, trial_points, trial_error),
    (2.781278e+00, 896004480, 234563339, 1.238208e-05),  # __TRIALS__
    (2.785857e+00, 896004480, 234576351, 2.802213e-05),  # __TRIALS__
    (2.612285e+00, 896004480, 234569967, 3.465475e-05),  # __TRIALS__
    (2.739859e+00, 896004480, 234583679, 2.334119e-05),  # __TRIALS__
    (2.825075e+00, 896004480, 234601604, 5.953022e-05),  # __TRIALS__
    (2.666869e+00, 896004480, 234589471, 2.585295e-05),  # __TRIALS__
    (2.639320e+00, 896004480, 234571680, 1.558026e-05),  # __TRIALS__
    (2.775313e+00, 896004480, 234568802, 1.466775e-06),  # __TRIALS__
    (2.757963e+00, 896004480, 234567444, 2.211375e-05),  # __TRIALS__
    (2.746743e+00, 896004480, 234578237, 5.073896e-06),  # __TRIALS__
]  # __TRIALS__
# Done.


PS:

Read file <main_filtered_delta.805243.err> for stderr output of this job.

