__PARAMS__ = {'P': 1, 'O': 0, 'L': 1.000000e+00, 'T': 1.000000e-02, 'N': 128, 'K': 20}
=======================
__.world.size = 1;
__.world.rank = 0;

__.nodes.shape = {.x=128, .y=128, .z=128, .t=20};
__.nodes.bound = {.x=1.000000, .y=1.000000, .z=1.000000, .t=0.010000};
__.nodes.steps = {.x=0.007812, .y=0.007812, .z=0.007812, .t=0.000500};

__.param.period = {.x=1, .y=0, .z=0};
__.param.a = {.x=6.283185, .y=3.141593, .z=3.141593, .t=7.695299};
__.param.b = {.x=0.000000, .y=0.000000, .z=0.000000, .t=7.853982};

__.local.rank = 0;
__.local.shape = {.x=1, .y=1, .z=1};
__.local.coord = {.x=0, .y=0, .z=0};

__.block.shape = {.x=130, .y=130, .z=130};
__.block.coord = {.x=0, .y=0, .z=0};
__.block.elems = 2197000;

__TRIALS__.append((5.339242e+01, [0.000000e+00, 1.105544e-09, 4.422145e-09, 9.949703e-09, 1.768806e-08, 2.763697e-08, 3.979616e-08, 5.416526e-08, 7.074384e-08, 8.953142e-08, 1.105274e-07, 1.337313e-07, 1.591422e-07, 1.867596e-07, 2.165825e-07, 2.486100e-07, 2.828413e-07, 3.192754e-07, 3.579110e-07, 3.987471e-07, 4.417826e-07, ]))
__TRIALS__.append((5.339221e+01, [0.000000e+00, 1.105544e-09, 4.422145e-09, 9.949703e-09, 1.768806e-08, 2.763697e-08, 3.979616e-08, 5.416526e-08, 7.074384e-08, 8.953142e-08, 1.105274e-07, 1.337313e-07, 1.591422e-07, 1.867596e-07, 2.165825e-07, 2.486100e-07, 2.828413e-07, 3.192754e-07, 3.579110e-07, 3.987471e-07, 4.417826e-07, ]))
__TRIALS__.append((5.339221e+01, [0.000000e+00, 1.105544e-09, 4.422145e-09, 9.949703e-09, 1.768806e-08, 2.763697e-08, 3.979616e-08, 5.416526e-08, 7.074384e-08, 8.953142e-08, 1.105274e-07, 1.337313e-07, 1.591422e-07, 1.867596e-07, 2.165825e-07, 2.486100e-07, 2.828413e-07, 3.192754e-07, 3.579110e-07, 3.987471e-07, 4.417826e-07, ]))
__TRIALS__.append((5.339221e+01, [0.000000e+00, 1.105544e-09, 4.422145e-09, 9.949703e-09, 1.768806e-08, 2.763697e-08, 3.979616e-08, 5.416526e-08, 7.074384e-08, 8.953142e-08, 1.105274e-07, 1.337313e-07, 1.591422e-07, 1.867596e-07, 2.165825e-07, 2.486100e-07, 2.828413e-07, 3.192754e-07, 3.579110e-07, 3.987471e-07, 4.417826e-07, ]))
__TRIALS__.append((5.339222e+01, [0.000000e+00, 1.105544e-09, 4.422145e-09, 9.949703e-09, 1.768806e-08, 2.763697e-08, 3.979616e-08, 5.416526e-08, 7.074384e-08, 8.953142e-08, 1.105274e-07, 1.337313e-07, 1.591422e-07, 1.867596e-07, 2.165825e-07, 2.486100e-07, 2.828413e-07, 3.192754e-07, 3.579110e-07, 3.987471e-07, 4.417826e-07, ]))
__TRIALS__.append((5.339221e+01, [0.000000e+00, 1.105544e-09, 4.422145e-09, 9.949703e-09, 1.768806e-08, 2.763697e-08, 3.979616e-08, 5.416526e-08, 7.074384e-08, 8.953142e-08, 1.105274e-07, 1.337313e-07, 1.591422e-07, 1.867596e-07, 2.165825e-07, 2.486100e-07, 2.828413e-07, 3.192754e-07, 3.579110e-07, 3.987471e-07, 4.417826e-07, ]))
__TRIALS__.append((5.339224e+01, [0.000000e+00, 1.105544e-09, 4.422145e-09, 9.949703e-09, 1.768806e-08, 2.763697e-08, 3.979616e-08, 5.416526e-08, 7.074384e-08, 8.953142e-08, 1.105274e-07, 1.337313e-07, 1.591422e-07, 1.867596e-07, 2.165825e-07, 2.486100e-07, 2.828413e-07, 3.192754e-07, 3.579110e-07, 3.987471e-07, 4.417826e-07, ]))
__TRIALS__.append((5.339220e+01, [0.000000e+00, 1.105544e-09, 4.422145e-09, 9.949703e-09, 1.768806e-08, 2.763697e-08, 3.979616e-08, 5.416526e-08, 7.074384e-08, 8.953142e-08, 1.105274e-07, 1.337313e-07, 1.591422e-07, 1.867596e-07, 2.165825e-07, 2.486100e-07, 2.828413e-07, 3.192754e-07, 3.579110e-07, 3.987471e-07, 4.417826e-07, ]))
__TRIALS__.append((5.339221e+01, [0.000000e+00, 1.105544e-09, 4.422145e-09, 9.949703e-09, 1.768806e-08, 2.763697e-08, 3.979616e-08, 5.416526e-08, 7.074384e-08, 8.953142e-08, 1.105274e-07, 1.337313e-07, 1.591422e-07, 1.867596e-07, 2.165825e-07, 2.486100e-07, 2.828413e-07, 3.192754e-07, 3.579110e-07, 3.987471e-07, 4.417826e-07, ]))
__TRIALS__.append((5.339227e+01, [0.000000e+00, 1.105544e-09, 4.422145e-09, 9.949703e-09, 1.768806e-08, 2.763697e-08, 3.979616e-08, 5.416526e-08, 7.074384e-08, 8.953142e-08, 1.105274e-07, 1.337313e-07, 1.591422e-07, 1.867596e-07, 2.165825e-07, 2.486100e-07, 2.828413e-07, 3.192754e-07, 3.579110e-07, 3.987471e-07, 4.417826e-07, ]))
