Sender: LSF System <lsfadmin@polus-c4-ib.bmc.hpc.cs.msu.ru>
Subject: Job 798497: <# this file was automaticly created by mpisubmit.pl script for edu-cmc-skmodel21-622-16 #;source /polusfs/setenv/setup.SMPI;#BSUB -n 4;#BSUB -W 00:15;#BSUB -o main_filtered_error.%J.out;#BSUB -e main_filtered_error.%J.err;OMP_NUM_THREADS=1 mpiexec main_filtered_error 1.5e-6 42> in cluster <MSUCluster> Done

Job <# this file was automaticly created by mpisubmit.pl script for edu-cmc-skmodel21-622-16 #;source /polusfs/setenv/setup.SMPI;#BSUB -n 4;#BSUB -W 00:15;#BSUB -o main_filtered_error.%J.out;#BSUB -e main_filtered_error.%J.err;OMP_NUM_THREADS=1 mpiexec main_filtered_error 1.5e-6 42> was submitted from host <polus-ib.bmc.hpc.cs.msu.ru> by user <edu-cmc-skmodel21-622-16> in cluster <MSUCluster> at Sun Nov  7 06:34:59 2021
Job was executed on host(s) <4*polus-c4-ib.bmc.hpc.cs.msu.ru>, in queue <short>, as user <edu-cmc-skmodel21-622-16> in cluster <MSUCluster> at Sun Nov  7 06:35:00 2021
</home_edu/edu-cmc-skmodel21-622/edu-cmc-skmodel21-622-16> was used as the home directory.
</home_edu/edu-cmc-skmodel21-622/edu-cmc-skmodel21-622-16/solution> was used as the working directory.
Started at Sun Nov  7 06:35:00 2021
Terminated at Sun Nov  7 06:35:20 2021
Results reported at Sun Nov  7 06:35:20 2021

Your job looked like:

------------------------------------------------------------
# LSBATCH: User input
# this file was automaticly created by mpisubmit.pl script for edu-cmc-skmodel21-622-16 #
source /polusfs/setenv/setup.SMPI
#BSUB -n 4
#BSUB -W 00:15
#BSUB -o main_filtered_error.%J.out
#BSUB -e main_filtered_error.%J.err
OMP_NUM_THREADS=1 mpiexec main_filtered_error 1.5e-6 42

------------------------------------------------------------

Successfully completed.

Resource usage summary:

    CPU time :                                   77.41 sec.
    Max Memory :                                 226 MB
    Average Memory :                             181.60 MB
    Total Requested Memory :                     -
    Delta Memory :                               -
    Max Swap :                                   -
    Max Processes :                              8
    Max Threads :                                21
    Run time :                                   23 sec.
    Turnaround time :                            21 sec.

The output (if any) follows:

# Running __TRIALS__ with FILTERED_SAMPLING/ERROR_STOPPING and epsilon=1.500000e-06, comm_size=4, seed=42
__TRIALS__ = [
#   (trial_time, trial_iters, trial_points, trial_error),
    (7.885233e-01, 29991360, 7849633, 5.809912e-07),  # __TRIALS__
    (1.628808e+01, 607817280, 159130923, 1.491795e-06),  # __TRIALS__
    (2.201910e-02, 806400, 211248, 9.482233e-07),  # __TRIALS__
    (7.346505e-02, 2546880, 667059, 9.332480e-07),  # __TRIALS__
    (4.096799e-01, 16148160, 4226888, 1.291303e-06),  # __TRIALS__
    (1.380770e-02, 497280, 130408, 1.716244e-07),  # __TRIALS__
    (4.809502e-01, 17734080, 4643903, 3.502265e-07),  # __TRIALS__
    (3.812580e-02, 1364160, 357280, 1.011853e-06),  # __TRIALS__
    (1.018674e-01, 3729600, 975849, 6.913009e-07),  # __TRIALS__
    (1.017582e+00, 40158720, 10512888, 2.394463e-07),  # __TRIALS__
]  # __TRIALS__
# Done.


PS:

Read file <main_filtered_error.798497.err> for stderr output of this job.

