Sender: LSF System <lsfadmin@polus-c2-ib.bmc.hpc.cs.msu.ru>
Subject: Job 798504: <# this file was automaticly created by mpisubmit.pl script for edu-cmc-skmodel21-622-16 #;source /polusfs/setenv/setup.SMPI;#BSUB -n 16;#BSUB -W 00:15;#BSUB -o main_filtered_delta.%J.out;#BSUB -e main_filtered_delta.%J.err;OMP_NUM_THREADS=1 mpiexec main_filtered_delta 5.0e-6 42> in cluster <MSUCluster> Done

Job <# this file was automaticly created by mpisubmit.pl script for edu-cmc-skmodel21-622-16 #;source /polusfs/setenv/setup.SMPI;#BSUB -n 16;#BSUB -W 00:15;#BSUB -o main_filtered_delta.%J.out;#BSUB -e main_filtered_delta.%J.err;OMP_NUM_THREADS=1 mpiexec main_filtered_delta 5.0e-6 42> was submitted from host <polus-ib.bmc.hpc.cs.msu.ru> by user <edu-cmc-skmodel21-622-16> in cluster <MSUCluster> at Sun Nov  7 07:20:20 2021
Job was executed on host(s) <16*polus-c2-ib.bmc.hpc.cs.msu.ru>, in queue <short>, as user <edu-cmc-skmodel21-622-16> in cluster <MSUCluster> at Sun Nov  7 07:20:21 2021
</home_edu/edu-cmc-skmodel21-622/edu-cmc-skmodel21-622-16> was used as the home directory.
</home_edu/edu-cmc-skmodel21-622/edu-cmc-skmodel21-622-16/solution> was used as the working directory.
Started at Sun Nov  7 07:20:21 2021
Terminated at Sun Nov  7 07:26:53 2021
Results reported at Sun Nov  7 07:26:53 2021

Your job looked like:

------------------------------------------------------------
# LSBATCH: User input
# this file was automaticly created by mpisubmit.pl script for edu-cmc-skmodel21-622-16 #
source /polusfs/setenv/setup.SMPI
#BSUB -n 16
#BSUB -W 00:15
#BSUB -o main_filtered_delta.%J.out
#BSUB -e main_filtered_delta.%J.err
OMP_NUM_THREADS=1 mpiexec main_filtered_delta 5.0e-6 42

------------------------------------------------------------

Successfully completed.

Resource usage summary:

    CPU time :                                   6264.48 sec.
    Max Memory :                                 857 MB
    Average Memory :                             841.15 MB
    Total Requested Memory :                     -
    Delta Memory :                               -
    Max Swap :                                   -
    Max Processes :                              20
    Max Threads :                                57
    Run time :                                   399 sec.
    Turnaround time :                            393 sec.

The output (if any) follows:

# Running __TRIALS__ with FILTERED_SAMPLING/DELTA_STOPPING and epsilon=5.000000e-06, comm_size=16, seed=42
__TRIALS__ = [
#   (trial_time, trial_iters, trial_points, trial_error),
    (3.821206e+01, 5376000000, 1407455237, 6.565116e-06),  # __TRIALS__
    (3.811393e+01, 5376000000, 1407442563, 2.338305e-06),  # __TRIALS__
    (3.983437e+01, 5376000000, 1407488517, 2.587652e-05),  # __TRIALS__
    (3.926052e+01, 5376000000, 1407432931, 1.255727e-06),  # __TRIALS__
    (3.919479e+01, 5376000000, 1407386989, 6.698770e-06),  # __TRIALS__
    (3.949267e+01, 5376000000, 1407431137, 3.205059e-06),  # __TRIALS__
    (3.812802e+01, 5376000000, 1407417994, 5.784889e-06),  # __TRIALS__
    (3.943703e+01, 5376000000, 1407417287, 9.559122e-06),  # __TRIALS__
    (3.962605e+01, 5376000000, 1407404256, 9.550123e-06),  # __TRIALS__
    (4.012818e+01, 5376000000, 1407444244, 1.008505e-05),  # __TRIALS__
]  # __TRIALS__
# Done.


PS:

Read file <main_filtered_delta.798504.err> for stderr output of this job.

