__PARAMS__ = {'P': 128, 'O': 4, 'L': 1.000000e+00, 'T': 1.000000e-02, 'N': 128, 'K': 20}
=======================
__.world.size = 128;
__.world.rank = 0;

__.nodes.shape = {.x=128, .y=128, .z=128, .t=20};
__.nodes.bound = {.x=1.000000, .y=1.000000, .z=1.000000, .t=0.010000};
__.nodes.steps = {.x=0.007812, .y=0.007812, .z=0.007812, .t=0.000500};

__.param.period = {.x=1, .y=0, .z=0};
__.param.a = {.x=6.283185, .y=3.141593, .z=3.141593, .t=7.695299};
__.param.b = {.x=0.000000, .y=0.000000, .z=0.000000, .t=7.853982};

__.local.rank = 0;
__.local.shape = {.x=8, .y=4, .z=4};
__.local.coord = {.x=0, .y=0, .z=0};

__.block.shape = {.x=18, .y=34, .z=34};
__.block.coord = {.x=0, .y=0, .z=0};
__.block.elems = 20808;

=======================
__.world.size = 128;
__.world.rank = 1;

__.nodes.shape = {.x=128, .y=128, .z=128, .t=20};
__.nodes.bound = {.x=1.000000, .y=1.000000, .z=1.000000, .t=0.010000};
__.nodes.steps = {.x=0.007812, .y=0.007812, .z=0.007812, .t=0.000500};

__.param.period = {.x=1, .y=0, .z=0};
__.param.a = {.x=6.283185, .y=3.141593, .z=3.141593, .t=7.695299};
__.param.b = {.x=0.000000, .y=0.000000, .z=0.000000, .t=7.853982};

__.local.rank = 1;
__.local.shape = {.x=8, .y=4, .z=4};
__.local.coord = {.x=0, .y=0, .z=1};

__.block.shape = {.x=18, .y=34, .z=34};
__.block.coord = {.x=0, .y=0, .z=32};
__.block.elems = 20808;

=======================
__.world.size = 128;
__.world.rank = 2;

__.nodes.shape = {.x=128, .y=128, .z=128, .t=20};
__.nodes.bound = {.x=1.000000, .y=1.000000, .z=1.000000, .t=0.010000};
__.nodes.steps = {.x=0.007812, .y=0.007812, .z=0.007812, .t=0.000500};

__.param.period = {.x=1, .y=0, .z=0};
__.param.a = {.x=6.283185, .y=3.141593, .z=3.141593, .t=7.695299};
__.param.b = {.x=0.000000, .y=0.000000, .z=0.000000, .t=7.853982};

__.local.rank = 2;
__.local.shape = {.x=8, .y=4, .z=4};
__.local.coord = {.x=0, .y=0, .z=2};

__.block.shape = {.x=18, .y=34, .z=34};
__.block.coord = {.x=0, .y=0, .z=64};
__.block.elems = 20808;

=======================
__.world.size = 128;
__.world.rank = 3;

__.nodes.shape = {.x=128, .y=128, .z=128, .t=20};
__.nodes.bound = {.x=1.000000, .y=1.000000, .z=1.000000, .t=0.010000};
__.nodes.steps = {.x=0.007812, .y=0.007812, .z=0.007812, .t=0.000500};

__.param.period = {.x=1, .y=0, .z=0};
__.param.a = {.x=6.283185, .y=3.141593, .z=3.141593, .t=7.695299};
__.param.b = {.x=0.000000, .y=0.000000, .z=0.000000, .t=7.853982};

__.local.rank = 3;
__.local.shape = {.x=8, .y=4, .z=4};
__.local.coord = {.x=0, .y=0, .z=3};

__.block.shape = {.x=18, .y=34, .z=34};
__.block.coord = {.x=0, .y=0, .z=96};
__.block.elems = 20808;

=======================
__.world.size = 128;
__.world.rank = 4;

__.nodes.shape = {.x=128, .y=128, .z=128, .t=20};
__.nodes.bound = {.x=1.000000, .y=1.000000, .z=1.000000, .t=0.010000};
__.nodes.steps = {.x=0.007812, .y=0.007812, .z=0.007812, .t=0.000500};

__.param.period = {.x=1, .y=0, .z=0};
__.param.a = {.x=6.283185, .y=3.141593, .z=3.141593, .t=7.695299};
__.param.b = {.x=0.000000, .y=0.000000, .z=0.000000, .t=7.853982};

__.local.rank = 4;
__.local.shape = {.x=8, .y=4, .z=4};
__.local.coord = {.x=0, .y=1, .z=0};

__.block.shape = {.x=18, .y=34, .z=34};
__.block.coord = {.x=0, .y=32, .z=0};
__.block.elems = 20808;

=======================
__.world.size = 128;
__.world.rank = 5;

__.nodes.shape = {.x=128, .y=128, .z=128, .t=20};
__.nodes.bound = {.x=1.000000, .y=1.000000, .z=1.000000, .t=0.010000};
__.nodes.steps = {.x=0.007812, .y=0.007812, .z=0.007812, .t=0.000500};

__.param.period = {.x=1, .y=0, .z=0};
__.param.a = {.x=6.283185, .y=3.141593, .z=3.141593, .t=7.695299};
__.param.b = {.x=0.000000, .y=0.000000, .z=0.000000, .t=7.853982};

__.local.rank = 5;
__.local.shape = {.x=8, .y=4, .z=4};
__.local.coord = {.x=0, .y=1, .z=1};

__.block.shape = {.x=18, .y=34, .z=34};
__.block.coord = {.x=0, .y=32, .z=32};
__.block.elems = 20808;

=======================
__.world.size = 128;
__.world.rank = 6;

__.nodes.shape = {.x=128, .y=128, .z=128, .t=20};
__.nodes.bound = {.x=1.000000, .y=1.000000, .z=1.000000, .t=0.010000};
__.nodes.steps = {.x=0.007812, .y=0.007812, .z=0.007812, .t=0.000500};

__.param.period = {.x=1, .y=0, .z=0};
__.param.a = {.x=6.283185, .y=3.141593, .z=3.141593, .t=7.695299};
__.param.b = {.x=0.000000, .y=0.000000, .z=0.000000, .t=7.853982};

__.local.rank = 6;
__.local.shape = {.x=8, .y=4, .z=4};
__.local.coord = {.x=0, .y=1, .z=2};

__.block.shape = {.x=18, .y=34, .z=34};
__.block.coord = {.x=0, .y=32, .z=64};
__.block.elems = 20808;

=======================
__.world.size = 128;
__.world.rank = 7;

__.nodes.shape = {.x=128, .y=128, .z=128, .t=20};
__.nodes.bound = {.x=1.000000, .y=1.000000, .z=1.000000, .t=0.010000};
__.nodes.steps = {.x=0.007812, .y=0.007812, .z=0.007812, .t=0.000500};

__.param.period = {.x=1, .y=0, .z=0};
__.param.a = {.x=6.283185, .y=3.141593, .z=3.141593, .t=7.695299};
__.param.b = {.x=0.000000, .y=0.000000, .z=0.000000, .t=7.853982};

__.local.rank = 7;
__.local.shape = {.x=8, .y=4, .z=4};
__.local.coord = {.x=0, .y=1, .z=3};

__.block.shape = {.x=18, .y=34, .z=34};
__.block.coord = {.x=0, .y=32, .z=96};
__.block.elems = 20808;

=======================
__.world.size = 128;
__.world.rank = 8;

__.nodes.shape = {.x=128, .y=128, .z=128, .t=20};
__.nodes.bound = {.x=1.000000, .y=1.000000, .z=1.000000, .t=0.010000};
__.nodes.steps = {.x=0.007812, .y=0.007812, .z=0.007812, .t=0.000500};

__.param.period = {.x=1, .y=0, .z=0};
__.param.a = {.x=6.283185, .y=3.141593, .z=3.141593, .t=7.695299};
__.param.b = {.x=0.000000, .y=0.000000, .z=0.000000, .t=7.853982};

__.local.rank = 8;
__.local.shape = {.x=8, .y=4, .z=4};
__.local.coord = {.x=0, .y=2, .z=0};

__.block.shape = {.x=18, .y=34, .z=34};
__.block.coord = {.x=0, .y=64, .z=0};
__.block.elems = 20808;

=======================
__.world.size = 128;
__.world.rank = 9;

__.nodes.shape = {.x=128, .y=128, .z=128, .t=20};
__.nodes.bound = {.x=1.000000, .y=1.000000, .z=1.000000, .t=0.010000};
__.nodes.steps = {.x=0.007812, .y=0.007812, .z=0.007812, .t=0.000500};

__.param.period = {.x=1, .y=0, .z=0};
__.param.a = {.x=6.283185, .y=3.141593, .z=3.141593, .t=7.695299};
__.param.b = {.x=0.000000, .y=0.000000, .z=0.000000, .t=7.853982};

__.local.rank = 9;
__.local.shape = {.x=8, .y=4, .z=4};
__.local.coord = {.x=0, .y=2, .z=1};

__.block.shape = {.x=18, .y=34, .z=34};
__.block.coord = {.x=0, .y=64, .z=32};
__.block.elems = 20808;

=======================
__.world.size = 128;
__.world.rank = 10;

__.nodes.shape = {.x=128, .y=128, .z=128, .t=20};
__.nodes.bound = {.x=1.000000, .y=1.000000, .z=1.000000, .t=0.010000};
__.nodes.steps = {.x=0.007812, .y=0.007812, .z=0.007812, .t=0.000500};

__.param.period = {.x=1, .y=0, .z=0};
__.param.a = {.x=6.283185, .y=3.141593, .z=3.141593, .t=7.695299};
__.param.b = {.x=0.000000, .y=0.000000, .z=0.000000, .t=7.853982};

__.local.rank = 10;
__.local.shape = {.x=8, .y=4, .z=4};
__.local.coord = {.x=0, .y=2, .z=2};

__.block.shape = {.x=18, .y=34, .z=34};
__.block.coord = {.x=0, .y=64, .z=64};
__.block.elems = 20808;

=======================
__.world.size = 128;
__.world.rank = 11;

__.nodes.shape = {.x=128, .y=128, .z=128, .t=20};
__.nodes.bound = {.x=1.000000, .y=1.000000, .z=1.000000, .t=0.010000};
__.nodes.steps = {.x=0.007812, .y=0.007812, .z=0.007812, .t=0.000500};

__.param.period = {.x=1, .y=0, .z=0};
__.param.a = {.x=6.283185, .y=3.141593, .z=3.141593, .t=7.695299};
__.param.b = {.x=0.000000, .y=0.000000, .z=0.000000, .t=7.853982};

__.local.rank = 11;
__.local.shape = {.x=8, .y=4, .z=4};
__.local.coord = {.x=0, .y=2, .z=3};

__.block.shape = {.x=18, .y=34, .z=34};
__.block.coord = {.x=0, .y=64, .z=96};
__.block.elems = 20808;

=======================
__.world.size = 128;
__.world.rank = 12;

__.nodes.shape = {.x=128, .y=128, .z=128, .t=20};
__.nodes.bound = {.x=1.000000, .y=1.000000, .z=1.000000, .t=0.010000};
__.nodes.steps = {.x=0.007812, .y=0.007812, .z=0.007812, .t=0.000500};

__.param.period = {.x=1, .y=0, .z=0};
__.param.a = {.x=6.283185, .y=3.141593, .z=3.141593, .t=7.695299};
__.param.b = {.x=0.000000, .y=0.000000, .z=0.000000, .t=7.853982};

__.local.rank = 12;
__.local.shape = {.x=8, .y=4, .z=4};
__.local.coord = {.x=0, .y=3, .z=0};

__.block.shape = {.x=18, .y=34, .z=34};
__.block.coord = {.x=0, .y=96, .z=0};
__.block.elems = 20808;

=======================
__.world.size = 128;
__.world.rank = 13;

__.nodes.shape = {.x=128, .y=128, .z=128, .t=20};
__.nodes.bound = {.x=1.000000, .y=1.000000, .z=1.000000, .t=0.010000};
__.nodes.steps = {.x=0.007812, .y=0.007812, .z=0.007812, .t=0.000500};

__.param.period = {.x=1, .y=0, .z=0};
__.param.a = {.x=6.283185, .y=3.141593, .z=3.141593, .t=7.695299};
__.param.b = {.x=0.000000, .y=0.000000, .z=0.000000, .t=7.853982};

__.local.rank = 13;
__.local.shape = {.x=8, .y=4, .z=4};
__.local.coord = {.x=0, .y=3, .z=1};

__.block.shape = {.x=18, .y=34, .z=34};
__.block.coord = {.x=0, .y=96, .z=32};
__.block.elems = 20808;

=======================
__.world.size = 128;
__.world.rank = 14;

__.nodes.shape = {.x=128, .y=128, .z=128, .t=20};
__.nodes.bound = {.x=1.000000, .y=1.000000, .z=1.000000, .t=0.010000};
__.nodes.steps = {.x=0.007812, .y=0.007812, .z=0.007812, .t=0.000500};

__.param.period = {.x=1, .y=0, .z=0};
__.param.a = {.x=6.283185, .y=3.141593, .z=3.141593, .t=7.695299};
__.param.b = {.x=0.000000, .y=0.000000, .z=0.000000, .t=7.853982};

__.local.rank = 14;
__.local.shape = {.x=8, .y=4, .z=4};
__.local.coord = {.x=0, .y=3, .z=2};

__.block.shape = {.x=18, .y=34, .z=34};
__.block.coord = {.x=0, .y=96, .z=64};
__.block.elems = 20808;

=======================
__.world.size = 128;
__.world.rank = 15;

__.nodes.shape = {.x=128, .y=128, .z=128, .t=20};
__.nodes.bound = {.x=1.000000, .y=1.000000, .z=1.000000, .t=0.010000};
__.nodes.steps = {.x=0.007812, .y=0.007812, .z=0.007812, .t=0.000500};

__.param.period = {.x=1, .y=0, .z=0};
__.param.a = {.x=6.283185, .y=3.141593, .z=3.141593, .t=7.695299};
__.param.b = {.x=0.000000, .y=0.000000, .z=0.000000, .t=7.853982};

__.local.rank = 15;
__.local.shape = {.x=8, .y=4, .z=4};
__.local.coord = {.x=0, .y=3, .z=3};

__.block.shape = {.x=18, .y=34, .z=34};
__.block.coord = {.x=0, .y=96, .z=96};
__.block.elems = 20808;

=======================
__.world.size = 128;
__.world.rank = 16;

__.nodes.shape = {.x=128, .y=128, .z=128, .t=20};
__.nodes.bound = {.x=1.000000, .y=1.000000, .z=1.000000, .t=0.010000};
__.nodes.steps = {.x=0.007812, .y=0.007812, .z=0.007812, .t=0.000500};

__.param.period = {.x=1, .y=0, .z=0};
__.param.a = {.x=6.283185, .y=3.141593, .z=3.141593, .t=7.695299};
__.param.b = {.x=0.000000, .y=0.000000, .z=0.000000, .t=7.853982};

__.local.rank = 16;
__.local.shape = {.x=8, .y=4, .z=4};
__.local.coord = {.x=1, .y=0, .z=0};

__.block.shape = {.x=18, .y=34, .z=34};
__.block.coord = {.x=16, .y=0, .z=0};
__.block.elems = 20808;

=======================
__.world.size = 128;
__.world.rank = 17;

__.nodes.shape = {.x=128, .y=128, .z=128, .t=20};
__.nodes.bound = {.x=1.000000, .y=1.000000, .z=1.000000, .t=0.010000};
__.nodes.steps = {.x=0.007812, .y=0.007812, .z=0.007812, .t=0.000500};

__.param.period = {.x=1, .y=0, .z=0};
__.param.a = {.x=6.283185, .y=3.141593, .z=3.141593, .t=7.695299};
__.param.b = {.x=0.000000, .y=0.000000, .z=0.000000, .t=7.853982};

__.local.rank = 17;
__.local.shape = {.x=8, .y=4, .z=4};
__.local.coord = {.x=1, .y=0, .z=1};

__.block.shape = {.x=18, .y=34, .z=34};
__.block.coord = {.x=16, .y=0, .z=32};
__.block.elems = 20808;

=======================
__.world.size = 128;
__.world.rank = 18;

__.nodes.shape = {.x=128, .y=128, .z=128, .t=20};
__.nodes.bound = {.x=1.000000, .y=1.000000, .z=1.000000, .t=0.010000};
__.nodes.steps = {.x=0.007812, .y=0.007812, .z=0.007812, .t=0.000500};

__.param.period = {.x=1, .y=0, .z=0};
__.param.a = {.x=6.283185, .y=3.141593, .z=3.141593, .t=7.695299};
__.param.b = {.x=0.000000, .y=0.000000, .z=0.000000, .t=7.853982};

__.local.rank = 18;
__.local.shape = {.x=8, .y=4, .z=4};
__.local.coord = {.x=1, .y=0, .z=2};

__.block.shape = {.x=18, .y=34, .z=34};
__.block.coord = {.x=16, .y=0, .z=64};
__.block.elems = 20808;

=======================
__.world.size = 128;
__.world.rank = 19;

__.nodes.shape = {.x=128, .y=128, .z=128, .t=20};
__.nodes.bound = {.x=1.000000, .y=1.000000, .z=1.000000, .t=0.010000};
__.nodes.steps = {.x=0.007812, .y=0.007812, .z=0.007812, .t=0.000500};

__.param.period = {.x=1, .y=0, .z=0};
__.param.a = {.x=6.283185, .y=3.141593, .z=3.141593, .t=7.695299};
__.param.b = {.x=0.000000, .y=0.000000, .z=0.000000, .t=7.853982};

__.local.rank = 19;
__.local.shape = {.x=8, .y=4, .z=4};
__.local.coord = {.x=1, .y=0, .z=3};

__.block.shape = {.x=18, .y=34, .z=34};
__.block.coord = {.x=16, .y=0, .z=96};
__.block.elems = 20808;

=======================
__.world.size = 128;
__.world.rank = 20;

__.nodes.shape = {.x=128, .y=128, .z=128, .t=20};
__.nodes.bound = {.x=1.000000, .y=1.000000, .z=1.000000, .t=0.010000};
__.nodes.steps = {.x=0.007812, .y=0.007812, .z=0.007812, .t=0.000500};

__.param.period = {.x=1, .y=0, .z=0};
__.param.a = {.x=6.283185, .y=3.141593, .z=3.141593, .t=7.695299};
__.param.b = {.x=0.000000, .y=0.000000, .z=0.000000, .t=7.853982};

__.local.rank = 20;
__.local.shape = {.x=8, .y=4, .z=4};
__.local.coord = {.x=1, .y=1, .z=0};

__.block.shape = {.x=18, .y=34, .z=34};
__.block.coord = {.x=16, .y=32, .z=0};
__.block.elems = 20808;

=======================
__.world.size = 128;
__.world.rank = 21;

__.nodes.shape = {.x=128, .y=128, .z=128, .t=20};
__.nodes.bound = {.x=1.000000, .y=1.000000, .z=1.000000, .t=0.010000};
__.nodes.steps = {.x=0.007812, .y=0.007812, .z=0.007812, .t=0.000500};

__.param.period = {.x=1, .y=0, .z=0};
__.param.a = {.x=6.283185, .y=3.141593, .z=3.141593, .t=7.695299};
__.param.b = {.x=0.000000, .y=0.000000, .z=0.000000, .t=7.853982};

__.local.rank = 21;
__.local.shape = {.x=8, .y=4, .z=4};
__.local.coord = {.x=1, .y=1, .z=1};

__.block.shape = {.x=18, .y=34, .z=34};
__.block.coord = {.x=16, .y=32, .z=32};
__.block.elems = 20808;

=======================
__.world.size = 128;
__.world.rank = 22;

__.nodes.shape = {.x=128, .y=128, .z=128, .t=20};
__.nodes.bound = {.x=1.000000, .y=1.000000, .z=1.000000, .t=0.010000};
__.nodes.steps = {.x=0.007812, .y=0.007812, .z=0.007812, .t=0.000500};

__.param.period = {.x=1, .y=0, .z=0};
__.param.a = {.x=6.283185, .y=3.141593, .z=3.141593, .t=7.695299};
__.param.b = {.x=0.000000, .y=0.000000, .z=0.000000, .t=7.853982};

__.local.rank = 22;
__.local.shape = {.x=8, .y=4, .z=4};
__.local.coord = {.x=1, .y=1, .z=2};

__.block.shape = {.x=18, .y=34, .z=34};
__.block.coord = {.x=16, .y=32, .z=64};
__.block.elems = 20808;

=======================
__.world.size = 128;
__.world.rank = 23;

__.nodes.shape = {.x=128, .y=128, .z=128, .t=20};
__.nodes.bound = {.x=1.000000, .y=1.000000, .z=1.000000, .t=0.010000};
__.nodes.steps = {.x=0.007812, .y=0.007812, .z=0.007812, .t=0.000500};

__.param.period = {.x=1, .y=0, .z=0};
__.param.a = {.x=6.283185, .y=3.141593, .z=3.141593, .t=7.695299};
__.param.b = {.x=0.000000, .y=0.000000, .z=0.000000, .t=7.853982};

__.local.rank = 23;
__.local.shape = {.x=8, .y=4, .z=4};
__.local.coord = {.x=1, .y=1, .z=3};

__.block.shape = {.x=18, .y=34, .z=34};
__.block.coord = {.x=16, .y=32, .z=96};
__.block.elems = 20808;

=======================
__.world.size = 128;
__.world.rank = 24;

__.nodes.shape = {.x=128, .y=128, .z=128, .t=20};
__.nodes.bound = {.x=1.000000, .y=1.000000, .z=1.000000, .t=0.010000};
__.nodes.steps = {.x=0.007812, .y=0.007812, .z=0.007812, .t=0.000500};

__.param.period = {.x=1, .y=0, .z=0};
__.param.a = {.x=6.283185, .y=3.141593, .z=3.141593, .t=7.695299};
__.param.b = {.x=0.000000, .y=0.000000, .z=0.000000, .t=7.853982};

__.local.rank = 24;
__.local.shape = {.x=8, .y=4, .z=4};
__.local.coord = {.x=1, .y=2, .z=0};

__.block.shape = {.x=18, .y=34, .z=34};
__.block.coord = {.x=16, .y=64, .z=0};
__.block.elems = 20808;

=======================
__.world.size = 128;
__.world.rank = 25;

__.nodes.shape = {.x=128, .y=128, .z=128, .t=20};
__.nodes.bound = {.x=1.000000, .y=1.000000, .z=1.000000, .t=0.010000};
__.nodes.steps = {.x=0.007812, .y=0.007812, .z=0.007812, .t=0.000500};

__.param.period = {.x=1, .y=0, .z=0};
__.param.a = {.x=6.283185, .y=3.141593, .z=3.141593, .t=7.695299};
__.param.b = {.x=0.000000, .y=0.000000, .z=0.000000, .t=7.853982};

__.local.rank = 25;
__.local.shape = {.x=8, .y=4, .z=4};
__.local.coord = {.x=1, .y=2, .z=1};

__.block.shape = {.x=18, .y=34, .z=34};
__.block.coord = {.x=16, .y=64, .z=32};
__.block.elems = 20808;

=======================
__.world.size = 128;
__.world.rank = 26;

__.nodes.shape = {.x=128, .y=128, .z=128, .t=20};
__.nodes.bound = {.x=1.000000, .y=1.000000, .z=1.000000, .t=0.010000};
__.nodes.steps = {.x=0.007812, .y=0.007812, .z=0.007812, .t=0.000500};

__.param.period = {.x=1, .y=0, .z=0};
__.param.a = {.x=6.283185, .y=3.141593, .z=3.141593, .t=7.695299};
__.param.b = {.x=0.000000, .y=0.000000, .z=0.000000, .t=7.853982};

__.local.rank = 26;
__.local.shape = {.x=8, .y=4, .z=4};
__.local.coord = {.x=1, .y=2, .z=2};

__.block.shape = {.x=18, .y=34, .z=34};
__.block.coord = {.x=16, .y=64, .z=64};
__.block.elems = 20808;

=======================
__.world.size = 128;
__.world.rank = 27;

__.nodes.shape = {.x=128, .y=128, .z=128, .t=20};
__.nodes.bound = {.x=1.000000, .y=1.000000, .z=1.000000, .t=0.010000};
__.nodes.steps = {.x=0.007812, .y=0.007812, .z=0.007812, .t=0.000500};

__.param.period = {.x=1, .y=0, .z=0};
__.param.a = {.x=6.283185, .y=3.141593, .z=3.141593, .t=7.695299};
__.param.b = {.x=0.000000, .y=0.000000, .z=0.000000, .t=7.853982};

__.local.rank = 27;
__.local.shape = {.x=8, .y=4, .z=4};
__.local.coord = {.x=1, .y=2, .z=3};

__.block.shape = {.x=18, .y=34, .z=34};
=======================
__.block.coord = {.x=16, .y=64, .z=96};
__.block.elems = 20808;

__.world.size = 128;
=======================
__.world.rank = 32;
__.world.size = 128;

__.world.rank = 28;
__.nodes.shape = {.x=128, .y=128, .z=128, .t=20};

__.nodes.bound = {.x=1.000000, .y=1.000000, .z=1.000000, .t=0.010000};
__.nodes.shape = {.x=128, .y=128, .z=128, .t=20};
__.nodes.steps = {.x=0.007812, .y=0.007812, .z=0.007812, .t=0.000500};
__.nodes.bound = {.x=1.000000, .y=1.000000, .z=1.000000, .t=0.010000};

__.nodes.steps = {.x=0.007812, .y=0.007812, .z=0.007812, .t=0.000500};
__.param.period = {.x=1, .y=0, .z=0};

__.param.a = {.x=6.283185, .y=3.141593, .z=3.141593, .t=7.695299};
__.param.period = {.x=1, .y=0, .z=0};
__.param.b = {.x=0.000000, .y=0.000000, .z=0.000000, .t=7.853982};
__.param.a = {.x=6.283185, .y=3.141593, .z=3.141593, .t=7.695299};

__.param.b = {.x=0.000000, .y=0.000000, .z=0.000000, .t=7.853982};
__.local.rank = 32;

__.local.shape = {.x=8, .y=4, .z=4};
__.local.rank = 28;
__.local.coord = {.x=2, .y=0, .z=0};
__.local.shape = {.x=8, .y=4, .z=4};

__.local.coord = {.x=1, .y=3, .z=0};
__.block.shape = {.x=18, .y=34, .z=34};

__.block.coord = {.x=32, .y=0, .z=0};
__.block.elems = 20808;

=======================
__.world.size = 128;
__.world.rank = 33;

__.nodes.shape = {.x=128, .y=128, .z=128, .t=20};
__.nodes.bound = {.x=1.000000, .y=1.000000, .z=1.000000, .t=0.010000};
__.nodes.steps = {.x=0.007812, .y=0.007812, .z=0.007812, .t=0.000500};

__.param.period = {.x=1, .y=0, .z=0};
__.param.a = {.x=6.283185, .y=3.141593, .z=3.141593, .t=7.695299};
__.param.b = {.x=0.000000, .y=0.000000, .z=0.000000, .t=7.853982};

__.local.rank = 33;
__.local.shape = {.x=8, .y=4, .z=4};
__.local.coord = {.x=2, .y=0, .z=1};

__.block.shape = {.x=18, .y=34, .z=34};
__.block.coord = {.x=32, .y=0, .z=32};
__.block.elems = 20808;

=======================
__.world.size = 128;
__.world.rank = 34;

__.nodes.shape = {.x=128, .y=128, .z=128, .t=20};
__.nodes.bound = {.x=1.000000, .y=1.000000, .z=1.000000, .t=0.010000};
__.nodes.steps = {.x=0.007812, .y=0.007812, .z=0.007812, .t=0.000500};

__.param.period = {.x=1, .y=0, .z=0};
__.param.a = {.x=6.283185, .y=3.141593, .z=3.141593, .t=7.695299};
__.param.b = {.x=0.000000, .y=0.000000, .z=0.000000, .t=7.853982};

__.local.rank = 34;
__.local.shape = {.x=8, .y=4, .z=4};
__.local.coord = {.x=2, .y=0, .z=2};

__.block.shape = {.x=18, .y=34, .z=34};
__.block.coord = {.x=32, .y=0, .z=64};
__.block.elems = 20808;

=======================
__.world.size = 128;
__.world.rank = 35;

__.nodes.shape = {.x=128, .y=128, .z=128, .t=20};
__.nodes.bound = {.x=1.000000, .y=1.000000, .z=1.000000, .t=0.010000};
__.nodes.steps = {.x=0.007812, .y=0.007812, .z=0.007812, .t=0.000500};

__.param.period = {.x=1, .y=0, .z=0};
__.param.a = {.x=6.283185, .y=3.141593, .z=3.141593, .t=7.695299};
__.param.b = {.x=0.000000, .y=0.000000, .z=0.000000, .t=7.853982};

__.local.rank = 35;
__.local.shape = {.x=8, .y=4, .z=4};
__.local.coord = {.x=2, .y=0, .z=3};

__.block.shape = {.x=18, .y=34, .z=34};
__.block.coord = {.x=32, .y=0, .z=96};
__.block.elems = 20808;

=======================
__.world.size = 128;
__.world.rank = 36;

__.nodes.shape = {.x=128, .y=128, .z=128, .t=20};
__.nodes.bound = {.x=1.000000, .y=1.000000, .z=1.000000, .t=0.010000};
__.nodes.steps = {.x=0.007812, .y=0.007812, .z=0.007812, .t=0.000500};

__.param.period = {.x=1, .y=0, .z=0};
__.param.a = {.x=6.283185, .y=3.141593, .z=3.141593, .t=7.695299};
__.param.b = {.x=0.000000, .y=0.000000, .z=0.000000, .t=7.853982};

__.local.rank = 36;
__.local.shape = {.x=8, .y=4, .z=4};
__.local.coord = {.x=2, .y=1, .z=0};

__.block.shape = {.x=18, .y=34, .z=34};
__.block.coord = {.x=32, .y=32, .z=0};
__.block.elems = 20808;

=======================
__.world.size = 128;
__.world.rank = 37;

__.nodes.shape = {.x=128, .y=128, .z=128, .t=20};
__.nodes.bound = {.x=1.000000, .y=1.000000, .z=1.000000, .t=0.010000};
__.nodes.steps = {.x=0.007812, .y=0.007812, .z=0.007812, .t=0.000500};

__.param.period = {.x=1, .y=0, .z=0};
__.param.a = {.x=6.283185, .y=3.141593, .z=3.141593, .t=7.695299};
__.param.b = {.x=0.000000, .y=0.000000, .z=0.000000, .t=7.853982};

__.local.rank = 37;
__.local.shape = {.x=8, .y=4, .z=4};
__.local.coord = {.x=2, .y=1, .z=1};

__.block.shape = {.x=18, .y=34, .z=34};
__.block.coord = {.x=32, .y=32, .z=32};
__.block.elems = 20808;

=======================
__.world.size = 128;
__.world.rank = 38;

__.nodes.shape = {.x=128, .y=128, .z=128, .t=20};
__.nodes.bound = {.x=1.000000, .y=1.000000, .z=1.000000, .t=0.010000};
__.nodes.steps = {.x=0.007812, .y=0.007812, .z=0.007812, .t=0.000500};

__.param.period = {.x=1, .y=0, .z=0};
__.param.a = {.x=6.283185, .y=3.141593, .z=3.141593, .t=7.695299};
__.param.b = {.x=0.000000, .y=0.000000, .z=0.000000, .t=7.853982};

__.local.rank = 38;
__.local.shape = {.x=8, .y=4, .z=4};
__.local.coord = {.x=2, .y=1, .z=2};

__.block.shape = {.x=18, .y=34, .z=34};
__.block.coord = {.x=32, .y=32, .z=64};
__.block.elems = 20808;

=======================
__.world.size = 128;
__.world.rank = 39;

__.nodes.shape = {.x=128, .y=128, .z=128, .t=20};
__.nodes.bound = {.x=1.000000, .y=1.000000, .z=1.000000, .t=0.010000};
__.nodes.steps = {.x=0.007812, .y=0.007812, .z=0.007812, .t=0.000500};

__.param.period = {.x=1, .y=0, .z=0};
__.param.a = {.x=6.283185, .y=3.141593, .z=3.141593, .t=7.695299};
__.param.b = {.x=0.000000, .y=0.000000, .z=0.000000, .t=7.853982};

__.local.rank = 39;
__.local.shape = {.x=8, .y=4, .z=4};
__.local.coord = {.x=2, .y=1, .z=3};

__.block.shape = {.x=18, .y=34, .z=34};
__.block.coord = {.x=32, .y=32, .z=96};
__.block.elems = 20808;

=======================
__.world.size = 128;
__.world.rank = 40;

__.nodes.shape = {.x=128, .y=128, .z=128, .t=20};
__.nodes.bound = {.x=1.000000, .y=1.000000, .z=1.000000, .t=0.010000};
__.nodes.steps = {.x=0.007812, .y=0.007812, .z=0.007812, .t=0.000500};

__.param.period = {.x=1, .y=0, .z=0};
__.param.a = {.x=6.283185, .y=3.141593, .z=3.141593, .t=7.695299};
__.param.b = {.x=0.000000, .y=0.000000, .z=0.000000, .t=7.853982};

__.local.rank = 40;
__.local.shape = {.x=8, .y=4, .z=4};
__.local.coord = {.x=2, .y=2, .z=0};

__.block.shape = {.x=18, .y=34, .z=34};
__.block.coord = {.x=32, .y=64, .z=0};
__.block.elems = 20808;

=======================
__.world.size = 128;
__.world.rank = 41;

__.nodes.shape = {.x=128, .y=128, .z=128, .t=20};
__.nodes.bound = {.x=1.000000, .y=1.000000, .z=1.000000, .t=0.010000};
__.nodes.steps = {.x=0.007812, .y=0.007812, .z=0.007812, .t=0.000500};

__.param.period = {.x=1, .y=0, .z=0};
__.param.a = {.x=6.283185, .y=3.141593, .z=3.141593, .t=7.695299};
__.param.b = {.x=0.000000, .y=0.000000, .z=0.000000, .t=7.853982};

__.local.rank = 41;
__.local.shape = {.x=8, .y=4, .z=4};
__.local.coord = {.x=2, .y=2, .z=1};

__.block.shape = {.x=18, .y=34, .z=34};
__.block.coord = {.x=32, .y=64, .z=32};
__.block.elems = 20808;

=======================
__.world.size = 128;
__.world.rank = 42;

__.nodes.shape = {.x=128, .y=128, .z=128, .t=20};
__.nodes.bound = {.x=1.000000, .y=1.000000, .z=1.000000, .t=0.010000};
__.nodes.steps = {.x=0.007812, .y=0.007812, .z=0.007812, .t=0.000500};

__.param.period = {.x=1, .y=0, .z=0};
__.param.a = {.x=6.283185, .y=3.141593, .z=3.141593, .t=7.695299};
__.param.b = {.x=0.000000, .y=0.000000, .z=0.000000, .t=7.853982};

__.local.rank = 42;
__.local.shape = {.x=8, .y=4, .z=4};
__.local.coord = {.x=2, .y=2, .z=2};

__.block.shape = {.x=18, .y=34, .z=34};
__.block.coord = {.x=32, .y=64, .z=64};
__.block.elems = 20808;

=======================
__.world.size = 128;
__.world.rank = 43;

__.nodes.shape = {.x=128, .y=128, .z=128, .t=20};
__.nodes.bound = {.x=1.000000, .y=1.000000, .z=1.000000, .t=0.010000};
__.nodes.steps = {.x=0.007812, .y=0.007812, .z=0.007812, .t=0.000500};

__.param.period = {.x=1, .y=0, .z=0};
__.param.a = {.x=6.283185, .y=3.141593, .z=3.141593, .t=7.695299};
__.param.b = {.x=0.000000, .y=0.000000, .z=0.000000, .t=7.853982};

__.local.rank = 43;
__.local.shape = {.x=8, .y=4, .z=4};
__.local.coord = {.x=2, .y=2, .z=3};

__.block.shape = {.x=18, .y=34, .z=34};
__.block.coord = {.x=32, .y=64, .z=96};
__.block.elems = 20808;

=======================
__.world.size = 128;
__.world.rank = 44;

__.nodes.shape = {.x=128, .y=128, .z=128, .t=20};
__.nodes.bound = {.x=1.000000, .y=1.000000, .z=1.000000, .t=0.010000};
__.nodes.steps = {.x=0.007812, .y=0.007812, .z=0.007812, .t=0.000500};

__.param.period = {.x=1, .y=0, .z=0};
__.param.a = {.x=6.283185, .y=3.141593, .z=3.141593, .t=7.695299};
__.param.b = {.x=0.000000, .y=0.000000, .z=0.000000, .t=7.853982};

__.local.rank = 44;
__.local.shape = {.x=8, .y=4, .z=4};
__.local.coord = {.x=2, .y=3, .z=0};

__.block.shape = {.x=18, .y=34, .z=34};
__.block.coord = {.x=32, .y=96, .z=0};
__.block.elems = 20808;

=======================
__.world.size = 128;
__.world.rank = 45;

__.nodes.shape = {.x=128, .y=128, .z=128, .t=20};
__.nodes.bound = {.x=1.000000, .y=1.000000, .z=1.000000, .t=0.010000};
__.nodes.steps = {.x=0.007812, .y=0.007812, .z=0.007812, .t=0.000500};

__.param.period = {.x=1, .y=0, .z=0};
__.param.a = {.x=6.283185, .y=3.141593, .z=3.141593, .t=7.695299};
__.param.b = {.x=0.000000, .y=0.000000, .z=0.000000, .t=7.853982};

__.local.rank = 45;
__.local.shape = {.x=8, .y=4, .z=4};
__.local.coord = {.x=2, .y=3, .z=1};

__.block.shape = {.x=18, .y=34, .z=34};
__.block.coord = {.x=32, .y=96, .z=32};
__.block.elems = 20808;

=======================
__.world.size = 128;
__.world.rank = 46;

__.nodes.shape = {.x=128, .y=128, .z=128, .t=20};
__.nodes.bound = {.x=1.000000, .y=1.000000, .z=1.000000, .t=0.010000};
__.nodes.steps = {.x=0.007812, .y=0.007812, .z=0.007812, .t=0.000500};

__.param.period = {.x=1, .y=0, .z=0};
__.param.a = {.x=6.283185, .y=3.141593, .z=3.141593, .t=7.695299};
__.param.b = {.x=0.000000, .y=0.000000, .z=0.000000, .t=7.853982};

__.local.rank = 46;
__.local.shape = {.x=8, .y=4, .z=4};
__.local.coord = {.x=2, .y=3, .z=2};

__.block.shape = {.x=18, .y=34, .z=34};
__.block.coord = {.x=32, .y=96, .z=64};
__.block.elems = 20808;

=======================
__.world.size = 128;
__.world.rank = 47;

__.nodes.shape = {.x=128, .y=128, .z=128, .t=20};
__.nodes.bound = {.x=1.000000, .y=1.000000, .z=1.000000, .t=0.010000};
__.nodes.steps = {.x=0.007812, .y=0.007812, .z=0.007812, .t=0.000500};

__.param.period = {.x=1, .y=0, .z=0};
__.param.a = {.x=6.283185, .y=3.141593, .z=3.141593, .t=7.695299};
__.param.b = {.x=0.000000, .y=0.000000, .z=0.000000, .t=7.853982};

__.local.rank = 47;
__.local.shape = {.x=8, .y=4, .z=4};
__.local.coord = {.x=2, .y=3, .z=3};

__.block.shape = {.x=18, .y=34, .z=34};
__.block.coord = {.x=32, .y=96, .z=96};
__.block.elems = 20808;

=======================
__.world.size = 128;
__.world.rank = 48;

__.nodes.shape = {.x=128, .y=128, .z=128, .t=20};
__.nodes.bound = {.x=1.000000, .y=1.000000, .z=1.000000, .t=0.010000};
__.nodes.steps = {.x=0.007812, .y=0.007812, .z=0.007812, .t=0.000500};

__.param.period = {.x=1, .y=0, .z=0};
__.param.a = {.x=6.283185, .y=3.141593, .z=3.141593, .t=7.695299};
__.param.b = {.x=0.000000, .y=0.000000, .z=0.000000, .t=7.853982};

__.local.rank = 48;
__.local.shape = {.x=8, .y=4, .z=4};
__.local.coord = {.x=3, .y=0, .z=0};

__.block.shape = {.x=18, .y=34, .z=34};
__.block.coord = {.x=48, .y=0, .z=0};
__.block.elems = 20808;

=======================
__.world.size = 128;
__.world.rank = 49;

__.nodes.shape = {.x=128, .y=128, .z=128, .t=20};
__.nodes.bound = {.x=1.000000, .y=1.000000, .z=1.000000, .t=0.010000};
__.nodes.steps = {.x=0.007812, .y=0.007812, .z=0.007812, .t=0.000500};

__.param.period = {.x=1, .y=0, .z=0};
__.param.a = {.x=6.283185, .y=3.141593, .z=3.141593, .t=7.695299};
__.param.b = {.x=0.000000, .y=0.000000, .z=0.000000, .t=7.853982};

__.local.rank = 49;
__.local.shape = {.x=8, .y=4, .z=4};
__.local.coord = {.x=3, .y=0, .z=1};

__.block.shape = {.x=18, .y=34, .z=34};
__.block.coord = {.x=48, .y=0, .z=32};
__.block.elems = 20808;

=======================
__.world.size = 128;
__.world.rank = 50;

__.nodes.shape = {.x=128, .y=128, .z=128, .t=20};
__.nodes.bound = {.x=1.000000, .y=1.000000, .z=1.000000, .t=0.010000};
__.nodes.steps = {.x=0.007812, .y=0.007812, .z=0.007812, .t=0.000500};

__.param.period = {.x=1, .y=0, .z=0};
__.param.a = {.x=6.283185, .y=3.141593, .z=3.141593, .t=7.695299};
__.param.b = {.x=0.000000, .y=0.000000, .z=0.000000, .t=7.853982};

__.local.rank = 50;
__.local.shape = {.x=8, .y=4, .z=4};
__.local.coord = {.x=3, .y=0, .z=2};

__.block.shape = {.x=18, .y=34, .z=34};
__.block.coord = {.x=48, .y=0, .z=64};
__.block.elems = 20808;

=======================
__.world.size = 128;
__.world.rank = 51;

__.nodes.shape = {.x=128, .y=128, .z=128, .t=20};
__.nodes.bound = {.x=1.000000, .y=1.000000, .z=1.000000, .t=0.010000};
__.nodes.steps = {.x=0.007812, .y=0.007812, .z=0.007812, .t=0.000500};

__.param.period = {.x=1, .y=0, .z=0};
__.param.a = {.x=6.283185, .y=3.141593, .z=3.141593, .t=7.695299};
__.param.b = {.x=0.000000, .y=0.000000, .z=0.000000, .t=7.853982};

__.local.rank = 51;
__.local.shape = {.x=8, .y=4, .z=4};
__.local.coord = {.x=3, .y=0, .z=3};

__.block.shape = {.x=18, .y=34, .z=34};
__.block.coord = {.x=48, .y=0, .z=96};
__.block.elems = 20808;

=======================
__.world.size = 128;
__.world.rank = 52;

__.nodes.shape = {.x=128, .y=128, .z=128, .t=20};
__.nodes.bound = {.x=1.000000, .y=1.000000, .z=1.000000, .t=0.010000};
__.nodes.steps = {.x=0.007812, .y=0.007812, .z=0.007812, .t=0.000500};

__.param.period = {.x=1, .y=0, .z=0};
__.param.a = {.x=6.283185, .y=3.141593, .z=3.141593, .t=7.695299};
__.param.b = {.x=0.000000, .y=0.000000, .z=0.000000, .t=7.853982};

__.local.rank = 52;
__.local.shape = {.x=8, .y=4, .z=4};
__.local.coord = {.x=3, .y=1, .z=0};

__.block.shape = {.x=18, .y=34, .z=34};
__.block.coord = {.x=48, .y=32, .z=0};
__.block.elems = 20808;

=======================
__.world.size = 128;
__.world.rank = 53;

__.nodes.shape = {.x=128, .y=128, .z=128, .t=20};
__.nodes.bound = {.x=1.000000, .y=1.000000, .z=1.000000, .t=0.010000};
__.nodes.steps = {.x=0.007812, .y=0.007812, .z=0.007812, .t=0.000500};

__.param.period = {.x=1, .y=0, .z=0};
__.param.a = {.x=6.283185, .y=3.141593, .z=3.141593, .t=7.695299};
__.param.b = {.x=0.000000, .y=0.000000, .z=0.000000, .t=7.853982};

__.local.rank = 53;
__.local.shape = {.x=8, .y=4, .z=4};
__.local.coord = {.x=3, .y=1, .z=1};

__.block.shape = {.x=18, .y=34, .z=34};
__.block.coord = {.x=48, .y=32, .z=32};
__.block.elems = 20808;

=======================
__.world.size = 128;
__.world.rank = 54;

__.nodes.shape = {.x=128, .y=128, .z=128, .t=20};
__.nodes.bound = {.x=1.000000, .y=1.000000, .z=1.000000, .t=0.010000};
__.nodes.steps = {.x=0.007812, .y=0.007812, .z=0.007812, .t=0.000500};

__.param.period = {.x=1, .y=0, .z=0};
__.param.a = {.x=6.283185, .y=3.141593, .z=3.141593, .t=7.695299};
__.param.b = {.x=0.000000, .y=0.000000, .z=0.000000, .t=7.853982};

__.local.rank = 54;
__.local.shape = {.x=8, .y=4, .z=4};
__.local.coord = {.x=3, .y=1, .z=2};

__.block.shape = {.x=18, .y=34, .z=34};
__.block.coord = {.x=48, .y=32, .z=64};
__.block.elems = 20808;

=======================
__.world.size = 128;
__.world.rank = 55;

__.nodes.shape = {.x=128, .y=128, .z=128, .t=20};
__.nodes.bound = {.x=1.000000, .y=1.000000, .z=1.000000, .t=0.010000};
__.nodes.steps = {.x=0.007812, .y=0.007812, .z=0.007812, .t=0.000500};

__.param.period = {.x=1, .y=0, .z=0};
__.param.a = {.x=6.283185, .y=3.141593, .z=3.141593, .t=7.695299};
__.param.b = {.x=0.000000, .y=0.000000, .z=0.000000, .t=7.853982};

__.local.rank = 55;
__.local.shape = {.x=8, .y=4, .z=4};
__.local.coord = {.x=3, .y=1, .z=3};

__.block.shape = {.x=18, .y=34, .z=34};
__.block.coord = {.x=48, .y=32, .z=96};
__.block.elems = 20808;

=======================
__.world.size = 128;
__.world.rank = 56;

__.nodes.shape = {.x=128, .y=128, .z=128, .t=20};
__.nodes.bound = {.x=1.000000, .y=1.000000, .z=1.000000, .t=0.010000};
__.nodes.steps = {.x=0.007812, .y=0.007812, .z=0.007812, .t=0.000500};

__.param.period = {.x=1, .y=0, .z=0};
__.param.a = {.x=6.283185, .y=3.141593, .z=3.141593, .t=7.695299};
__.param.b = {.x=0.000000, .y=0.000000, .z=0.000000, .t=7.853982};

__.local.rank = 56;
__.local.shape = {.x=8, .y=4, .z=4};
__.local.coord = {.x=3, .y=2, .z=0};

__.block.shape = {.x=18, .y=34, .z=34};
__.block.coord = {.x=48, .y=64, .z=0};
__.block.elems = 20808;

=======================
__.world.size = 128;
__.world.rank = 57;

__.nodes.shape = {.x=128, .y=128, .z=128, .t=20};
__.nodes.bound = {.x=1.000000, .y=1.000000, .z=1.000000, .t=0.010000};
__.nodes.steps = {.x=0.007812, .y=0.007812, .z=0.007812, .t=0.000500};

__.param.period = {.x=1, .y=0, .z=0};
__.param.a = {.x=6.283185, .y=3.141593, .z=3.141593, .t=7.695299};
__.param.b = {.x=0.000000, .y=0.000000, .z=0.000000, .t=7.853982};

__.local.rank = 57;
__.local.shape = {.x=8, .y=4, .z=4};
__.local.coord = {.x=3, .y=2, .z=1};

__.block.shape = {.x=18, .y=34, .z=34};
__.block.coord = {.x=48, .y=64, .z=32};
__.block.elems = 20808;

=======================
=======================
__.world.size = 128;
__.world.rank = 58;

__.world.size = 128;
__.nodes.shape = {.x=128, .y=128, .z=128, .t=20};
__.world.rank = 64;
__.nodes.bound = {.x=1.000000, .y=1.000000, .z=1.000000, .t=0.010000};

__.nodes.steps = {.x=0.007812, .y=0.007812, .z=0.007812, .t=0.000500};
__.nodes.shape = {.x=128, .y=128, .z=128, .t=20};

__.nodes.bound = {.x=1.000000, .y=1.000000, .z=1.000000, .t=0.010000};
__.param.period = {.x=1, .y=0, .z=0};
__.nodes.steps = {.x=0.007812, .y=0.007812, .z=0.007812, .t=0.000500};
__.param.a = {.x=6.283185, .y=3.141593, .z=3.141593, .t=7.695299};

__.param.b = {.x=0.000000, .y=0.000000, .z=0.000000, .t=7.853982};
__.param.period = {.x=1, .y=0, .z=0};

__.param.a = {.x=6.283185, .y=3.141593, .z=3.141593, .t=7.695299};
__.block.shape = {.x=18, .y=34, .z=34};
__.local.rank = 58;
__.param.b = {.x=0.000000, .y=0.000000, .z=0.000000, .t=7.853982};
__.block.coord = {.x=16, .y=96, .z=0};
__.local.shape = {.x=8, .y=4, .z=4};

__.block.elems = 20808;
__.local.coord = {.x=3, .y=2, .z=2};
__.local.rank = 64;


__.local.shape = {.x=8, .y=4, .z=4};
=======================
__.block.shape = {.x=18, .y=34, .z=34};
__.local.coord = {.x=4, .y=0, .z=0};
__.world.size = 128;
__.block.coord = {.x=48, .y=64, .z=64};

__.world.rank = 29;
__.block.elems = 20808;
__.block.shape = {.x=18, .y=34, .z=34};


__.block.coord = {.x=64, .y=0, .z=0};
__.nodes.shape = {.x=128, .y=128, .z=128, .t=20};
=======================
__.block.elems = 20808;
__.nodes.bound = {.x=1.000000, .y=1.000000, .z=1.000000, .t=0.010000};
__.world.size = 128;

__.nodes.steps = {.x=0.007812, .y=0.007812, .z=0.007812, .t=0.000500};
__.world.rank = 59;
=======================


__.world.size = 128;
__.param.period = {.x=1, .y=0, .z=0};
__.nodes.shape = {.x=128, .y=128, .z=128, .t=20};
__.world.rank = 65;
__.param.a = {.x=6.283185, .y=3.141593, .z=3.141593, .t=7.695299};
__.nodes.bound = {.x=1.000000, .y=1.000000, .z=1.000000, .t=0.010000};

__.param.b = {.x=0.000000, .y=0.000000, .z=0.000000, .t=7.853982};
__.nodes.steps = {.x=0.007812, .y=0.007812, .z=0.007812, .t=0.000500};


__.nodes.shape = {.x=128, .y=128, .z=128, .t=20};
__.local.rank = 29;
__.param.period = {.x=1, .y=0, .z=0};
__.nodes.bound = {.x=1.000000, .y=1.000000, .z=1.000000, .t=0.010000};
__.local.shape = {.x=8, .y=4, .z=4};
__.param.a = {.x=6.283185, .y=3.141593, .z=3.141593, .t=7.695299};
__.nodes.steps = {.x=0.007812, .y=0.007812, .z=0.007812, .t=0.000500};
__.local.coord = {.x=1, .y=3, .z=1};
__.param.b = {.x=0.000000, .y=0.000000, .z=0.000000, .t=7.853982};



__.param.period = {.x=1, .y=0, .z=0};
__.block.shape = {.x=18, .y=34, .z=34};
__.local.rank = 59;
__.param.a = {.x=6.283185, .y=3.141593, .z=3.141593, .t=7.695299};
__.block.coord = {.x=16, .y=96, .z=32};
__.local.shape = {.x=8, .y=4, .z=4};
__.param.b = {.x=0.000000, .y=0.000000, .z=0.000000, .t=7.853982};
__.block.elems = 20808;
__.local.coord = {.x=3, .y=2, .z=3};



__.local.rank = 65;
=======================
__.block.shape = {.x=18, .y=34, .z=34};
__.local.shape = {.x=8, .y=4, .z=4};
__.world.size = 128;
__.block.coord = {.x=48, .y=64, .z=96};
__.local.coord = {.x=4, .y=0, .z=1};
__.world.rank = 30;
__.block.elems = 20808;



__.block.shape = {.x=18, .y=34, .z=34};
__.nodes.shape = {.x=128, .y=128, .z=128, .t=20};
=======================
__.block.coord = {.x=64, .y=0, .z=32};
__.nodes.bound = {.x=1.000000, .y=1.000000, .z=1.000000, .t=0.010000};
__.world.size = 128;
__.block.elems = 20808;
__.nodes.steps = {.x=0.007812, .y=0.007812, .z=0.007812, .t=0.000500};
__.world.rank = 60;



=======================
__.param.period = {.x=1, .y=0, .z=0};
__.nodes.shape = {.x=128, .y=128, .z=128, .t=20};
__.world.size = 128;
__.param.a = {.x=6.283185, .y=3.141593, .z=3.141593, .t=7.695299};
__.nodes.bound = {.x=1.000000, .y=1.000000, .z=1.000000, .t=0.010000};
__.world.rank = 66;
__.param.b = {.x=0.000000, .y=0.000000, .z=0.000000, .t=7.853982};
__.nodes.steps = {.x=0.007812, .y=0.007812, .z=0.007812, .t=0.000500};



__.nodes.shape = {.x=128, .y=128, .z=128, .t=20};
__.local.rank = 30;
__.param.period = {.x=1, .y=0, .z=0};
__.nodes.bound = {.x=1.000000, .y=1.000000, .z=1.000000, .t=0.010000};
__.local.shape = {.x=8, .y=4, .z=4};
__.param.a = {.x=6.283185, .y=3.141593, .z=3.141593, .t=7.695299};
__.nodes.steps = {.x=0.007812, .y=0.007812, .z=0.007812, .t=0.000500};
__.local.coord = {.x=1, .y=3, .z=2};
__.param.b = {.x=0.000000, .y=0.000000, .z=0.000000, .t=7.853982};



__.param.period = {.x=1, .y=0, .z=0};
__.block.shape = {.x=18, .y=34, .z=34};
__.local.rank = 60;
__.param.a = {.x=6.283185, .y=3.141593, .z=3.141593, .t=7.695299};
__.block.coord = {.x=16, .y=96, .z=64};
__.local.shape = {.x=8, .y=4, .z=4};
__.param.b = {.x=0.000000, .y=0.000000, .z=0.000000, .t=7.853982};
__.block.elems = 20808;
__.local.coord = {.x=3, .y=3, .z=0};



__.local.rank = 66;
=======================
__.block.shape = {.x=18, .y=34, .z=34};
__.local.shape = {.x=8, .y=4, .z=4};
__.world.size = 128;
__.block.coord = {.x=48, .y=96, .z=0};
__.local.coord = {.x=4, .y=0, .z=2};
__.world.rank = 31;
__.block.elems = 20808;



__.block.shape = {.x=18, .y=34, .z=34};
__.nodes.shape = {.x=128, .y=128, .z=128, .t=20};
=======================
__.block.coord = {.x=64, .y=0, .z=64};
__.nodes.bound = {.x=1.000000, .y=1.000000, .z=1.000000, .t=0.010000};
__.world.size = 128;
__.block.elems = 20808;
__.nodes.steps = {.x=0.007812, .y=0.007812, .z=0.007812, .t=0.000500};
__.world.rank = 61;



=======================
__.param.period = {.x=1, .y=0, .z=0};
__.nodes.shape = {.x=128, .y=128, .z=128, .t=20};
__.world.size = 128;
__.param.a = {.x=6.283185, .y=3.141593, .z=3.141593, .t=7.695299};
__.nodes.bound = {.x=1.000000, .y=1.000000, .z=1.000000, .t=0.010000};
__.world.rank = 67;
__.param.b = {.x=0.000000, .y=0.000000, .z=0.000000, .t=7.853982};
__.nodes.steps = {.x=0.007812, .y=0.007812, .z=0.007812, .t=0.000500};



__.nodes.shape = {.x=128, .y=128, .z=128, .t=20};
__.local.rank = 31;
__.param.period = {.x=1, .y=0, .z=0};
__.nodes.bound = {.x=1.000000, .y=1.000000, .z=1.000000, .t=0.010000};
__.local.shape = {.x=8, .y=4, .z=4};
__.param.a = {.x=6.283185, .y=3.141593, .z=3.141593, .t=7.695299};
__.nodes.steps = {.x=0.007812, .y=0.007812, .z=0.007812, .t=0.000500};
__.local.coord = {.x=1, .y=3, .z=3};
__.param.b = {.x=0.000000, .y=0.000000, .z=0.000000, .t=7.853982};



__.param.period = {.x=1, .y=0, .z=0};
__.block.shape = {.x=18, .y=34, .z=34};
__.local.rank = 61;
__.param.a = {.x=6.283185, .y=3.141593, .z=3.141593, .t=7.695299};
__.block.coord = {.x=16, .y=96, .z=96};
__.local.shape = {.x=8, .y=4, .z=4};
__.param.b = {.x=0.000000, .y=0.000000, .z=0.000000, .t=7.853982};
__.block.elems = 20808;
__.local.coord = {.x=3, .y=3, .z=1};



__.local.rank = 67;
__.block.shape = {.x=18, .y=34, .z=34};
__.local.shape = {.x=8, .y=4, .z=4};
__.block.coord = {.x=48, .y=96, .z=32};
__.local.coord = {.x=4, .y=0, .z=3};
__.block.elems = 20808;


__.block.shape = {.x=18, .y=34, .z=34};
=======================
__.block.coord = {.x=64, .y=0, .z=96};
__.world.size = 128;
__.block.elems = 20808;
__.world.rank = 62;


=======================
__.nodes.shape = {.x=128, .y=128, .z=128, .t=20};
__.world.size = 128;
__.nodes.bound = {.x=1.000000, .y=1.000000, .z=1.000000, .t=0.010000};
__.world.rank = 68;
__.nodes.steps = {.x=0.007812, .y=0.007812, .z=0.007812, .t=0.000500};


__.nodes.shape = {.x=128, .y=128, .z=128, .t=20};
__.param.period = {.x=1, .y=0, .z=0};
__.nodes.bound = {.x=1.000000, .y=1.000000, .z=1.000000, .t=0.010000};
__.param.a = {.x=6.283185, .y=3.141593, .z=3.141593, .t=7.695299};
__.nodes.steps = {.x=0.007812, .y=0.007812, .z=0.007812, .t=0.000500};
__.param.b = {.x=0.000000, .y=0.000000, .z=0.000000, .t=7.853982};


__.param.period = {.x=1, .y=0, .z=0};
__.local.rank = 62;
__.param.a = {.x=6.283185, .y=3.141593, .z=3.141593, .t=7.695299};
__.local.shape = {.x=8, .y=4, .z=4};
__.param.b = {.x=0.000000, .y=0.000000, .z=0.000000, .t=7.853982};
__.local.coord = {.x=3, .y=3, .z=2};


__.local.rank = 68;
__.block.shape = {.x=18, .y=34, .z=34};
__.local.shape = {.x=8, .y=4, .z=4};
__.block.coord = {.x=48, .y=96, .z=64};
__.local.coord = {.x=4, .y=1, .z=0};
__.block.elems = 20808;


__.block.shape = {.x=18, .y=34, .z=34};
=======================
__.block.coord = {.x=64, .y=32, .z=0};
__.world.size = 128;
__.block.elems = 20808;
__.world.rank = 63;


=======================
__.nodes.shape = {.x=128, .y=128, .z=128, .t=20};
__.world.size = 128;
__.nodes.bound = {.x=1.000000, .y=1.000000, .z=1.000000, .t=0.010000};
__.world.rank = 69;
__.nodes.steps = {.x=0.007812, .y=0.007812, .z=0.007812, .t=0.000500};


__.nodes.shape = {.x=128, .y=128, .z=128, .t=20};
__.param.period = {.x=1, .y=0, .z=0};
__.nodes.bound = {.x=1.000000, .y=1.000000, .z=1.000000, .t=0.010000};
__.param.a = {.x=6.283185, .y=3.141593, .z=3.141593, .t=7.695299};
__.nodes.steps = {.x=0.007812, .y=0.007812, .z=0.007812, .t=0.000500};
__.param.b = {.x=0.000000, .y=0.000000, .z=0.000000, .t=7.853982};


__.param.period = {.x=1, .y=0, .z=0};
__.local.rank = 63;
__.param.a = {.x=6.283185, .y=3.141593, .z=3.141593, .t=7.695299};
__.local.shape = {.x=8, .y=4, .z=4};
__.param.b = {.x=0.000000, .y=0.000000, .z=0.000000, .t=7.853982};
__.local.coord = {.x=3, .y=3, .z=3};


__.local.rank = 69;
__.block.shape = {.x=18, .y=34, .z=34};
__.local.shape = {.x=8, .y=4, .z=4};
__.block.coord = {.x=48, .y=96, .z=96};
__.local.coord = {.x=4, .y=1, .z=1};
__.block.elems = 20808;


__.block.shape = {.x=18, .y=34, .z=34};
__.block.coord = {.x=64, .y=32, .z=32};
__.block.elems = 20808;

=======================
__.world.size = 128;
__.world.rank = 70;

__.nodes.shape = {.x=128, .y=128, .z=128, .t=20};
__.nodes.bound = {.x=1.000000, .y=1.000000, .z=1.000000, .t=0.010000};
__.nodes.steps = {.x=0.007812, .y=0.007812, .z=0.007812, .t=0.000500};

__.param.period = {.x=1, .y=0, .z=0};
__.param.a = {.x=6.283185, .y=3.141593, .z=3.141593, .t=7.695299};
__.param.b = {.x=0.000000, .y=0.000000, .z=0.000000, .t=7.853982};

__.local.rank = 70;
__.local.shape = {.x=8, .y=4, .z=4};
__.local.coord = {.x=4, .y=1, .z=2};

__.block.shape = {.x=18, .y=34, .z=34};
__.block.coord = {.x=64, .y=32, .z=64};
__.block.elems = 20808;

=======================
__.world.size = 128;
__.world.rank = 71;

__.nodes.shape = {.x=128, .y=128, .z=128, .t=20};
__.nodes.bound = {.x=1.000000, .y=1.000000, .z=1.000000, .t=0.010000};
__.nodes.steps = {.x=0.007812, .y=0.007812, .z=0.007812, .t=0.000500};

__.param.period = {.x=1, .y=0, .z=0};
__.param.a = {.x=6.283185, .y=3.141593, .z=3.141593, .t=7.695299};
__.param.b = {.x=0.000000, .y=0.000000, .z=0.000000, .t=7.853982};

__.local.rank = 71;
__.local.shape = {.x=8, .y=4, .z=4};
__.local.coord = {.x=4, .y=1, .z=3};

__.block.shape = {.x=18, .y=34, .z=34};
__.block.coord = {.x=64, .y=32, .z=96};
__.block.elems = 20808;

=======================
__.world.size = 128;
__.world.rank = 72;

__.nodes.shape = {.x=128, .y=128, .z=128, .t=20};
__.nodes.bound = {.x=1.000000, .y=1.000000, .z=1.000000, .t=0.010000};
__.nodes.steps = {.x=0.007812, .y=0.007812, .z=0.007812, .t=0.000500};

__.param.period = {.x=1, .y=0, .z=0};
__.param.a = {.x=6.283185, .y=3.141593, .z=3.141593, .t=7.695299};
__.param.b = {.x=0.000000, .y=0.000000, .z=0.000000, .t=7.853982};

__.local.rank = 72;
__.local.shape = {.x=8, .y=4, .z=4};
__.local.coord = {.x=4, .y=2, .z=0};

__.block.shape = {.x=18, .y=34, .z=34};
__.block.coord = {.x=64, .y=64, .z=0};
__.block.elems = 20808;

=======================
__.world.size = 128;
__.world.rank = 73;

__.nodes.shape = {.x=128, .y=128, .z=128, .t=20};
__.nodes.bound = {.x=1.000000, .y=1.000000, .z=1.000000, .t=0.010000};
__.nodes.steps = {.x=0.007812, .y=0.007812, .z=0.007812, .t=0.000500};

__.param.period = {.x=1, .y=0, .z=0};
__.param.a = {.x=6.283185, .y=3.141593, .z=3.141593, .t=7.695299};
__.param.b = {.x=0.000000, .y=0.000000, .z=0.000000, .t=7.853982};

__.local.rank = 73;
__.local.shape = {.x=8, .y=4, .z=4};
__.local.coord = {.x=4, .y=2, .z=1};

__.block.shape = {.x=18, .y=34, .z=34};
__.block.coord = {.x=64, .y=64, .z=32};
__.block.elems = 20808;

=======================
__.world.size = 128;
__.world.rank = 74;

__.nodes.shape = {.x=128, .y=128, .z=128, .t=20};
__.nodes.bound = {.x=1.000000, .y=1.000000, .z=1.000000, .t=0.010000};
__.nodes.steps = {.x=0.007812, .y=0.007812, .z=0.007812, .t=0.000500};

__.param.period = {.x=1, .y=0, .z=0};
__.param.a = {.x=6.283185, .y=3.141593, .z=3.141593, .t=7.695299};
__.param.b = {.x=0.000000, .y=0.000000, .z=0.000000, .t=7.853982};

__.local.rank = 74;
__.local.shape = {.x=8, .y=4, .z=4};
__.local.coord = {.x=4, .y=2, .z=2};

__.block.shape = {.x=18, .y=34, .z=34};
__.block.coord = {.x=64, .y=64, .z=64};
__.block.elems = 20808;

=======================
__.world.size = 128;
__.world.rank = 75;

__.nodes.shape = {.x=128, .y=128, .z=128, .t=20};
__.nodes.bound = {.x=1.000000, .y=1.000000, .z=1.000000, .t=0.010000};
__.nodes.steps = {.x=0.007812, .y=0.007812, .z=0.007812, .t=0.000500};

__.param.period = {.x=1, .y=0, .z=0};
__.param.a = {.x=6.283185, .y=3.141593, .z=3.141593, .t=7.695299};
__.param.b = {.x=0.000000, .y=0.000000, .z=0.000000, .t=7.853982};

__.local.rank = 75;
__.local.shape = {.x=8, .y=4, .z=4};
__.local.coord = {.x=4, .y=2, .z=3};

__.block.shape = {.x=18, .y=34, .z=34};
__.block.coord = {.x=64, .y=64, .z=96};
__.block.elems = 20808;

=======================
__.world.size = 128;
__.world.rank = 76;

__.nodes.shape = {.x=128, .y=128, .z=128, .t=20};
__.nodes.bound = {.x=1.000000, .y=1.000000, .z=1.000000, .t=0.010000};
__.nodes.steps = {.x=0.007812, .y=0.007812, .z=0.007812, .t=0.000500};

__.param.period = {.x=1, .y=0, .z=0};
__.param.a = {.x=6.283185, .y=3.141593, .z=3.141593, .t=7.695299};
__.param.b = {.x=0.000000, .y=0.000000, .z=0.000000, .t=7.853982};

__.local.rank = 76;
__.local.shape = {.x=8, .y=4, .z=4};
__.local.coord = {.x=4, .y=3, .z=0};

__.block.shape = {.x=18, .y=34, .z=34};
__.block.coord = {.x=64, .y=96, .z=0};
__.block.elems = 20808;

=======================
__.world.size = 128;
__.world.rank = 77;

__.nodes.shape = {.x=128, .y=128, .z=128, .t=20};
__.nodes.bound = {.x=1.000000, .y=1.000000, .z=1.000000, .t=0.010000};
__.nodes.steps = {.x=0.007812, .y=0.007812, .z=0.007812, .t=0.000500};

__.param.period = {.x=1, .y=0, .z=0};
__.param.a = {.x=6.283185, .y=3.141593, .z=3.141593, .t=7.695299};
__.param.b = {.x=0.000000, .y=0.000000, .z=0.000000, .t=7.853982};

__.local.rank = 77;
__.local.shape = {.x=8, .y=4, .z=4};
__.local.coord = {.x=4, .y=3, .z=1};

__.block.shape = {.x=18, .y=34, .z=34};
__.block.coord = {.x=64, .y=96, .z=32};
__.block.elems = 20808;

=======================
__.world.size = 128;
__.world.rank = 78;

__.nodes.shape = {.x=128, .y=128, .z=128, .t=20};
__.nodes.bound = {.x=1.000000, .y=1.000000, .z=1.000000, .t=0.010000};
__.nodes.steps = {.x=0.007812, .y=0.007812, .z=0.007812, .t=0.000500};

__.param.period = {.x=1, .y=0, .z=0};
__.param.a = {.x=6.283185, .y=3.141593, .z=3.141593, .t=7.695299};
__.param.b = {.x=0.000000, .y=0.000000, .z=0.000000, .t=7.853982};

__.local.rank = 78;
__.local.shape = {.x=8, .y=4, .z=4};
__.local.coord = {.x=4, .y=3, .z=2};

__.block.shape = {.x=18, .y=34, .z=34};
__.block.coord = {.x=64, .y=96, .z=64};
__.block.elems = 20808;

=======================
__.world.size = 128;
__.world.rank = 79;

__.nodes.shape = {.x=128, .y=128, .z=128, .t=20};
__.nodes.bound = {.x=1.000000, .y=1.000000, .z=1.000000, .t=0.010000};
__.nodes.steps = {.x=0.007812, .y=0.007812, .z=0.007812, .t=0.000500};

__.param.period = {.x=1, .y=0, .z=0};
__.param.a = {.x=6.283185, .y=3.141593, .z=3.141593, .t=7.695299};
__.param.b = {.x=0.000000, .y=0.000000, .z=0.000000, .t=7.853982};

__.local.rank = 79;
__.local.shape = {.x=8, .y=4, .z=4};
__.local.coord = {.x=4, .y=3, .z=3};

__.block.shape = {.x=18, .y=34, .z=34};
__.block.coord = {.x=64, .y=96, .z=96};
__.block.elems = 20808;

=======================
__.world.size = 128;
__.world.rank = 80;

__.nodes.shape = {.x=128, .y=128, .z=128, .t=20};
__.nodes.bound = {.x=1.000000, .y=1.000000, .z=1.000000, .t=0.010000};
__.nodes.steps = {.x=0.007812, .y=0.007812, .z=0.007812, .t=0.000500};

__.param.period = {.x=1, .y=0, .z=0};
__.param.a = {.x=6.283185, .y=3.141593, .z=3.141593, .t=7.695299};
__.param.b = {.x=0.000000, .y=0.000000, .z=0.000000, .t=7.853982};

__.local.rank = 80;
__.local.shape = {.x=8, .y=4, .z=4};
__.local.coord = {.x=5, .y=0, .z=0};

__.block.shape = {.x=18, .y=34, .z=34};
__.block.coord = {.x=80, .y=0, .z=0};
__.block.elems = 20808;

=======================
__.world.size = 128;
__.world.rank = 81;

__.nodes.shape = {.x=128, .y=128, .z=128, .t=20};
__.nodes.bound = {.x=1.000000, .y=1.000000, .z=1.000000, .t=0.010000};
__.nodes.steps = {.x=0.007812, .y=0.007812, .z=0.007812, .t=0.000500};

__.param.period = {.x=1, .y=0, .z=0};
=======================
__.param.a = {.x=6.283185, .y=3.141593, .z=3.141593, .t=7.695299};
__.param.b = {.x=0.000000, .y=0.000000, .z=0.000000, .t=7.853982};

__.world.size = 128;
__.local.rank = 81;
__.world.rank = 96;
__.local.shape = {.x=8, .y=4, .z=4};

__.local.coord = {.x=5, .y=0, .z=1};
__.nodes.shape = {.x=128, .y=128, .z=128, .t=20};

__.nodes.bound = {.x=1.000000, .y=1.000000, .z=1.000000, .t=0.010000};
__.block.shape = {.x=18, .y=34, .z=34};
__.nodes.steps = {.x=0.007812, .y=0.007812, .z=0.007812, .t=0.000500};
__.block.coord = {.x=80, .y=0, .z=32};

__.block.elems = 20808;
__.param.period = {.x=1, .y=0, .z=0};

__.param.a = {.x=6.283185, .y=3.141593, .z=3.141593, .t=7.695299};
=======================
__.param.b = {.x=0.000000, .y=0.000000, .z=0.000000, .t=7.853982};
__.world.size = 128;

__.world.rank = 82;
__.local.rank = 96;

__.local.shape = {.x=8, .y=4, .z=4};
__.nodes.shape = {.x=128, .y=128, .z=128, .t=20};
__.local.coord = {.x=6, .y=0, .z=0};
__.nodes.bound = {.x=1.000000, .y=1.000000, .z=1.000000, .t=0.010000};
__.nodes.steps = {.x=0.007812, .y=0.007812, .z=0.007812, .t=0.000500};


__.block.shape = {.x=18, .y=34, .z=34};
__.param.period = {.x=1, .y=0, .z=0};
__.block.coord = {.x=96, .y=0, .z=0};
__.param.a = {.x=6.283185, .y=3.141593, .z=3.141593, .t=7.695299};
__.block.elems = 20808;
__.param.b = {.x=0.000000, .y=0.000000, .z=0.000000, .t=7.853982};


=======================
__.local.rank = 82;
__.world.size = 128;
__.local.shape = {.x=8, .y=4, .z=4};
__.local.coord = {.x=5, .y=0, .z=2};
__.world.rank = 97;


__.block.shape = {.x=18, .y=34, .z=34};
__.nodes.shape = {.x=128, .y=128, .z=128, .t=20};
__.block.coord = {.x=80, .y=0, .z=64};
__.nodes.bound = {.x=1.000000, .y=1.000000, .z=1.000000, .t=0.010000};
__.block.elems = 20808;
__.nodes.steps = {.x=0.007812, .y=0.007812, .z=0.007812, .t=0.000500};


=======================
__.param.period = {.x=1, .y=0, .z=0};
__.world.size = 128;
__.param.a = {.x=6.283185, .y=3.141593, .z=3.141593, .t=7.695299};
__.world.rank = 83;
__.param.b = {.x=0.000000, .y=0.000000, .z=0.000000, .t=7.853982};


__.nodes.shape = {.x=128, .y=128, .z=128, .t=20};
__.local.rank = 97;
__.nodes.bound = {.x=1.000000, .y=1.000000, .z=1.000000, .t=0.010000};
__.nodes.steps = {.x=0.007812, .y=0.007812, .z=0.007812, .t=0.000500};
__.local.shape = {.x=8, .y=4, .z=4};

__.local.coord = {.x=6, .y=0, .z=1};
__.param.period = {.x=1, .y=0, .z=0};

__.param.a = {.x=6.283185, .y=3.141593, .z=3.141593, .t=7.695299};
__.block.shape = {.x=18, .y=34, .z=34};
__.param.b = {.x=0.000000, .y=0.000000, .z=0.000000, .t=7.853982};
__.block.coord = {.x=96, .y=0, .z=32};

__.block.elems = 20808;
__.local.rank = 83;

__.local.shape = {.x=8, .y=4, .z=4};
=======================
__.local.coord = {.x=5, .y=0, .z=3};
__.world.size = 128;

__.world.rank = 98;
__.block.shape = {.x=18, .y=34, .z=34};

__.block.coord = {.x=80, .y=0, .z=96};
__.nodes.shape = {.x=128, .y=128, .z=128, .t=20};
__.block.elems = 20808;
__.nodes.bound = {.x=1.000000, .y=1.000000, .z=1.000000, .t=0.010000};

__.nodes.steps = {.x=0.007812, .y=0.007812, .z=0.007812, .t=0.000500};
=======================

__.world.size = 128;
__.param.period = {.x=1, .y=0, .z=0};
__.world.rank = 84;
__.param.a = {.x=6.283185, .y=3.141593, .z=3.141593, .t=7.695299};

__.param.b = {.x=0.000000, .y=0.000000, .z=0.000000, .t=7.853982};
__.nodes.shape = {.x=128, .y=128, .z=128, .t=20};

__.nodes.bound = {.x=1.000000, .y=1.000000, .z=1.000000, .t=0.010000};
__.local.rank = 98;
__.nodes.steps = {.x=0.007812, .y=0.007812, .z=0.007812, .t=0.000500};
__.local.shape = {.x=8, .y=4, .z=4};

__.local.coord = {.x=6, .y=0, .z=2};
__.param.period = {.x=1, .y=0, .z=0};

__.param.a = {.x=6.283185, .y=3.141593, .z=3.141593, .t=7.695299};
__.block.shape = {.x=18, .y=34, .z=34};
__.param.b = {.x=0.000000, .y=0.000000, .z=0.000000, .t=7.853982};
__.block.coord = {.x=96, .y=0, .z=64};

__.block.elems = 20808;
__.local.rank = 84;

__.local.shape = {.x=8, .y=4, .z=4};
=======================
__.local.coord = {.x=5, .y=1, .z=0};
__.world.size = 128;

__.world.rank = 99;
__.block.shape = {.x=18, .y=34, .z=34};

__.block.coord = {.x=80, .y=32, .z=0};
__.nodes.shape = {.x=128, .y=128, .z=128, .t=20};
__.block.elems = 20808;
__.nodes.bound = {.x=1.000000, .y=1.000000, .z=1.000000, .t=0.010000};

__.nodes.steps = {.x=0.007812, .y=0.007812, .z=0.007812, .t=0.000500};
=======================
__.world.size = 128;

__.world.rank = 85;
__.param.period = {.x=1, .y=0, .z=0};

__.param.a = {.x=6.283185, .y=3.141593, .z=3.141593, .t=7.695299};
__.nodes.shape = {.x=128, .y=128, .z=128, .t=20};
__.param.b = {.x=0.000000, .y=0.000000, .z=0.000000, .t=7.853982};
__.nodes.bound = {.x=1.000000, .y=1.000000, .z=1.000000, .t=0.010000};

__.nodes.steps = {.x=0.007812, .y=0.007812, .z=0.007812, .t=0.000500};
__.local.rank = 99;

__.local.shape = {.x=8, .y=4, .z=4};
__.param.period = {.x=1, .y=0, .z=0};
__.local.coord = {.x=6, .y=0, .z=3};
__.param.a = {.x=6.283185, .y=3.141593, .z=3.141593, .t=7.695299};

__.param.b = {.x=0.000000, .y=0.000000, .z=0.000000, .t=7.853982};
__.block.shape = {.x=18, .y=34, .z=34};

__.block.coord = {.x=96, .y=0, .z=96};
__.local.rank = 85;
__.block.elems = 20808;
__.local.shape = {.x=8, .y=4, .z=4};

__.local.coord = {.x=5, .y=1, .z=1};
=======================

__.world.size = 128;
__.block.shape = {.x=18, .y=34, .z=34};
__.world.rank = 100;
__.block.coord = {.x=80, .y=32, .z=32};

__.block.elems = 20808;
__.nodes.shape = {.x=128, .y=128, .z=128, .t=20};

__.nodes.bound = {.x=1.000000, .y=1.000000, .z=1.000000, .t=0.010000};
=======================
__.nodes.steps = {.x=0.007812, .y=0.007812, .z=0.007812, .t=0.000500};
__.world.size = 128;

__.world.rank = 86;
__.param.period = {.x=1, .y=0, .z=0};

__.param.a = {.x=6.283185, .y=3.141593, .z=3.141593, .t=7.695299};
__.nodes.shape = {.x=128, .y=128, .z=128, .t=20};
__.param.b = {.x=0.000000, .y=0.000000, .z=0.000000, .t=7.853982};
__.nodes.bound = {.x=1.000000, .y=1.000000, .z=1.000000, .t=0.010000};

__.nodes.steps = {.x=0.007812, .y=0.007812, .z=0.007812, .t=0.000500};
__.local.rank = 100;

__.local.shape = {.x=8, .y=4, .z=4};
__.param.period = {.x=1, .y=0, .z=0};
__.param.a = {.x=6.283185, .y=3.141593, .z=3.141593, .t=7.695299};
__.local.coord = {.x=6, .y=1, .z=0};
__.param.b = {.x=0.000000, .y=0.000000, .z=0.000000, .t=7.853982};


__.block.shape = {.x=18, .y=34, .z=34};
__.local.rank = 86;
__.block.coord = {.x=96, .y=32, .z=0};
__.local.shape = {.x=8, .y=4, .z=4};
__.block.elems = 20808;
__.local.coord = {.x=5, .y=1, .z=2};


=======================
__.block.shape = {.x=18, .y=34, .z=34};
__.world.size = 128;
__.block.coord = {.x=80, .y=32, .z=64};
__.world.rank = 101;
__.block.elems = 20808;


__.nodes.shape = {.x=128, .y=128, .z=128, .t=20};
=======================
__.nodes.bound = {.x=1.000000, .y=1.000000, .z=1.000000, .t=0.010000};
__.world.size = 128;
__.nodes.steps = {.x=0.007812, .y=0.007812, .z=0.007812, .t=0.000500};
__.world.rank = 87;


__.param.period = {.x=1, .y=0, .z=0};
__.nodes.shape = {.x=128, .y=128, .z=128, .t=20};
__.param.a = {.x=6.283185, .y=3.141593, .z=3.141593, .t=7.695299};
__.nodes.bound = {.x=1.000000, .y=1.000000, .z=1.000000, .t=0.010000};
__.param.b = {.x=0.000000, .y=0.000000, .z=0.000000, .t=7.853982};
__.nodes.steps = {.x=0.007812, .y=0.007812, .z=0.007812, .t=0.000500};


__.local.rank = 101;
__.param.period = {.x=1, .y=0, .z=0};
__.local.shape = {.x=8, .y=4, .z=4};
__.param.a = {.x=6.283185, .y=3.141593, .z=3.141593, .t=7.695299};
__.local.coord = {.x=6, .y=1, .z=1};
__.param.b = {.x=0.000000, .y=0.000000, .z=0.000000, .t=7.853982};


__.block.shape = {.x=18, .y=34, .z=34};
__.local.rank = 87;
__.block.coord = {.x=96, .y=32, .z=32};
__.local.shape = {.x=8, .y=4, .z=4};
__.block.elems = 20808;
__.local.coord = {.x=5, .y=1, .z=3};


=======================
__.block.shape = {.x=18, .y=34, .z=34};
__.world.size = 128;
__.block.coord = {.x=80, .y=32, .z=96};
__.world.rank = 102;
__.block.elems = 20808;


__.nodes.shape = {.x=128, .y=128, .z=128, .t=20};
=======================
__.nodes.bound = {.x=1.000000, .y=1.000000, .z=1.000000, .t=0.010000};
__.world.size = 128;
__.nodes.steps = {.x=0.007812, .y=0.007812, .z=0.007812, .t=0.000500};
__.world.rank = 88;


__.param.period = {.x=1, .y=0, .z=0};
__.nodes.shape = {.x=128, .y=128, .z=128, .t=20};
__.param.a = {.x=6.283185, .y=3.141593, .z=3.141593, .t=7.695299};
__.nodes.bound = {.x=1.000000, .y=1.000000, .z=1.000000, .t=0.010000};
__.param.b = {.x=0.000000, .y=0.000000, .z=0.000000, .t=7.853982};
__.nodes.steps = {.x=0.007812, .y=0.007812, .z=0.007812, .t=0.000500};


__.local.rank = 102;
__.param.period = {.x=1, .y=0, .z=0};
__.local.shape = {.x=8, .y=4, .z=4};
__.param.a = {.x=6.283185, .y=3.141593, .z=3.141593, .t=7.695299};
__.local.coord = {.x=6, .y=1, .z=2};
__.param.b = {.x=0.000000, .y=0.000000, .z=0.000000, .t=7.853982};


__.block.shape = {.x=18, .y=34, .z=34};
__.local.rank = 88;
__.block.coord = {.x=96, .y=32, .z=64};
__.local.shape = {.x=8, .y=4, .z=4};
__.block.elems = 20808;
__.local.coord = {.x=5, .y=2, .z=0};


=======================
__.block.shape = {.x=18, .y=34, .z=34};
__.world.size = 128;
__.block.coord = {.x=80, .y=64, .z=0};
__.world.rank = 103;
__.block.elems = 20808;


__.nodes.shape = {.x=128, .y=128, .z=128, .t=20};
=======================
__.nodes.bound = {.x=1.000000, .y=1.000000, .z=1.000000, .t=0.010000};
__.world.size = 128;
__.nodes.steps = {.x=0.007812, .y=0.007812, .z=0.007812, .t=0.000500};
__.world.rank = 89;


__.param.period = {.x=1, .y=0, .z=0};
__.nodes.shape = {.x=128, .y=128, .z=128, .t=20};
__.param.a = {.x=6.283185, .y=3.141593, .z=3.141593, .t=7.695299};
__.nodes.bound = {.x=1.000000, .y=1.000000, .z=1.000000, .t=0.010000};
__.param.b = {.x=0.000000, .y=0.000000, .z=0.000000, .t=7.853982};
__.nodes.steps = {.x=0.007812, .y=0.007812, .z=0.007812, .t=0.000500};


__.local.rank = 103;
__.param.period = {.x=1, .y=0, .z=0};
__.local.shape = {.x=8, .y=4, .z=4};
__.param.a = {.x=6.283185, .y=3.141593, .z=3.141593, .t=7.695299};
__.local.coord = {.x=6, .y=1, .z=3};
__.param.b = {.x=0.000000, .y=0.000000, .z=0.000000, .t=7.853982};


__.block.shape = {.x=18, .y=34, .z=34};
__.local.rank = 89;
__.block.coord = {.x=96, .y=32, .z=96};
__.local.shape = {.x=8, .y=4, .z=4};
__.block.elems = 20808;
__.local.coord = {.x=5, .y=2, .z=1};


=======================
__.block.shape = {.x=18, .y=34, .z=34};
__.world.size = 128;
__.block.coord = {.x=80, .y=64, .z=32};
__.world.rank = 104;
__.block.elems = 20808;


__.nodes.shape = {.x=128, .y=128, .z=128, .t=20};
=======================
__.nodes.bound = {.x=1.000000, .y=1.000000, .z=1.000000, .t=0.010000};
__.world.size = 128;
__.nodes.steps = {.x=0.007812, .y=0.007812, .z=0.007812, .t=0.000500};
__.world.rank = 90;


__.param.period = {.x=1, .y=0, .z=0};
__.nodes.shape = {.x=128, .y=128, .z=128, .t=20};
__.param.a = {.x=6.283185, .y=3.141593, .z=3.141593, .t=7.695299};
__.nodes.bound = {.x=1.000000, .y=1.000000, .z=1.000000, .t=0.010000};
__.param.b = {.x=0.000000, .y=0.000000, .z=0.000000, .t=7.853982};
__.nodes.steps = {.x=0.007812, .y=0.007812, .z=0.007812, .t=0.000500};


__.local.rank = 104;
__.param.period = {.x=1, .y=0, .z=0};
__.local.shape = {.x=8, .y=4, .z=4};
__.param.a = {.x=6.283185, .y=3.141593, .z=3.141593, .t=7.695299};
__.local.coord = {.x=6, .y=2, .z=0};
__.param.b = {.x=0.000000, .y=0.000000, .z=0.000000, .t=7.853982};


__.block.shape = {.x=18, .y=34, .z=34};
__.local.rank = 90;
__.block.coord = {.x=96, .y=64, .z=0};
__.local.shape = {.x=8, .y=4, .z=4};
__.block.elems = 20808;
__.local.coord = {.x=5, .y=2, .z=2};


=======================
__.block.shape = {.x=18, .y=34, .z=34};
__.world.size = 128;
__.block.coord = {.x=80, .y=64, .z=64};
__.world.rank = 105;
__.block.elems = 20808;


__.nodes.shape = {.x=128, .y=128, .z=128, .t=20};
=======================
__.nodes.bound = {.x=1.000000, .y=1.000000, .z=1.000000, .t=0.010000};
__.world.size = 128;
__.nodes.steps = {.x=0.007812, .y=0.007812, .z=0.007812, .t=0.000500};
__.world.rank = 91;


__.param.period = {.x=1, .y=0, .z=0};
__.nodes.shape = {.x=128, .y=128, .z=128, .t=20};
__.param.a = {.x=6.283185, .y=3.141593, .z=3.141593, .t=7.695299};
__.nodes.bound = {.x=1.000000, .y=1.000000, .z=1.000000, .t=0.010000};
__.param.b = {.x=0.000000, .y=0.000000, .z=0.000000, .t=7.853982};
__.nodes.steps = {.x=0.007812, .y=0.007812, .z=0.007812, .t=0.000500};


__.local.rank = 105;
__.param.period = {.x=1, .y=0, .z=0};
__.local.shape = {.x=8, .y=4, .z=4};
__.param.a = {.x=6.283185, .y=3.141593, .z=3.141593, .t=7.695299};
__.local.coord = {.x=6, .y=2, .z=1};
__.param.b = {.x=0.000000, .y=0.000000, .z=0.000000, .t=7.853982};


__.block.shape = {.x=18, .y=34, .z=34};
__.local.rank = 91;
__.block.coord = {.x=96, .y=64, .z=32};
__.local.shape = {.x=8, .y=4, .z=4};
__.block.elems = 20808;
__.local.coord = {.x=5, .y=2, .z=3};


=======================
__.block.shape = {.x=18, .y=34, .z=34};
__.world.size = 128;
__.block.coord = {.x=80, .y=64, .z=96};
__.world.rank = 106;
__.block.elems = 20808;


__.nodes.shape = {.x=128, .y=128, .z=128, .t=20};
=======================
__.nodes.bound = {.x=1.000000, .y=1.000000, .z=1.000000, .t=0.010000};
__.world.size = 128;
__.nodes.steps = {.x=0.007812, .y=0.007812, .z=0.007812, .t=0.000500};
__.world.rank = 92;


__.param.period = {.x=1, .y=0, .z=0};
__.nodes.shape = {.x=128, .y=128, .z=128, .t=20};
__.param.a = {.x=6.283185, .y=3.141593, .z=3.141593, .t=7.695299};
__.nodes.bound = {.x=1.000000, .y=1.000000, .z=1.000000, .t=0.010000};
__.param.b = {.x=0.000000, .y=0.000000, .z=0.000000, .t=7.853982};
__.nodes.steps = {.x=0.007812, .y=0.007812, .z=0.007812, .t=0.000500};


__.local.rank = 106;
__.param.period = {.x=1, .y=0, .z=0};
__.local.shape = {.x=8, .y=4, .z=4};
__.param.a = {.x=6.283185, .y=3.141593, .z=3.141593, .t=7.695299};
__.local.coord = {.x=6, .y=2, .z=2};
__.param.b = {.x=0.000000, .y=0.000000, .z=0.000000, .t=7.853982};


__.block.shape = {.x=18, .y=34, .z=34};
__.local.rank = 92;
__.block.coord = {.x=96, .y=64, .z=64};
__.local.shape = {.x=8, .y=4, .z=4};
__.block.elems = 20808;
__.local.coord = {.x=5, .y=3, .z=0};


=======================
__.block.shape = {.x=18, .y=34, .z=34};
__.world.size = 128;
__.block.coord = {.x=80, .y=96, .z=0};
__.world.rank = 107;
__.block.elems = 20808;


__.nodes.shape = {.x=128, .y=128, .z=128, .t=20};
=======================
__.nodes.bound = {.x=1.000000, .y=1.000000, .z=1.000000, .t=0.010000};
__.world.size = 128;
__.nodes.steps = {.x=0.007812, .y=0.007812, .z=0.007812, .t=0.000500};
__.world.rank = 93;


__.param.period = {.x=1, .y=0, .z=0};
__.nodes.shape = {.x=128, .y=128, .z=128, .t=20};
__.param.a = {.x=6.283185, .y=3.141593, .z=3.141593, .t=7.695299};
__.nodes.bound = {.x=1.000000, .y=1.000000, .z=1.000000, .t=0.010000};
__.param.b = {.x=0.000000, .y=0.000000, .z=0.000000, .t=7.853982};
__.nodes.steps = {.x=0.007812, .y=0.007812, .z=0.007812, .t=0.000500};


__.local.rank = 107;
__.param.period = {.x=1, .y=0, .z=0};
__.local.shape = {.x=8, .y=4, .z=4};
__.param.a = {.x=6.283185, .y=3.141593, .z=3.141593, .t=7.695299};
__.local.coord = {.x=6, .y=2, .z=3};
__.param.b = {.x=0.000000, .y=0.000000, .z=0.000000, .t=7.853982};


__.block.shape = {.x=18, .y=34, .z=34};
__.local.rank = 93;
__.block.coord = {.x=96, .y=64, .z=96};
__.local.shape = {.x=8, .y=4, .z=4};
__.block.elems = 20808;
__.local.coord = {.x=5, .y=3, .z=1};


=======================
__.block.shape = {.x=18, .y=34, .z=34};
__.world.size = 128;
__.block.coord = {.x=80, .y=96, .z=32};
__.world.rank = 108;
__.block.elems = 20808;


__.nodes.shape = {.x=128, .y=128, .z=128, .t=20};
=======================
__.nodes.bound = {.x=1.000000, .y=1.000000, .z=1.000000, .t=0.010000};
__.world.size = 128;
__.nodes.steps = {.x=0.007812, .y=0.007812, .z=0.007812, .t=0.000500};
__.world.rank = 94;


__.param.period = {.x=1, .y=0, .z=0};
__.nodes.shape = {.x=128, .y=128, .z=128, .t=20};
__.param.a = {.x=6.283185, .y=3.141593, .z=3.141593, .t=7.695299};
__.nodes.bound = {.x=1.000000, .y=1.000000, .z=1.000000, .t=0.010000};
__.param.b = {.x=0.000000, .y=0.000000, .z=0.000000, .t=7.853982};
__.nodes.steps = {.x=0.007812, .y=0.007812, .z=0.007812, .t=0.000500};


__.local.rank = 108;
__.param.period = {.x=1, .y=0, .z=0};
__.local.shape = {.x=8, .y=4, .z=4};
__.param.a = {.x=6.283185, .y=3.141593, .z=3.141593, .t=7.695299};
__.local.coord = {.x=6, .y=3, .z=0};
__.param.b = {.x=0.000000, .y=0.000000, .z=0.000000, .t=7.853982};


__.block.shape = {.x=18, .y=34, .z=34};
__.local.rank = 94;
__.block.coord = {.x=96, .y=96, .z=0};
__.local.shape = {.x=8, .y=4, .z=4};
__.block.elems = 20808;
__.local.coord = {.x=5, .y=3, .z=2};


=======================
__.block.shape = {.x=18, .y=34, .z=34};
__.world.size = 128;
__.block.coord = {.x=80, .y=96, .z=64};
__.world.rank = 109;
__.block.elems = 20808;


__.nodes.shape = {.x=128, .y=128, .z=128, .t=20};
=======================
__.nodes.bound = {.x=1.000000, .y=1.000000, .z=1.000000, .t=0.010000};
__.world.size = 128;
__.nodes.steps = {.x=0.007812, .y=0.007812, .z=0.007812, .t=0.000500};
__.world.rank = 95;


__.param.period = {.x=1, .y=0, .z=0};
__.nodes.shape = {.x=128, .y=128, .z=128, .t=20};
__.param.a = {.x=6.283185, .y=3.141593, .z=3.141593, .t=7.695299};
__.nodes.bound = {.x=1.000000, .y=1.000000, .z=1.000000, .t=0.010000};
__.param.b = {.x=0.000000, .y=0.000000, .z=0.000000, .t=7.853982};
__.nodes.steps = {.x=0.007812, .y=0.007812, .z=0.007812, .t=0.000500};


__.local.rank = 109;
__.param.period = {.x=1, .y=0, .z=0};
__.local.shape = {.x=8, .y=4, .z=4};
__.param.a = {.x=6.283185, .y=3.141593, .z=3.141593, .t=7.695299};
__.local.coord = {.x=6, .y=3, .z=1};
__.param.b = {.x=0.000000, .y=0.000000, .z=0.000000, .t=7.853982};


__.block.shape = {.x=18, .y=34, .z=34};
__.local.rank = 95;
__.block.coord = {.x=96, .y=96, .z=32};
__.local.shape = {.x=8, .y=4, .z=4};
__.block.elems = 20808;
__.local.coord = {.x=5, .y=3, .z=3};


=======================
__.block.shape = {.x=18, .y=34, .z=34};
__.world.size = 128;
__.block.coord = {.x=80, .y=96, .z=96};
__.world.rank = 110;
__.block.elems = 20808;


__.nodes.shape = {.x=128, .y=128, .z=128, .t=20};
__.nodes.bound = {.x=1.000000, .y=1.000000, .z=1.000000, .t=0.010000};
__.nodes.steps = {.x=0.007812, .y=0.007812, .z=0.007812, .t=0.000500};

__.param.period = {.x=1, .y=0, .z=0};
__.param.a = {.x=6.283185, .y=3.141593, .z=3.141593, .t=7.695299};
__.param.b = {.x=0.000000, .y=0.000000, .z=0.000000, .t=7.853982};

__.local.rank = 110;
__.local.shape = {.x=8, .y=4, .z=4};
__.local.coord = {.x=6, .y=3, .z=2};

__.block.shape = {.x=18, .y=34, .z=34};
__.block.coord = {.x=96, .y=96, .z=64};
__.block.elems = 20808;

=======================
__.world.size = 128;
__.world.rank = 111;

__.nodes.shape = {.x=128, .y=128, .z=128, .t=20};
__.nodes.bound = {.x=1.000000, .y=1.000000, .z=1.000000, .t=0.010000};
__.nodes.steps = {.x=0.007812, .y=0.007812, .z=0.007812, .t=0.000500};

__.param.period = {.x=1, .y=0, .z=0};
__.param.a = {.x=6.283185, .y=3.141593, .z=3.141593, .t=7.695299};
__.param.b = {.x=0.000000, .y=0.000000, .z=0.000000, .t=7.853982};

__.local.rank = 111;
__.local.shape = {.x=8, .y=4, .z=4};
__.local.coord = {.x=6, .y=3, .z=3};

__.block.shape = {.x=18, .y=34, .z=34};
__.block.coord = {.x=96, .y=96, .z=96};
__.block.elems = 20808;

=======================
__.world.size = 128;
__.world.rank = 112;

__.nodes.shape = {.x=128, .y=128, .z=128, .t=20};
__.nodes.bound = {.x=1.000000, .y=1.000000, .z=1.000000, .t=0.010000};
__.nodes.steps = {.x=0.007812, .y=0.007812, .z=0.007812, .t=0.000500};

__.param.period = {.x=1, .y=0, .z=0};
__.param.a = {.x=6.283185, .y=3.141593, .z=3.141593, .t=7.695299};
__.param.b = {.x=0.000000, .y=0.000000, .z=0.000000, .t=7.853982};

__.local.rank = 112;
__.local.shape = {.x=8, .y=4, .z=4};
__.local.coord = {.x=7, .y=0, .z=0};

__.block.shape = {.x=18, .y=34, .z=34};
__.block.coord = {.x=112, .y=0, .z=0};
__.block.elems = 20808;

=======================
__.world.size = 128;
__.world.rank = 113;

__.nodes.shape = {.x=128, .y=128, .z=128, .t=20};
__.nodes.bound = {.x=1.000000, .y=1.000000, .z=1.000000, .t=0.010000};
__.nodes.steps = {.x=0.007812, .y=0.007812, .z=0.007812, .t=0.000500};

__.param.period = {.x=1, .y=0, .z=0};
__.param.a = {.x=6.283185, .y=3.141593, .z=3.141593, .t=7.695299};
__.param.b = {.x=0.000000, .y=0.000000, .z=0.000000, .t=7.853982};

__.local.rank = 113;
__.local.shape = {.x=8, .y=4, .z=4};
__.local.coord = {.x=7, .y=0, .z=1};

__.block.shape = {.x=18, .y=34, .z=34};
__.block.coord = {.x=112, .y=0, .z=32};
__.block.elems = 20808;

=======================
__.world.size = 128;
__.world.rank = 114;

__.nodes.shape = {.x=128, .y=128, .z=128, .t=20};
__.nodes.bound = {.x=1.000000, .y=1.000000, .z=1.000000, .t=0.010000};
__.nodes.steps = {.x=0.007812, .y=0.007812, .z=0.007812, .t=0.000500};

__.param.period = {.x=1, .y=0, .z=0};
__.param.a = {.x=6.283185, .y=3.141593, .z=3.141593, .t=7.695299};
__.param.b = {.x=0.000000, .y=0.000000, .z=0.000000, .t=7.853982};

__.local.rank = 114;
__.local.shape = {.x=8, .y=4, .z=4};
__.local.coord = {.x=7, .y=0, .z=2};

__.block.shape = {.x=18, .y=34, .z=34};
__.block.coord = {.x=112, .y=0, .z=64};
__.block.elems = 20808;

=======================
__.world.size = 128;
__.world.rank = 115;

__.nodes.shape = {.x=128, .y=128, .z=128, .t=20};
__.nodes.bound = {.x=1.000000, .y=1.000000, .z=1.000000, .t=0.010000};
__.nodes.steps = {.x=0.007812, .y=0.007812, .z=0.007812, .t=0.000500};

__.param.period = {.x=1, .y=0, .z=0};
__.param.a = {.x=6.283185, .y=3.141593, .z=3.141593, .t=7.695299};
__.param.b = {.x=0.000000, .y=0.000000, .z=0.000000, .t=7.853982};

__.local.rank = 115;
__.local.shape = {.x=8, .y=4, .z=4};
__.local.coord = {.x=7, .y=0, .z=3};

__.block.shape = {.x=18, .y=34, .z=34};
__.block.coord = {.x=112, .y=0, .z=96};
__.block.elems = 20808;

=======================
__.world.size = 128;
__.world.rank = 116;

__.nodes.shape = {.x=128, .y=128, .z=128, .t=20};
__.nodes.bound = {.x=1.000000, .y=1.000000, .z=1.000000, .t=0.010000};
__.nodes.steps = {.x=0.007812, .y=0.007812, .z=0.007812, .t=0.000500};

__.param.period = {.x=1, .y=0, .z=0};
__.param.a = {.x=6.283185, .y=3.141593, .z=3.141593, .t=7.695299};
__.param.b = {.x=0.000000, .y=0.000000, .z=0.000000, .t=7.853982};

__.local.rank = 116;
__.local.shape = {.x=8, .y=4, .z=4};
__.local.coord = {.x=7, .y=1, .z=0};

__.block.shape = {.x=18, .y=34, .z=34};
__.block.coord = {.x=112, .y=32, .z=0};
__.block.elems = 20808;

=======================
__.world.size = 128;
__.world.rank = 117;

__.nodes.shape = {.x=128, .y=128, .z=128, .t=20};
__.nodes.bound = {.x=1.000000, .y=1.000000, .z=1.000000, .t=0.010000};
__.nodes.steps = {.x=0.007812, .y=0.007812, .z=0.007812, .t=0.000500};

__.param.period = {.x=1, .y=0, .z=0};
__.param.a = {.x=6.283185, .y=3.141593, .z=3.141593, .t=7.695299};
__.param.b = {.x=0.000000, .y=0.000000, .z=0.000000, .t=7.853982};

__.local.rank = 117;
__.local.shape = {.x=8, .y=4, .z=4};
__.local.coord = {.x=7, .y=1, .z=1};

__.block.shape = {.x=18, .y=34, .z=34};
__.block.coord = {.x=112, .y=32, .z=32};
__.block.elems = 20808;

=======================
__.world.size = 128;
__.world.rank = 118;

__.nodes.shape = {.x=128, .y=128, .z=128, .t=20};
__.nodes.bound = {.x=1.000000, .y=1.000000, .z=1.000000, .t=0.010000};
__.nodes.steps = {.x=0.007812, .y=0.007812, .z=0.007812, .t=0.000500};

__.param.period = {.x=1, .y=0, .z=0};
__.param.a = {.x=6.283185, .y=3.141593, .z=3.141593, .t=7.695299};
__.param.b = {.x=0.000000, .y=0.000000, .z=0.000000, .t=7.853982};

__.local.rank = 118;
__.local.shape = {.x=8, .y=4, .z=4};
__.local.coord = {.x=7, .y=1, .z=2};

__.block.shape = {.x=18, .y=34, .z=34};
__.block.coord = {.x=112, .y=32, .z=64};
__.block.elems = 20808;

=======================
__.world.size = 128;
__.world.rank = 119;

__.nodes.shape = {.x=128, .y=128, .z=128, .t=20};
__.nodes.bound = {.x=1.000000, .y=1.000000, .z=1.000000, .t=0.010000};
__.nodes.steps = {.x=0.007812, .y=0.007812, .z=0.007812, .t=0.000500};

__.param.period = {.x=1, .y=0, .z=0};
__.param.a = {.x=6.283185, .y=3.141593, .z=3.141593, .t=7.695299};
__.param.b = {.x=0.000000, .y=0.000000, .z=0.000000, .t=7.853982};

__.local.rank = 119;
__.local.shape = {.x=8, .y=4, .z=4};
__.local.coord = {.x=7, .y=1, .z=3};

__.block.shape = {.x=18, .y=34, .z=34};
__.block.coord = {.x=112, .y=32, .z=96};
__.block.elems = 20808;

=======================
__.world.size = 128;
__.world.rank = 120;

__.nodes.shape = {.x=128, .y=128, .z=128, .t=20};
__.nodes.bound = {.x=1.000000, .y=1.000000, .z=1.000000, .t=0.010000};
__.nodes.steps = {.x=0.007812, .y=0.007812, .z=0.007812, .t=0.000500};

__.param.period = {.x=1, .y=0, .z=0};
__.param.a = {.x=6.283185, .y=3.141593, .z=3.141593, .t=7.695299};
__.param.b = {.x=0.000000, .y=0.000000, .z=0.000000, .t=7.853982};

__.local.rank = 120;
__.local.shape = {.x=8, .y=4, .z=4};
__.local.coord = {.x=7, .y=2, .z=0};

__.block.shape = {.x=18, .y=34, .z=34};
__.block.coord = {.x=112, .y=64, .z=0};
__.block.elems = 20808;

=======================
__.world.size = 128;
__.world.rank = 121;

__.nodes.shape = {.x=128, .y=128, .z=128, .t=20};
__.nodes.bound = {.x=1.000000, .y=1.000000, .z=1.000000, .t=0.010000};
__.nodes.steps = {.x=0.007812, .y=0.007812, .z=0.007812, .t=0.000500};

__.param.period = {.x=1, .y=0, .z=0};
__.param.a = {.x=6.283185, .y=3.141593, .z=3.141593, .t=7.695299};
__.param.b = {.x=0.000000, .y=0.000000, .z=0.000000, .t=7.853982};

__.local.rank = 121;
__.local.shape = {.x=8, .y=4, .z=4};
__.local.coord = {.x=7, .y=2, .z=1};

__.block.shape = {.x=18, .y=34, .z=34};
__.block.coord = {.x=112, .y=64, .z=32};
__.block.elems = 20808;

=======================
__.world.size = 128;
__.world.rank = 122;

__.nodes.shape = {.x=128, .y=128, .z=128, .t=20};
__.nodes.bound = {.x=1.000000, .y=1.000000, .z=1.000000, .t=0.010000};
__.nodes.steps = {.x=0.007812, .y=0.007812, .z=0.007812, .t=0.000500};

__.param.period = {.x=1, .y=0, .z=0};
__.param.a = {.x=6.283185, .y=3.141593, .z=3.141593, .t=7.695299};
__.param.b = {.x=0.000000, .y=0.000000, .z=0.000000, .t=7.853982};

__.local.rank = 122;
__.local.shape = {.x=8, .y=4, .z=4};
__.local.coord = {.x=7, .y=2, .z=2};

__.block.shape = {.x=18, .y=34, .z=34};
__.block.coord = {.x=112, .y=64, .z=64};
__.block.elems = 20808;

=======================
__.world.size = 128;
__.world.rank = 123;

__.nodes.shape = {.x=128, .y=128, .z=128, .t=20};
__.nodes.bound = {.x=1.000000, .y=1.000000, .z=1.000000, .t=0.010000};
__.nodes.steps = {.x=0.007812, .y=0.007812, .z=0.007812, .t=0.000500};

__.param.period = {.x=1, .y=0, .z=0};
__.param.a = {.x=6.283185, .y=3.141593, .z=3.141593, .t=7.695299};
__.param.b = {.x=0.000000, .y=0.000000, .z=0.000000, .t=7.853982};

__.local.rank = 123;
__.local.shape = {.x=8, .y=4, .z=4};
__.local.coord = {.x=7, .y=2, .z=3};

__.block.shape = {.x=18, .y=34, .z=34};
__.block.coord = {.x=112, .y=64, .z=96};
__.block.elems = 20808;

=======================
__.world.size = 128;
__.world.rank = 124;

__.nodes.shape = {.x=128, .y=128, .z=128, .t=20};
__.nodes.bound = {.x=1.000000, .y=1.000000, .z=1.000000, .t=0.010000};
__.nodes.steps = {.x=0.007812, .y=0.007812, .z=0.007812, .t=0.000500};

__.param.period = {.x=1, .y=0, .z=0};
__.param.a = {.x=6.283185, .y=3.141593, .z=3.141593, .t=7.695299};
__.param.b = {.x=0.000000, .y=0.000000, .z=0.000000, .t=7.853982};

__.local.rank = 124;
__.local.shape = {.x=8, .y=4, .z=4};
__.local.coord = {.x=7, .y=3, .z=0};

__.block.shape = {.x=18, .y=34, .z=34};
__.block.coord = {.x=112, .y=96, .z=0};
__.block.elems = 20808;

=======================
__.world.size = 128;
__.world.rank = 125;

__.nodes.shape = {.x=128, .y=128, .z=128, .t=20};
__.nodes.bound = {.x=1.000000, .y=1.000000, .z=1.000000, .t=0.010000};
__.nodes.steps = {.x=0.007812, .y=0.007812, .z=0.007812, .t=0.000500};

__.param.period = {.x=1, .y=0, .z=0};
__.param.a = {.x=6.283185, .y=3.141593, .z=3.141593, .t=7.695299};
__.param.b = {.x=0.000000, .y=0.000000, .z=0.000000, .t=7.853982};

__.local.rank = 125;
__.local.shape = {.x=8, .y=4, .z=4};
__.local.coord = {.x=7, .y=3, .z=1};

__.block.shape = {.x=18, .y=34, .z=34};
__.block.coord = {.x=112, .y=96, .z=32};
__.block.elems = 20808;

=======================
__.world.size = 128;
__.world.rank = 126;

__.nodes.shape = {.x=128, .y=128, .z=128, .t=20};
__.nodes.bound = {.x=1.000000, .y=1.000000, .z=1.000000, .t=0.010000};
__.nodes.steps = {.x=0.007812, .y=0.007812, .z=0.007812, .t=0.000500};

__.param.period = {.x=1, .y=0, .z=0};
__.param.a = {.x=6.283185, .y=3.141593, .z=3.141593, .t=7.695299};
__.param.b = {.x=0.000000, .y=0.000000, .z=0.000000, .t=7.853982};

__.local.rank = 126;
__.local.shape = {.x=8, .y=4, .z=4};
__.local.coord = {.x=7, .y=3, .z=2};

__.block.shape = {.x=18, .y=34, .z=34};
__.block.coord = {.x=112, .y=96, .z=64};
__.block.elems = 20808;

=======================
__.world.size = 128;
__.world.rank = 127;

__.nodes.shape = {.x=128, .y=128, .z=128, .t=20};
__.nodes.bound = {.x=1.000000, .y=1.000000, .z=1.000000, .t=0.010000};
__.nodes.steps = {.x=0.007812, .y=0.007812, .z=0.007812, .t=0.000500};

__.param.period = {.x=1, .y=0, .z=0};
__.param.a = {.x=6.283185, .y=3.141593, .z=3.141593, .t=7.695299};
__.param.b = {.x=0.000000, .y=0.000000, .z=0.000000, .t=7.853982};

__.local.rank = 127;
__.local.shape = {.x=8, .y=4, .z=4};
__.local.coord = {.x=7, .y=3, .z=3};

__.block.shape = {.x=18, .y=34, .z=34};
__.block.coord = {.x=112, .y=96, .z=96};
__.block.elems = 20808;

__TRIALS__.append((8.085068e-02, [0.000000e+00, 1.105544e-09, 4.422145e-09, 9.949703e-09, 1.768806e-08, 2.763697e-08, 3.979616e-08, 5.416526e-08, 7.074384e-08, 8.953142e-08, 1.105274e-07, 1.337313e-07, 1.591422e-07, 1.867596e-07, 2.165825e-07, 2.486100e-07, 2.828413e-07, 3.192754e-07, 3.579110e-07, 3.987471e-07, 4.417826e-07, ]))
__TRIALS__.append((7.937327e-02, [0.000000e+00, 1.105544e-09, 4.422145e-09, 9.949703e-09, 1.768806e-08, 2.763697e-08, 3.979616e-08, 5.416526e-08, 7.074384e-08, 8.953142e-08, 1.105274e-07, 1.337313e-07, 1.591422e-07, 1.867596e-07, 2.165825e-07, 2.486100e-07, 2.828413e-07, 3.192754e-07, 3.579110e-07, 3.987471e-07, 4.417826e-07, ]))
__TRIALS__.append((7.937758e-02, [0.000000e+00, 1.105544e-09, 4.422145e-09, 9.949703e-09, 1.768806e-08, 2.763697e-08, 3.979616e-08, 5.416526e-08, 7.074384e-08, 8.953142e-08, 1.105274e-07, 1.337313e-07, 1.591422e-07, 1.867596e-07, 2.165825e-07, 2.486100e-07, 2.828413e-07, 3.192754e-07, 3.579110e-07, 3.987471e-07, 4.417826e-07, ]))
__TRIALS__.append((7.935380e-02, [0.000000e+00, 1.105544e-09, 4.422145e-09, 9.949703e-09, 1.768806e-08, 2.763697e-08, 3.979616e-08, 5.416526e-08, 7.074384e-08, 8.953142e-08, 1.105274e-07, 1.337313e-07, 1.591422e-07, 1.867596e-07, 2.165825e-07, 2.486100e-07, 2.828413e-07, 3.192754e-07, 3.579110e-07, 3.987471e-07, 4.417826e-07, ]))
__TRIALS__.append((7.934730e-02, [0.000000e+00, 1.105544e-09, 4.422145e-09, 9.949703e-09, 1.768806e-08, 2.763697e-08, 3.979616e-08, 5.416526e-08, 7.074384e-08, 8.953142e-08, 1.105274e-07, 1.337313e-07, 1.591422e-07, 1.867596e-07, 2.165825e-07, 2.486100e-07, 2.828413e-07, 3.192754e-07, 3.579110e-07, 3.987471e-07, 4.417826e-07, ]))
__TRIALS__.append((7.939201e-02, [0.000000e+00, 1.105544e-09, 4.422145e-09, 9.949703e-09, 1.768806e-08, 2.763697e-08, 3.979616e-08, 5.416526e-08, 7.074384e-08, 8.953142e-08, 1.105274e-07, 1.337313e-07, 1.591422e-07, 1.867596e-07, 2.165825e-07, 2.486100e-07, 2.828413e-07, 3.192754e-07, 3.579110e-07, 3.987471e-07, 4.417826e-07, ]))
__TRIALS__.append((7.939358e-02, [0.000000e+00, 1.105544e-09, 4.422145e-09, 9.949703e-09, 1.768806e-08, 2.763697e-08, 3.979616e-08, 5.416526e-08, 7.074384e-08, 8.953142e-08, 1.105274e-07, 1.337313e-07, 1.591422e-07, 1.867596e-07, 2.165825e-07, 2.486100e-07, 2.828413e-07, 3.192754e-07, 3.579110e-07, 3.987471e-07, 4.417826e-07, ]))
__TRIALS__.append((7.940795e-02, [0.000000e+00, 1.105544e-09, 4.422145e-09, 9.949703e-09, 1.768806e-08, 2.763697e-08, 3.979616e-08, 5.416526e-08, 7.074384e-08, 8.953142e-08, 1.105274e-07, 1.337313e-07, 1.591422e-07, 1.867596e-07, 2.165825e-07, 2.486100e-07, 2.828413e-07, 3.192754e-07, 3.579110e-07, 3.987471e-07, 4.417826e-07, ]))
__TRIALS__.append((7.933669e-02, [0.000000e+00, 1.105544e-09, 4.422145e-09, 9.949703e-09, 1.768806e-08, 2.763697e-08, 3.979616e-08, 5.416526e-08, 7.074384e-08, 8.953142e-08, 1.105274e-07, 1.337313e-07, 1.591422e-07, 1.867596e-07, 2.165825e-07, 2.486100e-07, 2.828413e-07, 3.192754e-07, 3.579110e-07, 3.987471e-07, 4.417826e-07, ]))
__TRIALS__.append((7.937036e-02, [0.000000e+00, 1.105544e-09, 4.422145e-09, 9.949703e-09, 1.768806e-08, 2.763697e-08, 3.979616e-08, 5.416526e-08, 7.074384e-08, 8.953142e-08, 1.105274e-07, 1.337313e-07, 1.591422e-07, 1.867596e-07, 2.165825e-07, 2.486100e-07, 2.828413e-07, 3.192754e-07, 3.579110e-07, 3.987471e-07, 4.417826e-07, ]))
