# Running __TRIALS__ with FILTERED_SAMPLING/ERROR_STOPPING and epsilon=1.000000e-04, comm_size=4, seed=42
__TRIALS__ = [
#   (trial_time, trial_iters, trial_points, trial_error),
    (4.153552e-01, 1700160, 445336, 9.484801e-05),  # __TRIALS__
    (6.088182e+00, 24924480, 6524610, 9.694207e-05),  # __TRIALS__
    (1.263823e-01, 517440, 135240, 9.035106e-05),  # __TRIALS__
    (4.104536e-02, 168000, 43847, 7.201403e-05),  # __TRIALS__
    (1.315981e-02, 53760, 14133, 5.265330e-05),  # __TRIALS__
    (3.873954e-01, 1585920, 415069, 9.054812e-05),  # __TRIALS__
    (5.089634e-02, 208320, 54344, 8.181226e-05),  # __TRIALS__
    (5.465718e-01, 2237760, 585422, 8.368798e-05),  # __TRIALS__
    (1.707922e-01, 698880, 183083, 7.537423e-05),  # __TRIALS__
    (1.822508e-01, 745920, 195639, 4.410826e-05),  # __TRIALS__
]  # __TRIALS__
# Done.
