Sender: LSF System <lsfadmin@polus-c4-ib.bmc.hpc.cs.msu.ru>
Subject: Job 798535: <# this file was automaticly created by mpisubmit.pl script for edu-cmc-skmodel21-622-16 #;source /polusfs/setenv/setup.SMPI;#BSUB -n 32;#BSUB -W 00:15;#BSUB -o main_adjusted_delta.%J.out;#BSUB -e main_adjusted_delta.%J.err;OMP_NUM_THREADS=1 mpiexec main_adjusted_delta 1.5e-6 42> in cluster <MSUCluster> Done

Job <# this file was automaticly created by mpisubmit.pl script for edu-cmc-skmodel21-622-16 #;source /polusfs/setenv/setup.SMPI;#BSUB -n 32;#BSUB -W 00:15;#BSUB -o main_adjusted_delta.%J.out;#BSUB -e main_adjusted_delta.%J.err;OMP_NUM_THREADS=1 mpiexec main_adjusted_delta 1.5e-6 42> was submitted from host <polus-ib.bmc.hpc.cs.msu.ru> by user <edu-cmc-skmodel21-622-16> in cluster <MSUCluster> at Sun Nov  7 10:45:09 2021
Job was executed on host(s) <16*polus-c4-ib.bmc.hpc.cs.msu.ru>, in queue <short>, as user <edu-cmc-skmodel21-622-16> in cluster <MSUCluster> at Sun Nov  7 10:49:07 2021
                            <16*polus-c1-ib.bmc.hpc.cs.msu.ru>
</home_edu/edu-cmc-skmodel21-622/edu-cmc-skmodel21-622-16> was used as the home directory.
</home_edu/edu-cmc-skmodel21-622/edu-cmc-skmodel21-622-16/solution> was used as the working directory.
Started at Sun Nov  7 10:49:07 2021
Terminated at Sun Nov  7 10:56:35 2021
Results reported at Sun Nov  7 10:56:35 2021

Your job looked like:

------------------------------------------------------------
# LSBATCH: User input
# this file was automaticly created by mpisubmit.pl script for edu-cmc-skmodel21-622-16 #
source /polusfs/setenv/setup.SMPI
#BSUB -n 32
#BSUB -W 00:15
#BSUB -o main_adjusted_delta.%J.out
#BSUB -e main_adjusted_delta.%J.err
OMP_NUM_THREADS=1 mpiexec main_adjusted_delta 1.5e-6 42

------------------------------------------------------------

Successfully completed.

Resource usage summary:

    CPU time :                                   14256.58 sec.
    Max Memory :                                 1730 MB
    Average Memory :                             1590.94 MB
    Total Requested Memory :                     -
    Delta Memory :                               -
    Max Swap :                                   -
    Max Processes :                              37
    Max Threads :                                109
    Run time :                                   452 sec.
    Turnaround time :                            686 sec.

The output (if any) follows:

# Running __TRIALS__ with ADJUSTED_SAMPLING/DELTA_STOPPING and epsilon=1.500000e-06, comm_size=32, seed=42
__TRIALS__ = [
#   (trial_time, trial_iters, trial_points, trial_error),
    (4.383683e+01, 4691447040, 4691447040, 4.550389e-06),  # __TRIALS__
    (4.289818e+01, 4691447040, 4691447040, 5.206960e-06),  # __TRIALS__
    (4.408952e+01, 4691447040, 4691447040, 1.399200e-06),  # __TRIALS__
    (4.358533e+01, 4691447040, 4691447040, 2.578082e-07),  # __TRIALS__
    (4.420657e+01, 4691447040, 4691447040, 6.668612e-06),  # __TRIALS__
    (4.538022e+01, 4691447040, 4691447040, 4.403694e-06),  # __TRIALS__
    (4.631873e+01, 4691447040, 4691447040, 1.267628e-07),  # __TRIALS__
    (4.474505e+01, 4691447040, 4691447040, 3.943200e-06),  # __TRIALS__
    (4.477003e+01, 4691447040, 4691447040, 1.586364e-06),  # __TRIALS__
    (4.558441e+01, 4691447040, 4691447040, 1.510676e-06),  # __TRIALS__
]  # __TRIALS__
# Done.


PS:

Read file <main_adjusted_delta.798535.err> for stderr output of this job.

