Sender: LSF System <lsfadmin@polus-c4-ib.bmc.hpc.cs.msu.ru>
Subject: Job 798515: <# this file was automaticly created by mpisubmit.pl script for edu-cmc-skmodel21-622-16 #;source /polusfs/setenv/setup.SMPI;#BSUB -n 32;#BSUB -W 00:15;#BSUB -o main_filtered_delta.%J.out;#BSUB -e main_filtered_delta.%J.err;OMP_NUM_THREADS=1 mpiexec main_filtered_delta 3.0e-5 42> in cluster <MSUCluster> Done

Job <# this file was automaticly created by mpisubmit.pl script for edu-cmc-skmodel21-622-16 #;source /polusfs/setenv/setup.SMPI;#BSUB -n 32;#BSUB -W 00:15;#BSUB -o main_filtered_delta.%J.out;#BSUB -e main_filtered_delta.%J.err;OMP_NUM_THREADS=1 mpiexec main_filtered_delta 3.0e-5 42> was submitted from host <polus-ib.bmc.hpc.cs.msu.ru> by user <edu-cmc-skmodel21-622-16> in cluster <MSUCluster> at Sun Nov  7 09:46:28 2021
Job was executed on host(s) <20*polus-c4-ib.bmc.hpc.cs.msu.ru>, in queue <short>, as user <edu-cmc-skmodel21-622-16> in cluster <MSUCluster> at Sun Nov  7 09:46:29 2021
                            <12*polus-c1-ib.bmc.hpc.cs.msu.ru>
</home_edu/edu-cmc-skmodel21-622/edu-cmc-skmodel21-622-16> was used as the home directory.
</home_edu/edu-cmc-skmodel21-622/edu-cmc-skmodel21-622-16/solution> was used as the working directory.
Started at Sun Nov  7 09:46:29 2021
Terminated at Sun Nov  7 09:47:10 2021
Results reported at Sun Nov  7 09:47:10 2021

Your job looked like:

------------------------------------------------------------
# LSBATCH: User input
# this file was automaticly created by mpisubmit.pl script for edu-cmc-skmodel21-622-16 #
source /polusfs/setenv/setup.SMPI
#BSUB -n 32
#BSUB -W 00:15
#BSUB -o main_filtered_delta.%J.out
#BSUB -e main_filtered_delta.%J.err
OMP_NUM_THREADS=1 mpiexec main_filtered_delta 3.0e-5 42

------------------------------------------------------------

Successfully completed.

Resource usage summary:

    CPU time :                                   1265.41 sec.
    Max Memory :                                 1079 MB
    Average Memory :                             944.25 MB
    Total Requested Memory :                     -
    Delta Memory :                               -
    Max Swap :                                   -
    Max Processes :                              24
    Max Threads :                                69
    Run time :                                   48 sec.
    Turnaround time :                            42 sec.

The output (if any) follows:

# Running __TRIALS__ with FILTERED_SAMPLING/DELTA_STOPPING and epsilon=3.000000e-05, comm_size=32, seed=42
__TRIALS__ = [
#   (trial_time, trial_iters, trial_points, trial_error),
    (4.578427e+00, 896004480, 234580423, 5.308024e-05),  # __TRIALS__
    (3.961102e+00, 896004480, 234574655, 1.479446e-05),  # __TRIALS__
    (3.918480e+00, 896004480, 234595781, 3.645622e-05),  # __TRIALS__
    (3.995762e+00, 896004480, 234569096, 8.918700e-06),  # __TRIALS__
    (4.119821e+00, 896004480, 234559179, 3.343980e-05),  # __TRIALS__
    (3.769848e+00, 896004480, 234570240, 3.493346e-05),  # __TRIALS__
    (3.804453e+00, 896004480, 234573548, 1.664469e-05),  # __TRIALS__
    (3.787292e+00, 896004480, 234563082, 2.340380e-05),  # __TRIALS__
    (3.762656e+00, 896004480, 234569903, 6.532673e-06),  # __TRIALS__
    (3.742720e+00, 896004480, 234565955, 1.891122e-05),  # __TRIALS__
]  # __TRIALS__
# Done.


PS:

Read file <main_filtered_delta.798515.err> for stderr output of this job.

