Sender: LSF System <lsfadmin@polus-c4-ib.bmc.hpc.cs.msu.ru>
Subject: Job 862859: <source /polusfs/setenv/setup.SMPI;#BSUB -n 1;#BSUB -W 00:15;#BSUB -x;#BSUB -R "span[ptile=1]";#BSUB -o main.%J.out;#BSUB -e main.%J.err;OMP_NUM_THREADS=8 mpiexec main_omp 1 0.01 256 20> in cluster <MSUCluster> Done

Job <source /polusfs/setenv/setup.SMPI;#BSUB -n 1;#BSUB -W 00:15;#BSUB -x;#BSUB -R "span[ptile=1]";#BSUB -o main.%J.out;#BSUB -e main.%J.err;OMP_NUM_THREADS=8 mpiexec main_omp 1 0.01 256 20> was submitted from host <polus-ib.bmc.hpc.cs.msu.ru> by user <edu-cmc-skmodel21-622-16> in cluster <MSUCluster> at Fri Dec 24 08:18:29 2021
Job was executed on host(s) <polus-c4-ib.bmc.hpc.cs.msu.ru>, in queue <short>, as user <edu-cmc-skmodel21-622-16> in cluster <MSUCluster> at Fri Dec 24 08:18:30 2021
</home_edu/edu-cmc-skmodel21-622/edu-cmc-skmodel21-622-16> was used as the home directory.
</home_edu/edu-cmc-skmodel21-622/edu-cmc-skmodel21-622-16/solution_1> was used as the working directory.
Started at Fri Dec 24 08:18:30 2021
Terminated at Fri Dec 24 08:19:06 2021
Results reported at Fri Dec 24 08:19:06 2021

Your job looked like:

------------------------------------------------------------
# LSBATCH: User input
source /polusfs/setenv/setup.SMPI
#BSUB -n 1
#BSUB -W 00:15
#BSUB -x
#BSUB -R "span[ptile=1]"
#BSUB -o main.%J.out
#BSUB -e main.%J.err
OMP_NUM_THREADS=8 mpiexec main_omp 1 0.01 256 20

------------------------------------------------------------

Successfully completed.

Resource usage summary:

    CPU time :                                   263.29 sec.
    Max Memory :                                 465 MB
    Average Memory :                             398.29 MB
    Total Requested Memory :                     -
    Delta Memory :                               -
    Max Swap :                                   -
    Max Processes :                              5
    Max Threads :                                19
    Run time :                                   37 sec.
    Turnaround time :                            37 sec.

The output (if any) follows:

__PARAMS__ = {'P': 1, 'O': 8, 'L': 1.000000e+00, 'T': 1.000000e-02, 'N': 256, 'K': 20}
=======================
__.world.size = 1;
__.world.rank = 0;

__.nodes.shape = {.x=256, .y=256, .z=256, .t=20};
__.nodes.bound = {.x=1.000000, .y=1.000000, .z=1.000000, .t=0.010000};
__.nodes.steps = {.x=0.003906, .y=0.003906, .z=0.003906, .t=0.000500};

__.param.period = {.x=1, .y=0, .z=0};
__.param.a = {.x=6.283185, .y=3.141593, .z=3.141593, .t=7.695299};
__.param.b = {.x=0.000000, .y=0.000000, .z=0.000000, .t=7.853982};

__.local.rank = 0;
__.local.shape = {.x=1, .y=1, .z=1};
__.local.coord = {.x=0, .y=0, .z=0};

__.block.shape = {.x=258, .y=258, .z=258};
__.block.coord = {.x=0, .y=0, .z=0};
__.block.elems = 17173512;

__TRIALS__.append((3.523426e+00, [0.000000e+00, 2.695524e-10, 1.078202e-09, 2.425924e-09, 4.312679e-09, 6.738411e-09, 9.703048e-09, 1.320650e-08, 1.724867e-08, 2.182944e-08, 2.694866e-08, 3.260619e-08, 3.880185e-08, 4.553548e-08, 5.280686e-08, 6.061578e-08, 6.896201e-08, 7.784531e-08, 8.726540e-08, 9.722201e-08, 1.077149e-07, ]))
__TRIALS__.append((3.524387e+00, [0.000000e+00, 2.695524e-10, 1.078202e-09, 2.425924e-09, 4.312679e-09, 6.738411e-09, 9.703048e-09, 1.320650e-08, 1.724867e-08, 2.182944e-08, 2.694866e-08, 3.260619e-08, 3.880185e-08, 4.553548e-08, 5.280686e-08, 6.061578e-08, 6.896201e-08, 7.784531e-08, 8.726540e-08, 9.722201e-08, 1.077149e-07, ]))
__TRIALS__.append((3.531572e+00, [0.000000e+00, 2.695524e-10, 1.078202e-09, 2.425924e-09, 4.312679e-09, 6.738411e-09, 9.703048e-09, 1.320650e-08, 1.724867e-08, 2.182944e-08, 2.694866e-08, 3.260619e-08, 3.880185e-08, 4.553548e-08, 5.280686e-08, 6.061578e-08, 6.896201e-08, 7.784531e-08, 8.726540e-08, 9.722201e-08, 1.077149e-07, ]))
__TRIALS__.append((3.528145e+00, [0.000000e+00, 2.695524e-10, 1.078202e-09, 2.425924e-09, 4.312679e-09, 6.738411e-09, 9.703048e-09, 1.320650e-08, 1.724867e-08, 2.182944e-08, 2.694866e-08, 3.260619e-08, 3.880185e-08, 4.553548e-08, 5.280686e-08, 6.061578e-08, 6.896201e-08, 7.784531e-08, 8.726540e-08, 9.722201e-08, 1.077149e-07, ]))
__TRIALS__.append((3.523024e+00, [0.000000e+00, 2.695524e-10, 1.078202e-09, 2.425924e-09, 4.312679e-09, 6.738411e-09, 9.703048e-09, 1.320650e-08, 1.724867e-08, 2.182944e-08, 2.694866e-08, 3.260619e-08, 3.880185e-08, 4.553548e-08, 5.280686e-08, 6.061578e-08, 6.896201e-08, 7.784531e-08, 8.726540e-08, 9.722201e-08, 1.077149e-07, ]))
__TRIALS__.append((3.525244e+00, [0.000000e+00, 2.695524e-10, 1.078202e-09, 2.425924e-09, 4.312679e-09, 6.738411e-09, 9.703048e-09, 1.320650e-08, 1.724867e-08, 2.182944e-08, 2.694866e-08, 3.260619e-08, 3.880185e-08, 4.553548e-08, 5.280686e-08, 6.061578e-08, 6.896201e-08, 7.784531e-08, 8.726540e-08, 9.722201e-08, 1.077149e-07, ]))
__TRIALS__.append((3.544810e+00, [0.000000e+00, 2.695524e-10, 1.078202e-09, 2.425924e-09, 4.312679e-09, 6.738411e-09, 9.703048e-09, 1.320650e-08, 1.724867e-08, 2.182944e-08, 2.694866e-08, 3.260619e-08, 3.880185e-08, 4.553548e-08, 5.280686e-08, 6.061578e-08, 6.896201e-08, 7.784531e-08, 8.726540e-08, 9.722201e-08, 1.077149e-07, ]))
__TRIALS__.append((3.528958e+00, [0.000000e+00, 2.695524e-10, 1.078202e-09, 2.425924e-09, 4.312679e-09, 6.738411e-09, 9.703048e-09, 1.320650e-08, 1.724867e-08, 2.182944e-08, 2.694866e-08, 3.260619e-08, 3.880185e-08, 4.553548e-08, 5.280686e-08, 6.061578e-08, 6.896201e-08, 7.784531e-08, 8.726540e-08, 9.722201e-08, 1.077149e-07, ]))
__TRIALS__.append((3.530774e+00, [0.000000e+00, 2.695524e-10, 1.078202e-09, 2.425924e-09, 4.312679e-09, 6.738411e-09, 9.703048e-09, 1.320650e-08, 1.724867e-08, 2.182944e-08, 2.694866e-08, 3.260619e-08, 3.880185e-08, 4.553548e-08, 5.280686e-08, 6.061578e-08, 6.896201e-08, 7.784531e-08, 8.726540e-08, 9.722201e-08, 1.077149e-07, ]))
__TRIALS__.append((3.535450e+00, [0.000000e+00, 2.695524e-10, 1.078202e-09, 2.425924e-09, 4.312679e-09, 6.738411e-09, 9.703048e-09, 1.320650e-08, 1.724867e-08, 2.182944e-08, 2.694866e-08, 3.260619e-08, 3.880185e-08, 4.553548e-08, 5.280686e-08, 6.061578e-08, 6.896201e-08, 7.784531e-08, 8.726540e-08, 9.722201e-08, 1.077149e-07, ]))


PS:

Read file <main.862859.err> for stderr output of this job.

