Sender: LSF System <lsfadmin@polus-c4-ib.bmc.hpc.cs.msu.ru>
Subject: Job 798498: <# this file was automaticly created by mpisubmit.pl script for edu-cmc-skmodel21-622-16 #;source /polusfs/setenv/setup.SMPI;#BSUB -n 16;#BSUB -W 00:15;#BSUB -o main_filtered_error.%J.out;#BSUB -e main_filtered_error.%J.err;OMP_NUM_THREADS=1 mpiexec main_filtered_error 1.5e-6 42> in cluster <MSUCluster> Done

Job <# this file was automaticly created by mpisubmit.pl script for edu-cmc-skmodel21-622-16 #;source /polusfs/setenv/setup.SMPI;#BSUB -n 16;#BSUB -W 00:15;#BSUB -o main_filtered_error.%J.out;#BSUB -e main_filtered_error.%J.err;OMP_NUM_THREADS=1 mpiexec main_filtered_error 1.5e-6 42> was submitted from host <polus-ib.bmc.hpc.cs.msu.ru> by user <edu-cmc-skmodel21-622-16> in cluster <MSUCluster> at Sun Nov  7 06:34:59 2021
Job was executed on host(s) <15*polus-c4-ib.bmc.hpc.cs.msu.ru>, in queue <short>, as user <edu-cmc-skmodel21-622-16> in cluster <MSUCluster> at Sun Nov  7 06:35:00 2021
                            <1*polus-c2-ib.bmc.hpc.cs.msu.ru>
</home_edu/edu-cmc-skmodel21-622/edu-cmc-skmodel21-622-16> was used as the home directory.
</home_edu/edu-cmc-skmodel21-622/edu-cmc-skmodel21-622-16/solution> was used as the working directory.
Started at Sun Nov  7 06:35:00 2021
Terminated at Sun Nov  7 06:35:27 2021
Results reported at Sun Nov  7 06:35:27 2021

Your job looked like:

------------------------------------------------------------
# LSBATCH: User input
# this file was automaticly created by mpisubmit.pl script for edu-cmc-skmodel21-622-16 #
source /polusfs/setenv/setup.SMPI
#BSUB -n 16
#BSUB -W 00:15
#BSUB -o main_filtered_error.%J.out
#BSUB -e main_filtered_error.%J.err
OMP_NUM_THREADS=1 mpiexec main_filtered_error 1.5e-6 42

------------------------------------------------------------

Successfully completed.

Resource usage summary:

    CPU time :                                   402.38 sec.
    Max Memory :                                 806 MB
    Average Memory :                             645.00 MB
    Total Requested Memory :                     -
    Delta Memory :                               -
    Max Swap :                                   -
    Max Processes :                              19
    Max Threads :                                54
    Run time :                                   31 sec.
    Turnaround time :                            28 sec.

The output (if any) follows:

# Running __TRIALS__ with FILTERED_SAMPLING/ERROR_STOPPING and epsilon=1.500000e-06, comm_size=16, seed=42
__TRIALS__ = [
#   (trial_time, trial_iters, trial_points, trial_error),
    (3.213346e-01, 34097280, 8927553, 9.051733e-07),  # __TRIALS__
    (2.261028e-02, 2856000, 748084, 6.634083e-07),  # __TRIALS__
    (1.306349e-02, 1659840, 434622, 7.622852e-07),  # __TRIALS__
    (8.759433e-02, 11108160, 2907811, 5.071839e-07),  # __TRIALS__
    (3.031025e-01, 37947840, 9933654, 1.234376e-06),  # __TRIALS__
    (1.488197e-02, 1827840, 478652, 6.069719e-07),  # __TRIALS__
    (2.090212e+01, 2767087680, 724443198, 1.486613e-06),  # __TRIALS__
    (1.225223e-02, 1626240, 426024, 1.205524e-06),  # __TRIALS__
    (3.251986e+00, 464795520, 121673446, 1.317627e-06),  # __TRIALS__
    (1.061705e-01, 14125440, 3699117, 3.881402e-07),  # __TRIALS__
]  # __TRIALS__
# Done.


PS:

Read file <main_filtered_error.798498.err> for stderr output of this job.

