__PARAMS__ = {'P': 128, 'O': 4, 'L': 1.000000e+00, 'T': 1.000000e-02, 'N': 512, 'K': 20}
=======================
__.world.size = 128;
__.world.rank = 0;

__.nodes.shape = {.x=512, .y=512, .z=512, .t=20};
__.nodes.bound = {.x=1.000000, .y=1.000000, .z=1.000000, .t=0.010000};
__.nodes.steps = {.x=0.001953, .y=0.001953, .z=0.001953, .t=0.000500};

__.param.period = {.x=1, .y=0, .z=0};
__.param.a = {.x=6.283185, .y=3.141593, .z=3.141593, .t=7.695299};
__.param.b = {.x=0.000000, .y=0.000000, .z=0.000000, .t=7.853982};

__.local.rank = 0;
__.local.shape = {.x=8, .y=4, .z=4};
__.local.coord = {.x=0, .y=0, .z=0};

__.block.shape = {.x=66, .y=130, .z=130};
__.block.coord = {.x=0, .y=0, .z=0};
__.block.elems = 1115400;

=======================
__.world.size = 128;
__.world.rank = 1;

__.nodes.shape = {.x=512, .y=512, .z=512, .t=20};
__.nodes.bound = {.x=1.000000, .y=1.000000, .z=1.000000, .t=0.010000};
__.nodes.steps = {.x=0.001953, .y=0.001953, .z=0.001953, .t=0.000500};

__.param.period = {.x=1, .y=0, .z=0};
__.param.a = {.x=6.283185, .y=3.141593, .z=3.141593, .t=7.695299};
__.param.b = {.x=0.000000, .y=0.000000, .z=0.000000, .t=7.853982};

__.local.rank = 1;
__.local.shape = {.x=8, .y=4, .z=4};
__.local.coord = {.x=0, .y=0, .z=1};

__.block.shape = {.x=66, .y=130, .z=130};
__.block.coord = {.x=0, .y=0, .z=128};
__.block.elems = 1115400;

=======================
__.world.size = 128;
__.world.rank = 2;

__.nodes.shape = {.x=512, .y=512, .z=512, .t=20};
__.nodes.bound = {.x=1.000000, .y=1.000000, .z=1.000000, .t=0.010000};
__.nodes.steps = {.x=0.001953, .y=0.001953, .z=0.001953, .t=0.000500};

__.param.period = {.x=1, .y=0, .z=0};
__.param.a = {.x=6.283185, .y=3.141593, .z=3.141593, .t=7.695299};
__.param.b = {.x=0.000000, .y=0.000000, .z=0.000000, .t=7.853982};

__.local.rank = 2;
__.local.shape = {.x=8, .y=4, .z=4};
__.local.coord = {.x=0, .y=0, .z=2};

__.block.shape = {.x=66, .y=130, .z=130};
__.block.coord = {.x=0, .y=0, .z=256};
__.block.elems = 1115400;

=======================
__.world.size = 128;
__.world.rank = 3;

__.nodes.shape = {.x=512, .y=512, .z=512, .t=20};
__.nodes.bound = {.x=1.000000, .y=1.000000, .z=1.000000, .t=0.010000};
__.nodes.steps = {.x=0.001953, .y=0.001953, .z=0.001953, .t=0.000500};

__.param.period = {.x=1, .y=0, .z=0};
__.param.a = {.x=6.283185, .y=3.141593, .z=3.141593, .t=7.695299};
__.param.b = {.x=0.000000, .y=0.000000, .z=0.000000, .t=7.853982};

__.local.rank = 3;
__.local.shape = {.x=8, .y=4, .z=4};
__.local.coord = {.x=0, .y=0, .z=3};

__.block.shape = {.x=66, .y=130, .z=130};
__.block.coord = {.x=0, .y=0, .z=384};
__.block.elems = 1115400;

=======================
__.world.size = 128;
__.world.rank = 4;

__.nodes.shape = {.x=512, .y=512, .z=512, .t=20};
__.nodes.bound = {.x=1.000000, .y=1.000000, .z=1.000000, .t=0.010000};
__.nodes.steps = {.x=0.001953, .y=0.001953, .z=0.001953, .t=0.000500};

__.param.period = {.x=1, .y=0, .z=0};
__.param.a = {.x=6.283185, .y=3.141593, .z=3.141593, .t=7.695299};
__.param.b = {.x=0.000000, .y=0.000000, .z=0.000000, .t=7.853982};

__.local.rank = 4;
__.local.shape = {.x=8, .y=4, .z=4};
__.local.coord = {.x=0, .y=1, .z=0};

__.block.shape = {.x=66, .y=130, .z=130};
__.block.coord = {.x=0, .y=128, .z=0};
__.block.elems = 1115400;

=======================
__.world.size = 128;
__.world.rank = 5;

__.nodes.shape = {.x=512, .y=512, .z=512, .t=20};
__.nodes.bound = {.x=1.000000, .y=1.000000, .z=1.000000, .t=0.010000};
__.nodes.steps = {.x=0.001953, .y=0.001953, .z=0.001953, .t=0.000500};

__.param.period = {.x=1, .y=0, .z=0};
__.param.a = {.x=6.283185, .y=3.141593, .z=3.141593, .t=7.695299};
__.param.b = {.x=0.000000, .y=0.000000, .z=0.000000, .t=7.853982};

__.local.rank = 5;
__.local.shape = {.x=8, .y=4, .z=4};
__.local.coord = {.x=0, .y=1, .z=1};

__.block.shape = {.x=66, .y=130, .z=130};
__.block.coord = {.x=0, .y=128, .z=128};
__.block.elems = 1115400;

=======================
__.world.size = 128;
__.world.rank = 6;

__.nodes.shape = {.x=512, .y=512, .z=512, .t=20};
__.nodes.bound = {.x=1.000000, .y=1.000000, .z=1.000000, .t=0.010000};
__.nodes.steps = {.x=0.001953, .y=0.001953, .z=0.001953, .t=0.000500};

__.param.period = {.x=1, .y=0, .z=0};
__.param.a = {.x=6.283185, .y=3.141593, .z=3.141593, .t=7.695299};
__.param.b = {.x=0.000000, .y=0.000000, .z=0.000000, .t=7.853982};

__.local.rank = 6;
__.local.shape = {.x=8, .y=4, .z=4};
__.local.coord = {.x=0, .y=1, .z=2};

__.block.shape = {.x=66, .y=130, .z=130};
__.block.coord = {.x=0, .y=128, .z=256};
__.block.elems = 1115400;

=======================
__.world.size = 128;
__.world.rank = 7;

__.nodes.shape = {.x=512, .y=512, .z=512, .t=20};
__.nodes.bound = {.x=1.000000, .y=1.000000, .z=1.000000, .t=0.010000};
__.nodes.steps = {.x=0.001953, .y=0.001953, .z=0.001953, .t=0.000500};

__.param.period = {.x=1, .y=0, .z=0};
__.param.a = {.x=6.283185, .y=3.141593, .z=3.141593, .t=7.695299};
__.param.b = {.x=0.000000, .y=0.000000, .z=0.000000, .t=7.853982};

__.local.rank = 7;
__.local.shape = {.x=8, .y=4, .z=4};
__.local.coord = {.x=0, .y=1, .z=3};

__.block.shape = {.x=66, .y=130, .z=130};
__.block.coord = {.x=0, .y=128, .z=384};
__.block.elems = 1115400;

=======================
__.world.size = 128;
__.world.rank = 8;

__.nodes.shape = {.x=512, .y=512, .z=512, .t=20};
__.nodes.bound = {.x=1.000000, .y=1.000000, .z=1.000000, .t=0.010000};
__.nodes.steps = {.x=0.001953, .y=0.001953, .z=0.001953, .t=0.000500};

__.param.period = {.x=1, .y=0, .z=0};
__.param.a = {.x=6.283185, .y=3.141593, .z=3.141593, .t=7.695299};
__.param.b = {.x=0.000000, .y=0.000000, .z=0.000000, .t=7.853982};

__.local.rank = 8;
__.local.shape = {.x=8, .y=4, .z=4};
__.local.coord = {.x=0, .y=2, .z=0};

__.block.shape = {.x=66, .y=130, .z=130};
__.block.coord = {.x=0, .y=256, .z=0};
__.block.elems = 1115400;

=======================
__.world.size = 128;
__.world.rank = 9;

__.nodes.shape = {.x=512, .y=512, .z=512, .t=20};
__.nodes.bound = {.x=1.000000, .y=1.000000, .z=1.000000, .t=0.010000};
__.nodes.steps = {.x=0.001953, .y=0.001953, .z=0.001953, .t=0.000500};

__.param.period = {.x=1, .y=0, .z=0};
__.param.a = {.x=6.283185, .y=3.141593, .z=3.141593, .t=7.695299};
__.param.b = {.x=0.000000, .y=0.000000, .z=0.000000, .t=7.853982};

__.local.rank = 9;
__.local.shape = {.x=8, .y=4, .z=4};
__.local.coord = {.x=0, .y=2, .z=1};

__.block.shape = {.x=66, .y=130, .z=130};
__.block.coord = {.x=0, .y=256, .z=128};
__.block.elems = 1115400;

=======================
__.world.size = 128;
__.world.rank = 10;

__.nodes.shape = {.x=512, .y=512, .z=512, .t=20};
__.nodes.bound = {.x=1.000000, .y=1.000000, .z=1.000000, .t=0.010000};
__.nodes.steps = {.x=0.001953, .y=0.001953, .z=0.001953, .t=0.000500};

__.param.period = {.x=1, .y=0, .z=0};
__.param.a = {.x=6.283185, .y=3.141593, .z=3.141593, .t=7.695299};
__.param.b = {.x=0.000000, .y=0.000000, .z=0.000000, .t=7.853982};

__.local.rank = 10;
__.local.shape = {.x=8, .y=4, .z=4};
__.local.coord = {.x=0, .y=2, .z=2};

__.block.shape = {.x=66, .y=130, .z=130};
__.block.coord = {.x=0, .y=256, .z=256};
__.block.elems = 1115400;

=======================
__.world.size = 128;
__.world.rank = 11;

__.nodes.shape = {.x=512, .y=512, .z=512, .t=20};
__.nodes.bound = {.x=1.000000, .y=1.000000, .z=1.000000, .t=0.010000};
__.nodes.steps = {.x=0.001953, .y=0.001953, .z=0.001953, .t=0.000500};

__.param.period = {.x=1, .y=0, .z=0};
__.param.a = {.x=6.283185, .y=3.141593, .z=3.141593, .t=7.695299};
__.param.b = {.x=0.000000, .y=0.000000, .z=0.000000, .t=7.853982};

__.local.rank = 11;
__.local.shape = {.x=8, .y=4, .z=4};
__.local.coord = {.x=0, .y=2, .z=3};

__.block.shape = {.x=66, .y=130, .z=130};
__.block.coord = {.x=0, .y=256, .z=384};
__.block.elems = 1115400;

=======================
__.world.size = 128;
__.world.rank = 12;

__.nodes.shape = {.x=512, .y=512, .z=512, .t=20};
__.nodes.bound = {.x=1.000000, .y=1.000000, .z=1.000000, .t=0.010000};
__.nodes.steps = {.x=0.001953, .y=0.001953, .z=0.001953, .t=0.000500};

__.param.period = {.x=1, .y=0, .z=0};
__.param.a = {.x=6.283185, .y=3.141593, .z=3.141593, .t=7.695299};
__.param.b = {.x=0.000000, .y=0.000000, .z=0.000000, .t=7.853982};

__.local.rank = 12;
__.local.shape = {.x=8, .y=4, .z=4};
__.local.coord = {.x=0, .y=3, .z=0};

__.block.shape = {.x=66, .y=130, .z=130};
__.block.coord = {.x=0, .y=384, .z=0};
__.block.elems = 1115400;

=======================
__.world.size = 128;
__.world.rank = 13;

__.nodes.shape = {.x=512, .y=512, .z=512, .t=20};
__.nodes.bound = {.x=1.000000, .y=1.000000, .z=1.000000, .t=0.010000};
__.nodes.steps = {.x=0.001953, .y=0.001953, .z=0.001953, .t=0.000500};

__.param.period = {.x=1, .y=0, .z=0};
__.param.a = {.x=6.283185, .y=3.141593, .z=3.141593, .t=7.695299};
__.param.b = {.x=0.000000, .y=0.000000, .z=0.000000, .t=7.853982};

__.local.rank = 13;
__.local.shape = {.x=8, .y=4, .z=4};
__.local.coord = {.x=0, .y=3, .z=1};

__.block.shape = {.x=66, .y=130, .z=130};
__.block.coord = {.x=0, .y=384, .z=128};
__.block.elems = 1115400;

=======================
__.world.size = 128;
__.world.rank = 14;

__.nodes.shape = {.x=512, .y=512, .z=512, .t=20};
__.nodes.bound = {.x=1.000000, .y=1.000000, .z=1.000000, .t=0.010000};
__.nodes.steps = {.x=0.001953, .y=0.001953, .z=0.001953, .t=0.000500};

__.param.period = {.x=1, .y=0, .z=0};
__.param.a = {.x=6.283185, .y=3.141593, .z=3.141593, .t=7.695299};
__.param.b = {.x=0.000000, .y=0.000000, .z=0.000000, .t=7.853982};

__.local.rank = 14;
__.local.shape = {.x=8, .y=4, .z=4};
__.local.coord = {.x=0, .y=3, .z=2};

__.block.shape = {.x=66, .y=130, .z=130};
__.block.coord = {.x=0, .y=384, .z=256};
__.block.elems = 1115400;

=======================
__.world.size = 128;
__.world.rank = 15;

__.nodes.shape = {.x=512, .y=512, .z=512, .t=20};
__.nodes.bound = {.x=1.000000, .y=1.000000, .z=1.000000, .t=0.010000};
__.nodes.steps = {.x=0.001953, .y=0.001953, .z=0.001953, .t=0.000500};

__.param.period = {.x=1, .y=0, .z=0};
__.param.a = {.x=6.283185, .y=3.141593, .z=3.141593, .t=7.695299};
__.param.b = {.x=0.000000, .y=0.000000, .z=0.000000, .t=7.853982};

__.local.rank = 15;
__.local.shape = {.x=8, .y=4, .z=4};
__.local.coord = {.x=0, .y=3, .z=3};

__.block.shape = {.x=66, .y=130, .z=130};
__.block.coord = {.x=0, .y=384, .z=384};
__.block.elems = 1115400;

=======================
__.world.size = 128;
__.world.rank = 16;

__.nodes.shape = {.x=512, .y=512, .z=512, .t=20};
__.nodes.bound = {.x=1.000000, .y=1.000000, .z=1.000000, .t=0.010000};
__.nodes.steps = {.x=0.001953, .y=0.001953, .z=0.001953, .t=0.000500};

__.param.period = {.x=1, .y=0, .z=0};
__.param.a = {.x=6.283185, .y=3.141593, .z=3.141593, .t=7.695299};
__.param.b = {.x=0.000000, .y=0.000000, .z=0.000000, .t=7.853982};

__.local.rank = 16;
__.local.shape = {.x=8, .y=4, .z=4};
__.local.coord = {.x=1, .y=0, .z=0};

__.block.shape = {.x=66, .y=130, .z=130};
__.block.coord = {.x=64, .y=0, .z=0};
__.block.elems = 1115400;

=======================
__.world.size = 128;
__.world.rank = 17;

__.nodes.shape = {.x=512, .y=512, .z=512, .t=20};
__.nodes.bound = {.x=1.000000, .y=1.000000, .z=1.000000, .t=0.010000};
__.nodes.steps = {.x=0.001953, .y=0.001953, .z=0.001953, .t=0.000500};

__.param.period = {.x=1, .y=0, .z=0};
__.param.a = {.x=6.283185, .y=3.141593, .z=3.141593, .t=7.695299};
__.param.b = {.x=0.000000, .y=0.000000, .z=0.000000, .t=7.853982};

__.local.rank = 17;
__.local.shape = {.x=8, .y=4, .z=4};
__.local.coord = {.x=1, .y=0, .z=1};

__.block.shape = {.x=66, .y=130, .z=130};
__.block.coord = {.x=64, .y=0, .z=128};
__.block.elems = 1115400;

=======================
__.world.size = 128;
__.world.rank = 18;

__.nodes.shape = {.x=512, .y=512, .z=512, .t=20};
__.nodes.bound = {.x=1.000000, .y=1.000000, .z=1.000000, .t=0.010000};
__.nodes.steps = {.x=0.001953, .y=0.001953, .z=0.001953, .t=0.000500};

__.param.period = {.x=1, .y=0, .z=0};
__.param.a = {.x=6.283185, .y=3.141593, .z=3.141593, .t=7.695299};
__.param.b = {.x=0.000000, .y=0.000000, .z=0.000000, .t=7.853982};

__.local.rank = 18;
__.local.shape = {.x=8, .y=4, .z=4};
__.local.coord = {.x=1, .y=0, .z=2};

__.block.shape = {.x=66, .y=130, .z=130};
__.block.coord = {.x=64, .y=0, .z=256};
__.block.elems = 1115400;

=======================
__.world.size = 128;
__.world.rank = 19;

__.nodes.shape = {.x=512, .y=512, .z=512, .t=20};
__.nodes.bound = {.x=1.000000, .y=1.000000, .z=1.000000, .t=0.010000};
__.nodes.steps = {.x=0.001953, .y=0.001953, .z=0.001953, .t=0.000500};

__.param.period = {.x=1, .y=0, .z=0};
__.param.a = {.x=6.283185, .y=3.141593, .z=3.141593, .t=7.695299};
__.param.b = {.x=0.000000, .y=0.000000, .z=0.000000, .t=7.853982};

__.local.rank = 19;
__.local.shape = {.x=8, .y=4, .z=4};
__.local.coord = {.x=1, .y=0, .z=3};

__.block.shape = {.x=66, .y=130, .z=130};
__.block.coord = {.x=64, .y=0, .z=384};
__.block.elems = 1115400;

=======================
__.world.size = 128;
__.world.rank = 20;

__.nodes.shape = {.x=512, .y=512, .z=512, .t=20};
__.nodes.bound = {.x=1.000000, .y=1.000000, .z=1.000000, .t=0.010000};
__.nodes.steps = {.x=0.001953, .y=0.001953, .z=0.001953, .t=0.000500};

__.param.period = {.x=1, .y=0, .z=0};
__.param.a = {.x=6.283185, .y=3.141593, .z=3.141593, .t=7.695299};
__.param.b = {.x=0.000000, .y=0.000000, .z=0.000000, .t=7.853982};

__.local.rank = 20;
__.local.shape = {.x=8, .y=4, .z=4};
__.local.coord = {.x=1, .y=1, .z=0};

__.block.shape = {.x=66, .y=130, .z=130};
__.block.coord = {.x=64, .y=128, .z=0};
__.block.elems = 1115400;

=======================
__.world.size = 128;
__.world.rank = 21;

__.nodes.shape = {.x=512, .y=512, .z=512, .t=20};
__.nodes.bound = {.x=1.000000, .y=1.000000, .z=1.000000, .t=0.010000};
__.nodes.steps = {.x=0.001953, .y=0.001953, .z=0.001953, .t=0.000500};

__.param.period = {.x=1, .y=0, .z=0};
__.param.a = {.x=6.283185, .y=3.141593, .z=3.141593, .t=7.695299};
__.param.b = {.x=0.000000, .y=0.000000, .z=0.000000, .t=7.853982};

__.local.rank = 21;
__.local.shape = {.x=8, .y=4, .z=4};
__.local.coord = {.x=1, .y=1, .z=1};

__.block.shape = {.x=66, .y=130, .z=130};
__.block.coord = {.x=64, .y=128, .z=128};
__.block.elems = 1115400;

=======================
__.world.size = 128;
__.world.rank = 22;

__.nodes.shape = {.x=512, .y=512, .z=512, .t=20};
__.nodes.bound = {.x=1.000000, .y=1.000000, .z=1.000000, .t=0.010000};
__.nodes.steps = {.x=0.001953, .y=0.001953, .z=0.001953, .t=0.000500};

__.param.period = {.x=1, .y=0, .z=0};
__.param.a = {.x=6.283185, .y=3.141593, .z=3.141593, .t=7.695299};
__.param.b = {.x=0.000000, .y=0.000000, .z=0.000000, .t=7.853982};

__.local.rank = 22;
__.local.shape = {.x=8, .y=4, .z=4};
__.local.coord = {.x=1, .y=1, .z=2};

__.block.shape = {.x=66, .y=130, .z=130};
__.block.coord = {.x=64, .y=128, .z=256};
__.block.elems = 1115400;

=======================
__.world.size = 128;
__.world.rank = 23;

__.nodes.shape = {.x=512, .y=512, .z=512, .t=20};
__.nodes.bound = {.x=1.000000, .y=1.000000, .z=1.000000, .t=0.010000};
__.nodes.steps = {.x=0.001953, .y=0.001953, .z=0.001953, .t=0.000500};

__.param.period = {.x=1, .y=0, .z=0};
__.param.a = {.x=6.283185, .y=3.141593, .z=3.141593, .t=7.695299};
__.param.b = {.x=0.000000, .y=0.000000, .z=0.000000, .t=7.853982};

__.local.rank = 23;
__.local.shape = {.x=8, .y=4, .z=4};
__.local.coord = {.x=1, .y=1, .z=3};

__.block.shape = {.x=66, .y=130, .z=130};
__.block.coord = {.x=64, .y=128, .z=384};
__.block.elems = 1115400;

=======================
__.world.size = 128;
__.world.rank = 24;

__.nodes.shape = {.x=512, .y=512, .z=512, .t=20};
__.nodes.bound = {.x=1.000000, .y=1.000000, .z=1.000000, .t=0.010000};
__.nodes.steps = {.x=0.001953, .y=0.001953, .z=0.001953, .t=0.000500};

__.param.period = {.x=1, .y=0, .z=0};
__.param.a = {.x=6.283185, .y=3.141593, .z=3.141593, .t=7.695299};
__.param.b = {.x=0.000000, .y=0.000000, .z=0.000000, .t=7.853982};

__.local.rank = 24;
__.local.shape = {.x=8, .y=4, .z=4};
__.local.coord = {.x=1, .y=2, .z=0};

__.block.shape = {.x=66, .y=130, .z=130};
__.block.coord = {.x=64, .y=256, .z=0};
__.block.elems = 1115400;

=======================
__.world.size = 128;
__.world.rank = 25;

__.nodes.shape = {.x=512, .y=512, .z=512, .t=20};
__.nodes.bound = {.x=1.000000, .y=1.000000, .z=1.000000, .t=0.010000};
__.nodes.steps = {.x=0.001953, .y=0.001953, .z=0.001953, .t=0.000500};

__.param.period = {.x=1, .y=0, .z=0};
__.param.a = {.x=6.283185, .y=3.141593, .z=3.141593, .t=7.695299};
__.param.b = {.x=0.000000, .y=0.000000, .z=0.000000, .t=7.853982};

__.local.rank = 25;
__.local.shape = {.x=8, .y=4, .z=4};
__.local.coord = {.x=1, .y=2, .z=1};

__.block.shape = {.x=66, .y=130, .z=130};
__.block.coord = {.x=64, .y=256, .z=128};
__.block.elems = 1115400;
=======================

=======================
__.world.size = 128;
__.world.size = 128;
__.world.rank = 32;
__.world.rank = 26;


__.nodes.shape = {.x=512, .y=512, .z=512, .t=20};
__.nodes.shape = {.x=512, .y=512, .z=512, .t=20};
__.nodes.bound = {.x=1.000000, .y=1.000000, .z=1.000000, .t=0.010000};
__.nodes.bound = {.x=1.000000, .y=1.000000, .z=1.000000, .t=0.010000};
__.nodes.steps = {.x=0.001953, .y=0.001953, .z=0.001953, .t=0.000500};
__.nodes.steps = {.x=0.001953, .y=0.001953, .z=0.001953, .t=0.000500};


__.param.period = {.x=1, .y=0, .z=0};
__.param.period = {.x=1, .y=0, .z=0};
__.param.a = {.x=6.283185, .y=3.141593, .z=3.141593, .t=7.695299};
__.param.a = {.x=6.283185, .y=3.141593, .z=3.141593, .t=7.695299};
__.param.b = {.x=0.000000, .y=0.000000, .z=0.000000, .t=7.853982};
__.param.b = {.x=0.000000, .y=0.000000, .z=0.000000, .t=7.853982};


__.local.rank = 32;
__.local.rank = 26;
__.local.shape = {.x=8, .y=4, .z=4};
__.local.shape = {.x=8, .y=4, .z=4};
__.local.coord = {.x=2, .y=0, .z=0};
__.local.coord = {.x=1, .y=2, .z=2};


__.block.shape = {.x=66, .y=130, .z=130};
__.block.shape = {.x=66, .y=130, .z=130};
__.block.coord = {.x=128, .y=0, .z=0};
__.block.coord = {.x=64, .y=256, .z=256};
__.block.elems = 1115400;
__.block.elems = 1115400;


=======================
__.world.size = 128;
__.world.rank = 33;

__.nodes.shape = {.x=512, .y=512, .z=512, .t=20};
__.nodes.bound = {.x=1.000000, .y=1.000000, .z=1.000000, .t=0.010000};
__.nodes.steps = {.x=0.001953, .y=0.001953, .z=0.001953, .t=0.000500};

__.param.period = {.x=1, .y=0, .z=0};
__.param.a = {.x=6.283185, .y=3.141593, .z=3.141593, .t=7.695299};
__.param.b = {.x=0.000000, .y=0.000000, .z=0.000000, .t=7.853982};

__.local.rank = 33;
__.local.shape = {.x=8, .y=4, .z=4};
__.local.coord = {.x=2, .y=0, .z=1};

__.block.shape = {.x=66, .y=130, .z=130};
__.block.coord = {.x=128, .y=0, .z=128};
__.block.elems = 1115400;

=======================
__.world.size = 128;
__.world.rank = 34;

__.nodes.shape = {.x=512, .y=512, .z=512, .t=20};
__.nodes.bound = {.x=1.000000, .y=1.000000, .z=1.000000, .t=0.010000};
__.nodes.steps = {.x=0.001953, .y=0.001953, .z=0.001953, .t=0.000500};

__.param.period = {.x=1, .y=0, .z=0};
__.param.a = {.x=6.283185, .y=3.141593, .z=3.141593, .t=7.695299};
__.param.b = {.x=0.000000, .y=0.000000, .z=0.000000, .t=7.853982};

__.local.rank = 34;
__.local.shape = {.x=8, .y=4, .z=4};
__.local.coord = {.x=2, .y=0, .z=2};

__.block.shape = {.x=66, .y=130, .z=130};
__.block.coord = {.x=128, .y=0, .z=256};
__.block.elems = 1115400;

=======================
__.world.size = 128;
__.world.rank = 35;

__.nodes.shape = {.x=512, .y=512, .z=512, .t=20};
__.nodes.bound = {.x=1.000000, .y=1.000000, .z=1.000000, .t=0.010000};
__.nodes.steps = {.x=0.001953, .y=0.001953, .z=0.001953, .t=0.000500};

__.param.period = {.x=1, .y=0, .z=0};
__.param.a = {.x=6.283185, .y=3.141593, .z=3.141593, .t=7.695299};
__.param.b = {.x=0.000000, .y=0.000000, .z=0.000000, .t=7.853982};

__.local.rank = 35;
__.local.shape = {.x=8, .y=4, .z=4};
__.local.coord = {.x=2, .y=0, .z=3};

__.block.shape = {.x=66, .y=130, .z=130};
__.block.coord = {.x=128, .y=0, .z=384};
__.block.elems = 1115400;

=======================
__.world.size = 128;
__.world.rank = 36;

__.nodes.shape = {.x=512, .y=512, .z=512, .t=20};
__.nodes.bound = {.x=1.000000, .y=1.000000, .z=1.000000, .t=0.010000};
__.nodes.steps = {.x=0.001953, .y=0.001953, .z=0.001953, .t=0.000500};

__.param.period = {.x=1, .y=0, .z=0};
__.param.a = {.x=6.283185, .y=3.141593, .z=3.141593, .t=7.695299};
__.param.b = {.x=0.000000, .y=0.000000, .z=0.000000, .t=7.853982};

__.local.rank = 36;
__.local.shape = {.x=8, .y=4, .z=4};
__.local.coord = {.x=2, .y=1, .z=0};

__.block.shape = {.x=66, .y=130, .z=130};
__.block.coord = {.x=128, .y=128, .z=0};
__.block.elems = 1115400;

=======================
__.world.size = 128;
__.world.rank = 37;

__.nodes.shape = {.x=512, .y=512, .z=512, .t=20};
__.nodes.bound = {.x=1.000000, .y=1.000000, .z=1.000000, .t=0.010000};
__.nodes.steps = {.x=0.001953, .y=0.001953, .z=0.001953, .t=0.000500};

__.param.period = {.x=1, .y=0, .z=0};
__.param.a = {.x=6.283185, .y=3.141593, .z=3.141593, .t=7.695299};
__.param.b = {.x=0.000000, .y=0.000000, .z=0.000000, .t=7.853982};

__.local.rank = 37;
__.local.shape = {.x=8, .y=4, .z=4};
__.local.coord = {.x=2, .y=1, .z=1};

__.block.shape = {.x=66, .y=130, .z=130};
__.block.coord = {.x=128, .y=128, .z=128};
__.block.elems = 1115400;

=======================
__.world.size = 128;
__.world.rank = 38;

__.nodes.shape = {.x=512, .y=512, .z=512, .t=20};
__.nodes.bound = {.x=1.000000, .y=1.000000, .z=1.000000, .t=0.010000};
__.nodes.steps = {.x=0.001953, .y=0.001953, .z=0.001953, .t=0.000500};

__.param.period = {.x=1, .y=0, .z=0};
__.param.a = {.x=6.283185, .y=3.141593, .z=3.141593, .t=7.695299};
__.param.b = {.x=0.000000, .y=0.000000, .z=0.000000, .t=7.853982};

__.local.rank = 38;
__.local.shape = {.x=8, .y=4, .z=4};
__.local.coord = {.x=2, .y=1, .z=2};

__.block.shape = {.x=66, .y=130, .z=130};
__.block.coord = {.x=128, .y=128, .z=256};
__.block.elems = 1115400;

=======================
__.world.size = 128;
__.world.rank = 39;

__.nodes.shape = {.x=512, .y=512, .z=512, .t=20};
__.nodes.bound = {.x=1.000000, .y=1.000000, .z=1.000000, .t=0.010000};
__.nodes.steps = {.x=0.001953, .y=0.001953, .z=0.001953, .t=0.000500};

__.param.period = {.x=1, .y=0, .z=0};
__.param.a = {.x=6.283185, .y=3.141593, .z=3.141593, .t=7.695299};
__.param.b = {.x=0.000000, .y=0.000000, .z=0.000000, .t=7.853982};

__.local.rank = 39;
__.local.shape = {.x=8, .y=4, .z=4};
__.local.coord = {.x=2, .y=1, .z=3};

__.block.shape = {.x=66, .y=130, .z=130};
__.block.coord = {.x=128, .y=128, .z=384};
__.block.elems = 1115400;

=======================
__.world.size = 128;
__.world.rank = 40;

__.nodes.shape = {.x=512, .y=512, .z=512, .t=20};
__.nodes.bound = {.x=1.000000, .y=1.000000, .z=1.000000, .t=0.010000};
__.nodes.steps = {.x=0.001953, .y=0.001953, .z=0.001953, .t=0.000500};

__.param.period = {.x=1, .y=0, .z=0};
__.param.a = {.x=6.283185, .y=3.141593, .z=3.141593, .t=7.695299};
__.param.b = {.x=0.000000, .y=0.000000, .z=0.000000, .t=7.853982};

__.local.rank = 40;
__.local.shape = {.x=8, .y=4, .z=4};
__.local.coord = {.x=2, .y=2, .z=0};

__.block.shape = {.x=66, .y=130, .z=130};
__.block.coord = {.x=128, .y=256, .z=0};
__.block.elems = 1115400;

=======================
__.world.size = 128;
__.world.rank = 41;

__.nodes.shape = {.x=512, .y=512, .z=512, .t=20};
__.nodes.bound = {.x=1.000000, .y=1.000000, .z=1.000000, .t=0.010000};
__.nodes.steps = {.x=0.001953, .y=0.001953, .z=0.001953, .t=0.000500};

__.param.period = {.x=1, .y=0, .z=0};
__.param.a = {.x=6.283185, .y=3.141593, .z=3.141593, .t=7.695299};
__.param.b = {.x=0.000000, .y=0.000000, .z=0.000000, .t=7.853982};

__.local.rank = 41;
__.local.shape = {.x=8, .y=4, .z=4};
__.local.coord = {.x=2, .y=2, .z=1};

__.block.shape = {.x=66, .y=130, .z=130};
__.block.coord = {.x=128, .y=256, .z=128};
__.block.elems = 1115400;

=======================
__.world.size = 128;
__.world.rank = 42;

__.nodes.shape = {.x=512, .y=512, .z=512, .t=20};
__.nodes.bound = {.x=1.000000, .y=1.000000, .z=1.000000, .t=0.010000};
__.nodes.steps = {.x=0.001953, .y=0.001953, .z=0.001953, .t=0.000500};

__.param.period = {.x=1, .y=0, .z=0};
__.param.a = {.x=6.283185, .y=3.141593, .z=3.141593, .t=7.695299};
__.param.b = {.x=0.000000, .y=0.000000, .z=0.000000, .t=7.853982};

__.local.rank = 42;
__.local.shape = {.x=8, .y=4, .z=4};
__.local.coord = {.x=2, .y=2, .z=2};

__.block.shape = {.x=66, .y=130, .z=130};
__.block.coord = {.x=128, .y=256, .z=256};
__.block.elems = 1115400;

=======================
__.world.size = 128;
__.world.rank = 43;

__.nodes.shape = {.x=512, .y=512, .z=512, .t=20};
__.nodes.bound = {.x=1.000000, .y=1.000000, .z=1.000000, .t=0.010000};
__.nodes.steps = {.x=0.001953, .y=0.001953, .z=0.001953, .t=0.000500};

__.param.period = {.x=1, .y=0, .z=0};
__.param.a = {.x=6.283185, .y=3.141593, .z=3.141593, .t=7.695299};
__.param.b = {.x=0.000000, .y=0.000000, .z=0.000000, .t=7.853982};

__.local.rank = 43;
__.local.shape = {.x=8, .y=4, .z=4};
__.local.coord = {.x=2, .y=2, .z=3};

__.block.shape = {.x=66, .y=130, .z=130};
__.block.coord = {.x=128, .y=256, .z=384};
__.block.elems = 1115400;

=======================
__.world.size = 128;
__.world.rank = 44;

__.nodes.shape = {.x=512, .y=512, .z=512, .t=20};
__.nodes.bound = {.x=1.000000, .y=1.000000, .z=1.000000, .t=0.010000};
__.nodes.steps = {.x=0.001953, .y=0.001953, .z=0.001953, .t=0.000500};

__.param.period = {.x=1, .y=0, .z=0};
__.param.a = {.x=6.283185, .y=3.141593, .z=3.141593, .t=7.695299};
__.param.b = {.x=0.000000, .y=0.000000, .z=0.000000, .t=7.853982};

__.local.rank = 44;
__.local.shape = {.x=8, .y=4, .z=4};
__.local.coord = {.x=2, .y=3, .z=0};

__.block.shape = {.x=66, .y=130, .z=130};
__.block.coord = {.x=128, .y=384, .z=0};
__.block.elems = 1115400;

=======================
__.world.size = 128;
__.world.rank = 45;

__.nodes.shape = {.x=512, .y=512, .z=512, .t=20};
__.nodes.bound = {.x=1.000000, .y=1.000000, .z=1.000000, .t=0.010000};
__.nodes.steps = {.x=0.001953, .y=0.001953, .z=0.001953, .t=0.000500};

__.param.period = {.x=1, .y=0, .z=0};
__.param.a = {.x=6.283185, .y=3.141593, .z=3.141593, .t=7.695299};
__.param.b = {.x=0.000000, .y=0.000000, .z=0.000000, .t=7.853982};

__.local.rank = 45;
__.local.shape = {.x=8, .y=4, .z=4};
__.local.coord = {.x=2, .y=3, .z=1};

__.block.shape = {.x=66, .y=130, .z=130};
__.block.coord = {.x=128, .y=384, .z=128};
__.block.elems = 1115400;

=======================
__.world.size = 128;
__.world.rank = 46;

__.nodes.shape = {.x=512, .y=512, .z=512, .t=20};
__.nodes.bound = {.x=1.000000, .y=1.000000, .z=1.000000, .t=0.010000};
__.nodes.steps = {.x=0.001953, .y=0.001953, .z=0.001953, .t=0.000500};

__.param.period = {.x=1, .y=0, .z=0};
__.param.a = {.x=6.283185, .y=3.141593, .z=3.141593, .t=7.695299};
__.param.b = {.x=0.000000, .y=0.000000, .z=0.000000, .t=7.853982};

__.local.rank = 46;
__.local.shape = {.x=8, .y=4, .z=4};
__.local.coord = {.x=2, .y=3, .z=2};

__.block.shape = {.x=66, .y=130, .z=130};
__.block.coord = {.x=128, .y=384, .z=256};
__.block.elems = 1115400;

=======================
__.world.size = 128;
__.world.rank = 47;

__.nodes.shape = {.x=512, .y=512, .z=512, .t=20};
__.nodes.bound = {.x=1.000000, .y=1.000000, .z=1.000000, .t=0.010000};
__.nodes.steps = {.x=0.001953, .y=0.001953, .z=0.001953, .t=0.000500};

__.param.period = {.x=1, .y=0, .z=0};
__.param.a = {.x=6.283185, .y=3.141593, .z=3.141593, .t=7.695299};
__.param.b = {.x=0.000000, .y=0.000000, .z=0.000000, .t=7.853982};

__.local.rank = 47;
__.local.shape = {.x=8, .y=4, .z=4};
__.local.coord = {.x=2, .y=3, .z=3};

__.block.shape = {.x=66, .y=130, .z=130};
__.block.coord = {.x=128, .y=384, .z=384};
__.block.elems = 1115400;

=======================
__.world.size = 128;
__.world.rank = 48;

__.nodes.shape = {.x=512, .y=512, .z=512, .t=20};
__.nodes.bound = {.x=1.000000, .y=1.000000, .z=1.000000, .t=0.010000};
__.nodes.steps = {.x=0.001953, .y=0.001953, .z=0.001953, .t=0.000500};

__.param.period = {.x=1, .y=0, .z=0};
__.param.a = {.x=6.283185, .y=3.141593, .z=3.141593, .t=7.695299};
__.param.b = {.x=0.000000, .y=0.000000, .z=0.000000, .t=7.853982};

__.local.rank = 48;
__.local.shape = {.x=8, .y=4, .z=4};
__.local.coord = {.x=3, .y=0, .z=0};

__.block.shape = {.x=66, .y=130, .z=130};
__.block.coord = {.x=192, .y=0, .z=0};
__.block.elems = 1115400;

=======================
__.world.size = 128;
__.world.rank = 49;

__.nodes.shape = {.x=512, .y=512, .z=512, .t=20};
__.nodes.bound = {.x=1.000000, .y=1.000000, .z=1.000000, .t=0.010000};
__.nodes.steps = {.x=0.001953, .y=0.001953, .z=0.001953, .t=0.000500};

__.param.period = {.x=1, .y=0, .z=0};
__.param.a = {.x=6.283185, .y=3.141593, .z=3.141593, .t=7.695299};
__.param.b = {.x=0.000000, .y=0.000000, .z=0.000000, .t=7.853982};

__.local.rank = 49;
__.local.shape = {.x=8, .y=4, .z=4};
__.local.coord = {.x=3, .y=0, .z=1};

__.block.shape = {.x=66, .y=130, .z=130};
__.block.coord = {.x=192, .y=0, .z=128};
__.block.elems = 1115400;

=======================
__.world.size = 128;
__.world.rank = 50;

__.nodes.shape = {.x=512, .y=512, .z=512, .t=20};
__.nodes.bound = {.x=1.000000, .y=1.000000, .z=1.000000, .t=0.010000};
__.nodes.steps = {.x=0.001953, .y=0.001953, .z=0.001953, .t=0.000500};

__.param.period = {.x=1, .y=0, .z=0};
__.param.a = {.x=6.283185, .y=3.141593, .z=3.141593, .t=7.695299};
__.param.b = {.x=0.000000, .y=0.000000, .z=0.000000, .t=7.853982};

__.local.rank = 50;
__.local.shape = {.x=8, .y=4, .z=4};
__.local.coord = {.x=3, .y=0, .z=2};

__.block.shape = {.x=66, .y=130, .z=130};
__.block.coord = {.x=192, .y=0, .z=256};
__.block.elems = 1115400;

=======================
__.world.size = 128;
__.world.rank = 51;
=======================

__.world.size = 128;
__.nodes.shape = {.x=512, .y=512, .z=512, .t=20};
__.world.rank = 27;
__.nodes.bound = {.x=1.000000, .y=1.000000, .z=1.000000, .t=0.010000};

__.nodes.steps = {.x=0.001953, .y=0.001953, .z=0.001953, .t=0.000500};
__.nodes.shape = {.x=512, .y=512, .z=512, .t=20};

__.nodes.bound = {.x=1.000000, .y=1.000000, .z=1.000000, .t=0.010000};
__.param.period = {.x=1, .y=0, .z=0};
__.nodes.steps = {.x=0.001953, .y=0.001953, .z=0.001953, .t=0.000500};
__.param.a = {.x=6.283185, .y=3.141593, .z=3.141593, .t=7.695299};

__.param.b = {.x=0.000000, .y=0.000000, .z=0.000000, .t=7.853982};
__.param.period = {.x=1, .y=0, .z=0};

__.param.a = {.x=6.283185, .y=3.141593, .z=3.141593, .t=7.695299};
__.local.rank = 51;
__.param.b = {.x=0.000000, .y=0.000000, .z=0.000000, .t=7.853982};
__.local.shape = {.x=8, .y=4, .z=4};

__.local.coord = {.x=3, .y=0, .z=3};
__.local.rank = 27;

__.local.shape = {.x=8, .y=4, .z=4};
__.local.coord = {.x=1, .y=2, .z=3};

__.block.shape = {.x=66, .y=130, .z=130};
__.block.shape = {.x=66, .y=130, .z=130};
__.block.coord = {.x=192, .y=0, .z=384};
__.block.coord = {.x=64, .y=256, .z=384};
__.block.elems = 1115400;
__.block.elems = 1115400;


=======================
=======================
__.world.size = 128;
__.world.size = 128;
__.world.rank = 52;
__.world.rank = 28;


__.nodes.shape = {.x=512, .y=512, .z=512, .t=20};
__.nodes.shape = {.x=512, .y=512, .z=512, .t=20};
__.nodes.bound = {.x=1.000000, .y=1.000000, .z=1.000000, .t=0.010000};
__.nodes.bound = {.x=1.000000, .y=1.000000, .z=1.000000, .t=0.010000};
__.nodes.steps = {.x=0.001953, .y=0.001953, .z=0.001953, .t=0.000500};
__.nodes.steps = {.x=0.001953, .y=0.001953, .z=0.001953, .t=0.000500};


__.param.period = {.x=1, .y=0, .z=0};
__.param.period = {.x=1, .y=0, .z=0};
__.param.a = {.x=6.283185, .y=3.141593, .z=3.141593, .t=7.695299};
__.param.a = {.x=6.283185, .y=3.141593, .z=3.141593, .t=7.695299};
__.param.b = {.x=0.000000, .y=0.000000, .z=0.000000, .t=7.853982};
__.param.b = {.x=0.000000, .y=0.000000, .z=0.000000, .t=7.853982};


__.local.rank = 52;
__.local.rank = 28;
__.local.shape = {.x=8, .y=4, .z=4};
__.local.shape = {.x=8, .y=4, .z=4};
__.local.coord = {.x=3, .y=1, .z=0};
__.local.coord = {.x=1, .y=3, .z=0};


__.block.shape = {.x=66, .y=130, .z=130};
__.block.shape = {.x=66, .y=130, .z=130};
__.block.coord = {.x=192, .y=128, .z=0};
__.block.coord = {.x=64, .y=384, .z=0};
__.block.elems = 1115400;
__.block.elems = 1115400;


=======================
=======================
__.world.size = 128;
__.world.size = 128;
__.world.rank = 53;
__.world.rank = 29;


__.nodes.shape = {.x=512, .y=512, .z=512, .t=20};
__.nodes.shape = {.x=512, .y=512, .z=512, .t=20};
__.nodes.bound = {.x=1.000000, .y=1.000000, .z=1.000000, .t=0.010000};
__.nodes.bound = {.x=1.000000, .y=1.000000, .z=1.000000, .t=0.010000};
__.nodes.steps = {.x=0.001953, .y=0.001953, .z=0.001953, .t=0.000500};
__.nodes.steps = {.x=0.001953, .y=0.001953, .z=0.001953, .t=0.000500};


__.param.period = {.x=1, .y=0, .z=0};
__.param.period = {.x=1, .y=0, .z=0};
__.param.a = {.x=6.283185, .y=3.141593, .z=3.141593, .t=7.695299};
__.param.b = {.x=0.000000, .y=0.000000, .z=0.000000, .t=7.853982};

__.param.a = {.x=6.283185, .y=3.141593, .z=3.141593, .t=7.695299};
__.local.rank = 29;
__.param.b = {.x=0.000000, .y=0.000000, .z=0.000000, .t=7.853982};
__.local.shape = {.x=8, .y=4, .z=4};

__.local.coord = {.x=1, .y=3, .z=1};
__.local.rank = 53;

__.local.shape = {.x=8, .y=4, .z=4};
__.block.shape = {.x=66, .y=130, .z=130};
__.local.coord = {.x=3, .y=1, .z=1};
__.block.coord = {.x=64, .y=384, .z=128};

__.block.elems = 1115400;
__.block.shape = {.x=66, .y=130, .z=130};

__.block.coord = {.x=192, .y=128, .z=128};
=======================
__.block.elems = 1115400;
__.world.size = 128;

__.world.rank = 30;
=======================

__.world.size = 128;
__.nodes.shape = {.x=512, .y=512, .z=512, .t=20};
__.world.rank = 54;
__.nodes.bound = {.x=1.000000, .y=1.000000, .z=1.000000, .t=0.010000};

__.nodes.steps = {.x=0.001953, .y=0.001953, .z=0.001953, .t=0.000500};
__.nodes.shape = {.x=512, .y=512, .z=512, .t=20};

__.nodes.bound = {.x=1.000000, .y=1.000000, .z=1.000000, .t=0.010000};
__.param.period = {.x=1, .y=0, .z=0};
__.nodes.steps = {.x=0.001953, .y=0.001953, .z=0.001953, .t=0.000500};
__.param.a = {.x=6.283185, .y=3.141593, .z=3.141593, .t=7.695299};

__.param.b = {.x=0.000000, .y=0.000000, .z=0.000000, .t=7.853982};
__.param.period = {.x=1, .y=0, .z=0};

__.param.a = {.x=6.283185, .y=3.141593, .z=3.141593, .t=7.695299};
__.local.rank = 30;
__.param.b = {.x=0.000000, .y=0.000000, .z=0.000000, .t=7.853982};
__.local.shape = {.x=8, .y=4, .z=4};

__.local.coord = {.x=1, .y=3, .z=2};
__.local.rank = 54;

__.local.shape = {.x=8, .y=4, .z=4};
__.block.shape = {.x=66, .y=130, .z=130};
__.local.coord = {.x=3, .y=1, .z=2};
__.block.coord = {.x=64, .y=384, .z=256};

__.block.elems = 1115400;
__.block.shape = {.x=66, .y=130, .z=130};

__.block.coord = {.x=192, .y=128, .z=256};
=======================
__.block.elems = 1115400;
__.world.size = 128;

__.world.rank = 31;
=======================

__.world.size = 128;
__.nodes.shape = {.x=512, .y=512, .z=512, .t=20};
__.world.rank = 55;
__.nodes.bound = {.x=1.000000, .y=1.000000, .z=1.000000, .t=0.010000};

__.nodes.steps = {.x=0.001953, .y=0.001953, .z=0.001953, .t=0.000500};
__.nodes.shape = {.x=512, .y=512, .z=512, .t=20};

__.nodes.bound = {.x=1.000000, .y=1.000000, .z=1.000000, .t=0.010000};
__.param.period = {.x=1, .y=0, .z=0};
__.nodes.steps = {.x=0.001953, .y=0.001953, .z=0.001953, .t=0.000500};
__.param.a = {.x=6.283185, .y=3.141593, .z=3.141593, .t=7.695299};

__.param.b = {.x=0.000000, .y=0.000000, .z=0.000000, .t=7.853982};
__.param.period = {.x=1, .y=0, .z=0};

__.param.a = {.x=6.283185, .y=3.141593, .z=3.141593, .t=7.695299};
__.local.rank = 31;
__.param.b = {.x=0.000000, .y=0.000000, .z=0.000000, .t=7.853982};
__.local.shape = {.x=8, .y=4, .z=4};

__.local.coord = {.x=1, .y=3, .z=3};
__.local.rank = 55;

__.local.shape = {.x=8, .y=4, .z=4};
__.block.shape = {.x=66, .y=130, .z=130};
__.local.coord = {.x=3, .y=1, .z=3};
__.block.coord = {.x=64, .y=384, .z=384};

__.block.elems = 1115400;
__.block.shape = {.x=66, .y=130, .z=130};

__.block.coord = {.x=192, .y=128, .z=384};
__.block.elems = 1115400;

=======================
__.world.size = 128;
__.world.rank = 56;

__.nodes.shape = {.x=512, .y=512, .z=512, .t=20};
__.nodes.bound = {.x=1.000000, .y=1.000000, .z=1.000000, .t=0.010000};
__.nodes.steps = {.x=0.001953, .y=0.001953, .z=0.001953, .t=0.000500};

__.param.period = {.x=1, .y=0, .z=0};
__.param.a = {.x=6.283185, .y=3.141593, .z=3.141593, .t=7.695299};
__.param.b = {.x=0.000000, .y=0.000000, .z=0.000000, .t=7.853982};

__.local.rank = 56;
__.local.shape = {.x=8, .y=4, .z=4};
__.local.coord = {.x=3, .y=2, .z=0};

__.block.shape = {.x=66, .y=130, .z=130};
__.block.coord = {.x=192, .y=256, .z=0};
__.block.elems = 1115400;

=======================
__.world.size = 128;
__.world.rank = 57;

__.nodes.shape = {.x=512, .y=512, .z=512, .t=20};
__.nodes.bound = {.x=1.000000, .y=1.000000, .z=1.000000, .t=0.010000};
__.nodes.steps = {.x=0.001953, .y=0.001953, .z=0.001953, .t=0.000500};

__.param.period = {.x=1, .y=0, .z=0};
__.param.a = {.x=6.283185, .y=3.141593, .z=3.141593, .t=7.695299};
__.param.b = {.x=0.000000, .y=0.000000, .z=0.000000, .t=7.853982};

__.local.rank = 57;
__.local.shape = {.x=8, .y=4, .z=4};
__.local.coord = {.x=3, .y=2, .z=1};

__.block.shape = {.x=66, .y=130, .z=130};
__.block.coord = {.x=192, .y=256, .z=128};
__.block.elems = 1115400;

=======================
__.world.size = 128;
__.world.rank = 58;

__.nodes.shape = {.x=512, .y=512, .z=512, .t=20};
__.nodes.bound = {.x=1.000000, .y=1.000000, .z=1.000000, .t=0.010000};
__.nodes.steps = {.x=0.001953, .y=0.001953, .z=0.001953, .t=0.000500};

__.param.period = {.x=1, .y=0, .z=0};
__.param.a = {.x=6.283185, .y=3.141593, .z=3.141593, .t=7.695299};
__.param.b = {.x=0.000000, .y=0.000000, .z=0.000000, .t=7.853982};

__.local.rank = 58;
__.local.shape = {.x=8, .y=4, .z=4};
__.local.coord = {.x=3, .y=2, .z=2};

__.block.shape = {.x=66, .y=130, .z=130};
__.block.coord = {.x=192, .y=256, .z=256};
__.block.elems = 1115400;

=======================
__.world.size = 128;
__.world.rank = 59;

__.nodes.shape = {.x=512, .y=512, .z=512, .t=20};
__.nodes.bound = {.x=1.000000, .y=1.000000, .z=1.000000, .t=0.010000};
__.nodes.steps = {.x=0.001953, .y=0.001953, .z=0.001953, .t=0.000500};

__.param.period = {.x=1, .y=0, .z=0};
__.param.a = {.x=6.283185, .y=3.141593, .z=3.141593, .t=7.695299};
__.param.b = {.x=0.000000, .y=0.000000, .z=0.000000, .t=7.853982};

__.local.rank = 59;
__.local.shape = {.x=8, .y=4, .z=4};
__.local.coord = {.x=3, .y=2, .z=3};

__.block.shape = {.x=66, .y=130, .z=130};
__.block.coord = {.x=192, .y=256, .z=384};
__.block.elems = 1115400;

=======================
__.world.size = 128;
__.world.rank = 60;

__.nodes.shape = {.x=512, .y=512, .z=512, .t=20};
__.nodes.bound = {.x=1.000000, .y=1.000000, .z=1.000000, .t=0.010000};
__.nodes.steps = {.x=0.001953, .y=0.001953, .z=0.001953, .t=0.000500};

__.param.period = {.x=1, .y=0, .z=0};
__.param.a = {.x=6.283185, .y=3.141593, .z=3.141593, .t=7.695299};
__.param.b = {.x=0.000000, .y=0.000000, .z=0.000000, .t=7.853982};

__.local.rank = 60;
__.local.shape = {.x=8, .y=4, .z=4};
__.local.coord = {.x=3, .y=3, .z=0};

__.block.shape = {.x=66, .y=130, .z=130};
__.block.coord = {.x=192, .y=384, .z=0};
__.block.elems = 1115400;

=======================
__.world.size = 128;
__.world.rank = 61;

__.nodes.shape = {.x=512, .y=512, .z=512, .t=20};
__.nodes.bound = {.x=1.000000, .y=1.000000, .z=1.000000, .t=0.010000};
__.nodes.steps = {.x=0.001953, .y=0.001953, .z=0.001953, .t=0.000500};

__.param.period = {.x=1, .y=0, .z=0};
__.param.a = {.x=6.283185, .y=3.141593, .z=3.141593, .t=7.695299};
__.param.b = {.x=0.000000, .y=0.000000, .z=0.000000, .t=7.853982};

__.local.rank = 61;
__.local.shape = {.x=8, .y=4, .z=4};
__.local.coord = {.x=3, .y=3, .z=1};

__.block.shape = {.x=66, .y=130, .z=130};
__.block.coord = {.x=192, .y=384, .z=128};
__.block.elems = 1115400;

=======================
__.world.size = 128;
__.world.rank = 62;

__.nodes.shape = {.x=512, .y=512, .z=512, .t=20};
__.nodes.bound = {.x=1.000000, .y=1.000000, .z=1.000000, .t=0.010000};
__.nodes.steps = {.x=0.001953, .y=0.001953, .z=0.001953, .t=0.000500};

__.param.period = {.x=1, .y=0, .z=0};
__.param.a = {.x=6.283185, .y=3.141593, .z=3.141593, .t=7.695299};
__.param.b = {.x=0.000000, .y=0.000000, .z=0.000000, .t=7.853982};
=======================

__.local.rank = 62;
__.local.shape = {.x=8, .y=4, .z=4};
__.world.size = 128;
__.local.coord = {.x=3, .y=3, .z=2};
__.world.rank = 64;


__.block.shape = {.x=66, .y=130, .z=130};
__.nodes.shape = {.x=512, .y=512, .z=512, .t=20};
__.block.coord = {.x=192, .y=384, .z=256};
__.nodes.bound = {.x=1.000000, .y=1.000000, .z=1.000000, .t=0.010000};
__.block.elems = 1115400;
__.nodes.steps = {.x=0.001953, .y=0.001953, .z=0.001953, .t=0.000500};


=======================
__.param.period = {.x=1, .y=0, .z=0};
__.world.size = 128;
__.param.a = {.x=6.283185, .y=3.141593, .z=3.141593, .t=7.695299};
__.world.rank = 63;
__.param.b = {.x=0.000000, .y=0.000000, .z=0.000000, .t=7.853982};


__.nodes.shape = {.x=512, .y=512, .z=512, .t=20};
__.local.rank = 64;
__.nodes.bound = {.x=1.000000, .y=1.000000, .z=1.000000, .t=0.010000};
__.local.shape = {.x=8, .y=4, .z=4};
__.nodes.steps = {.x=0.001953, .y=0.001953, .z=0.001953, .t=0.000500};
__.local.coord = {.x=4, .y=0, .z=0};


__.param.period = {.x=1, .y=0, .z=0};
__.block.shape = {.x=66, .y=130, .z=130};
__.param.a = {.x=6.283185, .y=3.141593, .z=3.141593, .t=7.695299};
__.block.coord = {.x=256, .y=0, .z=0};
__.param.b = {.x=0.000000, .y=0.000000, .z=0.000000, .t=7.853982};
__.block.elems = 1115400;


__.local.rank = 63;
__.local.shape = {.x=8, .y=4, .z=4};
__.local.coord = {.x=3, .y=3, .z=3};
=======================

__.world.size = 128;
__.block.shape = {.x=66, .y=130, .z=130};
__.world.rank = 65;
__.block.coord = {.x=192, .y=384, .z=384};

__.block.elems = 1115400;
__.nodes.shape = {.x=512, .y=512, .z=512, .t=20};

__.nodes.bound = {.x=1.000000, .y=1.000000, .z=1.000000, .t=0.010000};
__.nodes.steps = {.x=0.001953, .y=0.001953, .z=0.001953, .t=0.000500};

__.param.period = {.x=1, .y=0, .z=0};
__.param.a = {.x=6.283185, .y=3.141593, .z=3.141593, .t=7.695299};
__.param.b = {.x=0.000000, .y=0.000000, .z=0.000000, .t=7.853982};

__.local.rank = 65;
__.local.shape = {.x=8, .y=4, .z=4};
__.local.coord = {.x=4, .y=0, .z=1};

__.block.shape = {.x=66, .y=130, .z=130};
__.block.coord = {.x=256, .y=0, .z=128};
__.block.elems = 1115400;

=======================
__.world.size = 128;
__.world.rank = 66;

__.nodes.shape = {.x=512, .y=512, .z=512, .t=20};
__.nodes.bound = {.x=1.000000, .y=1.000000, .z=1.000000, .t=0.010000};
__.nodes.steps = {.x=0.001953, .y=0.001953, .z=0.001953, .t=0.000500};

__.param.period = {.x=1, .y=0, .z=0};
__.param.a = {.x=6.283185, .y=3.141593, .z=3.141593, .t=7.695299};
__.param.b = {.x=0.000000, .y=0.000000, .z=0.000000, .t=7.853982};

__.local.rank = 66;
__.local.shape = {.x=8, .y=4, .z=4};
__.local.coord = {.x=4, .y=0, .z=2};

__.block.shape = {.x=66, .y=130, .z=130};
__.block.coord = {.x=256, .y=0, .z=256};
__.block.elems = 1115400;

=======================
__.world.size = 128;
__.world.rank = 67;

__.nodes.shape = {.x=512, .y=512, .z=512, .t=20};
__.nodes.bound = {.x=1.000000, .y=1.000000, .z=1.000000, .t=0.010000};
__.nodes.steps = {.x=0.001953, .y=0.001953, .z=0.001953, .t=0.000500};

__.param.period = {.x=1, .y=0, .z=0};
__.param.a = {.x=6.283185, .y=3.141593, .z=3.141593, .t=7.695299};
__.param.b = {.x=0.000000, .y=0.000000, .z=0.000000, .t=7.853982};

__.local.rank = 67;
__.local.shape = {.x=8, .y=4, .z=4};
__.local.coord = {.x=4, .y=0, .z=3};

__.block.shape = {.x=66, .y=130, .z=130};
__.block.coord = {.x=256, .y=0, .z=384};
__.block.elems = 1115400;

=======================
__.world.size = 128;
__.world.rank = 68;

__.nodes.shape = {.x=512, .y=512, .z=512, .t=20};
__.nodes.bound = {.x=1.000000, .y=1.000000, .z=1.000000, .t=0.010000};
__.nodes.steps = {.x=0.001953, .y=0.001953, .z=0.001953, .t=0.000500};

__.param.period = {.x=1, .y=0, .z=0};
__.param.a = {.x=6.283185, .y=3.141593, .z=3.141593, .t=7.695299};
__.param.b = {.x=0.000000, .y=0.000000, .z=0.000000, .t=7.853982};

__.local.rank = 68;
__.local.shape = {.x=8, .y=4, .z=4};
__.local.coord = {.x=4, .y=1, .z=0};

__.block.shape = {.x=66, .y=130, .z=130};
__.block.coord = {.x=256, .y=128, .z=0};
__.block.elems = 1115400;

=======================
__.world.size = 128;
__.world.rank = 69;

__.nodes.shape = {.x=512, .y=512, .z=512, .t=20};
__.nodes.bound = {.x=1.000000, .y=1.000000, .z=1.000000, .t=0.010000};
__.nodes.steps = {.x=0.001953, .y=0.001953, .z=0.001953, .t=0.000500};

__.param.period = {.x=1, .y=0, .z=0};
__.param.a = {.x=6.283185, .y=3.141593, .z=3.141593, .t=7.695299};
__.param.b = {.x=0.000000, .y=0.000000, .z=0.000000, .t=7.853982};

__.local.rank = 69;
__.local.shape = {.x=8, .y=4, .z=4};
__.local.coord = {.x=4, .y=1, .z=1};

__.block.shape = {.x=66, .y=130, .z=130};
__.block.coord = {.x=256, .y=128, .z=128};
__.block.elems = 1115400;

=======================
__.world.size = 128;
__.world.rank = 70;

__.nodes.shape = {.x=512, .y=512, .z=512, .t=20};
__.nodes.bound = {.x=1.000000, .y=1.000000, .z=1.000000, .t=0.010000};
__.nodes.steps = {.x=0.001953, .y=0.001953, .z=0.001953, .t=0.000500};

__.param.period = {.x=1, .y=0, .z=0};
__.param.a = {.x=6.283185, .y=3.141593, .z=3.141593, .t=7.695299};
__.param.b = {.x=0.000000, .y=0.000000, .z=0.000000, .t=7.853982};

__.local.rank = 70;
__.local.shape = {.x=8, .y=4, .z=4};
__.local.coord = {.x=4, .y=1, .z=2};

__.block.shape = {.x=66, .y=130, .z=130};
__.block.coord = {.x=256, .y=128, .z=256};
__.block.elems = 1115400;

=======================
__.world.size = 128;
__.world.rank = 71;

__.nodes.shape = {.x=512, .y=512, .z=512, .t=20};
__.nodes.bound = {.x=1.000000, .y=1.000000, .z=1.000000, .t=0.010000};
__.nodes.steps = {.x=0.001953, .y=0.001953, .z=0.001953, .t=0.000500};

__.param.period = {.x=1, .y=0, .z=0};
__.param.a = {.x=6.283185, .y=3.141593, .z=3.141593, .t=7.695299};
__.param.b = {.x=0.000000, .y=0.000000, .z=0.000000, .t=7.853982};

__.local.rank = 71;
__.local.shape = {.x=8, .y=4, .z=4};
__.local.coord = {.x=4, .y=1, .z=3};

__.block.shape = {.x=66, .y=130, .z=130};
__.block.coord = {.x=256, .y=128, .z=384};
__.block.elems = 1115400;

=======================
__.world.size = 128;
__.world.rank = 72;

__.nodes.shape = {.x=512, .y=512, .z=512, .t=20};
__.nodes.bound = {.x=1.000000, .y=1.000000, .z=1.000000, .t=0.010000};
__.nodes.steps = {.x=0.001953, .y=0.001953, .z=0.001953, .t=0.000500};

__.param.period = {.x=1, .y=0, .z=0};
__.param.a = {.x=6.283185, .y=3.141593, .z=3.141593, .t=7.695299};
__.param.b = {.x=0.000000, .y=0.000000, .z=0.000000, .t=7.853982};

__.local.rank = 72;
__.local.shape = {.x=8, .y=4, .z=4};
__.local.coord = {.x=4, .y=2, .z=0};

__.block.shape = {.x=66, .y=130, .z=130};
__.block.coord = {.x=256, .y=256, .z=0};
__.block.elems = 1115400;

=======================
__.world.size = 128;
__.world.rank = 73;

__.nodes.shape = {.x=512, .y=512, .z=512, .t=20};
__.nodes.bound = {.x=1.000000, .y=1.000000, .z=1.000000, .t=0.010000};
__.nodes.steps = {.x=0.001953, .y=0.001953, .z=0.001953, .t=0.000500};

__.param.period = {.x=1, .y=0, .z=0};
__.param.a = {.x=6.283185, .y=3.141593, .z=3.141593, .t=7.695299};
__.param.b = {.x=0.000000, .y=0.000000, .z=0.000000, .t=7.853982};

__.local.rank = 73;
__.local.shape = {.x=8, .y=4, .z=4};
__.local.coord = {.x=4, .y=2, .z=1};

__.block.shape = {.x=66, .y=130, .z=130};
__.block.coord = {.x=256, .y=256, .z=128};
__.block.elems = 1115400;

=======================
__.world.size = 128;
__.world.rank = 74;

__.nodes.shape = {.x=512, .y=512, .z=512, .t=20};
__.nodes.bound = {.x=1.000000, .y=1.000000, .z=1.000000, .t=0.010000};
__.nodes.steps = {.x=0.001953, .y=0.001953, .z=0.001953, .t=0.000500};

__.param.period = {.x=1, .y=0, .z=0};
__.param.a = {.x=6.283185, .y=3.141593, .z=3.141593, .t=7.695299};
__.param.b = {.x=0.000000, .y=0.000000, .z=0.000000, .t=7.853982};

__.local.rank = 74;
__.local.shape = {.x=8, .y=4, .z=4};
__.local.coord = {.x=4, .y=2, .z=2};

__.block.shape = {.x=66, .y=130, .z=130};
__.block.coord = {.x=256, .y=256, .z=256};
__.block.elems = 1115400;

=======================
__.world.size = 128;
__.world.rank = 75;

__.nodes.shape = {.x=512, .y=512, .z=512, .t=20};
__.nodes.bound = {.x=1.000000, .y=1.000000, .z=1.000000, .t=0.010000};
__.nodes.steps = {.x=0.001953, .y=0.001953, .z=0.001953, .t=0.000500};

__.param.period = {.x=1, .y=0, .z=0};
__.param.a = {.x=6.283185, .y=3.141593, .z=3.141593, .t=7.695299};
__.param.b = {.x=0.000000, .y=0.000000, .z=0.000000, .t=7.853982};

__.local.rank = 75;
__.local.shape = {.x=8, .y=4, .z=4};
__.local.coord = {.x=4, .y=2, .z=3};

__.block.shape = {.x=66, .y=130, .z=130};
__.block.coord = {.x=256, .y=256, .z=384};
__.block.elems = 1115400;

=======================
__.world.size = 128;
__.world.rank = 76;

__.nodes.shape = {.x=512, .y=512, .z=512, .t=20};
__.nodes.bound = {.x=1.000000, .y=1.000000, .z=1.000000, .t=0.010000};
__.nodes.steps = {.x=0.001953, .y=0.001953, .z=0.001953, .t=0.000500};

__.param.period = {.x=1, .y=0, .z=0};
__.param.a = {.x=6.283185, .y=3.141593, .z=3.141593, .t=7.695299};
__.param.b = {.x=0.000000, .y=0.000000, .z=0.000000, .t=7.853982};

__.local.rank = 76;
__.local.shape = {.x=8, .y=4, .z=4};
__.local.coord = {.x=4, .y=3, .z=0};

__.block.shape = {.x=66, .y=130, .z=130};
__.block.coord = {.x=256, .y=384, .z=0};
__.block.elems = 1115400;

=======================
__.world.size = 128;
__.world.rank = 77;

__.nodes.shape = {.x=512, .y=512, .z=512, .t=20};
__.nodes.bound = {.x=1.000000, .y=1.000000, .z=1.000000, .t=0.010000};
__.nodes.steps = {.x=0.001953, .y=0.001953, .z=0.001953, .t=0.000500};

__.param.period = {.x=1, .y=0, .z=0};
__.param.a = {.x=6.283185, .y=3.141593, .z=3.141593, .t=7.695299};
__.param.b = {.x=0.000000, .y=0.000000, .z=0.000000, .t=7.853982};

__.local.rank = 77;
__.local.shape = {.x=8, .y=4, .z=4};
__.local.coord = {.x=4, .y=3, .z=1};

__.block.shape = {.x=66, .y=130, .z=130};
__.block.coord = {.x=256, .y=384, .z=128};
__.block.elems = 1115400;

=======================
__.world.size = 128;
__.world.rank = 78;

__.nodes.shape = {.x=512, .y=512, .z=512, .t=20};
__.nodes.bound = {.x=1.000000, .y=1.000000, .z=1.000000, .t=0.010000};
__.nodes.steps = {.x=0.001953, .y=0.001953, .z=0.001953, .t=0.000500};

__.param.period = {.x=1, .y=0, .z=0};
__.param.a = {.x=6.283185, .y=3.141593, .z=3.141593, .t=7.695299};
__.param.b = {.x=0.000000, .y=0.000000, .z=0.000000, .t=7.853982};

__.local.rank = 78;
__.local.shape = {.x=8, .y=4, .z=4};
__.local.coord = {.x=4, .y=3, .z=2};

__.block.shape = {.x=66, .y=130, .z=130};
__.block.coord = {.x=256, .y=384, .z=256};
__.block.elems = 1115400;

=======================
__.world.size = 128;
__.world.rank = 79;

__.nodes.shape = {.x=512, .y=512, .z=512, .t=20};
__.nodes.bound = {.x=1.000000, .y=1.000000, .z=1.000000, .t=0.010000};
__.nodes.steps = {.x=0.001953, .y=0.001953, .z=0.001953, .t=0.000500};

__.param.period = {.x=1, .y=0, .z=0};
__.param.a = {.x=6.283185, .y=3.141593, .z=3.141593, .t=7.695299};
__.param.b = {.x=0.000000, .y=0.000000, .z=0.000000, .t=7.853982};

__.local.rank = 79;
__.local.shape = {.x=8, .y=4, .z=4};
__.local.coord = {.x=4, .y=3, .z=3};

__.block.shape = {.x=66, .y=130, .z=130};
__.block.coord = {.x=256, .y=384, .z=384};
__.block.elems = 1115400;

=======================
__.world.size = 128;
__.world.rank = 80;

__.nodes.shape = {.x=512, .y=512, .z=512, .t=20};
__.nodes.bound = {.x=1.000000, .y=1.000000, .z=1.000000, .t=0.010000};
__.nodes.steps = {.x=0.001953, .y=0.001953, .z=0.001953, .t=0.000500};

__.param.period = {.x=1, .y=0, .z=0};
__.param.a = {.x=6.283185, .y=3.141593, .z=3.141593, .t=7.695299};
__.param.b = {.x=0.000000, .y=0.000000, .z=0.000000, .t=7.853982};

__.local.rank = 80;
__.local.shape = {.x=8, .y=4, .z=4};
__.local.coord = {.x=5, .y=0, .z=0};

__.block.shape = {.x=66, .y=130, .z=130};
__.block.coord = {.x=320, .y=0, .z=0};
__.block.elems = 1115400;

=======================
__.world.size = 128;
__.world.rank = 81;

__.nodes.shape = {.x=512, .y=512, .z=512, .t=20};
__.nodes.bound = {.x=1.000000, .y=1.000000, .z=1.000000, .t=0.010000};
__.nodes.steps = {.x=0.001953, .y=0.001953, .z=0.001953, .t=0.000500};

__.param.period = {.x=1, .y=0, .z=0};
__.param.a = {.x=6.283185, .y=3.141593, .z=3.141593, .t=7.695299};
__.param.b = {.x=0.000000, .y=0.000000, .z=0.000000, .t=7.853982};

__.local.rank = 81;
__.local.shape = {.x=8, .y=4, .z=4};
__.local.coord = {.x=5, .y=0, .z=1};

__.block.shape = {.x=66, .y=130, .z=130};
__.block.coord = {.x=320, .y=0, .z=128};
__.block.elems = 1115400;

=======================
__.world.size = 128;
__.world.rank = 82;

__.nodes.shape = {.x=512, .y=512, .z=512, .t=20};
__.nodes.bound = {.x=1.000000, .y=1.000000, .z=1.000000, .t=0.010000};
__.nodes.steps = {.x=0.001953, .y=0.001953, .z=0.001953, .t=0.000500};

__.param.period = {.x=1, .y=0, .z=0};
__.param.a = {.x=6.283185, .y=3.141593, .z=3.141593, .t=7.695299};
__.param.b = {.x=0.000000, .y=0.000000, .z=0.000000, .t=7.853982};

__.local.rank = 82;
__.local.shape = {.x=8, .y=4, .z=4};
__.local.coord = {.x=5, .y=0, .z=2};

__.block.shape = {.x=66, .y=130, .z=130};
__.block.coord = {.x=320, .y=0, .z=256};
__.block.elems = 1115400;

=======================
__.world.size = 128;
__.world.rank = 83;

__.nodes.shape = {.x=512, .y=512, .z=512, .t=20};
__.nodes.bound = {.x=1.000000, .y=1.000000, .z=1.000000, .t=0.010000};
__.nodes.steps = {.x=0.001953, .y=0.001953, .z=0.001953, .t=0.000500};

__.param.period = {.x=1, .y=0, .z=0};
__.param.a = {.x=6.283185, .y=3.141593, .z=3.141593, .t=7.695299};
__.param.b = {.x=0.000000, .y=0.000000, .z=0.000000, .t=7.853982};

__.local.rank = 83;
__.local.shape = {.x=8, .y=4, .z=4};
__.local.coord = {.x=5, .y=0, .z=3};

__.block.shape = {.x=66, .y=130, .z=130};
__.block.coord = {.x=320, .y=0, .z=384};
__.block.elems = 1115400;

=======================
__.world.size = 128;
__.world.rank = 84;

__.nodes.shape = {.x=512, .y=512, .z=512, .t=20};
__.nodes.bound = {.x=1.000000, .y=1.000000, .z=1.000000, .t=0.010000};
__.nodes.steps = {.x=0.001953, .y=0.001953, .z=0.001953, .t=0.000500};

__.param.period = {.x=1, .y=0, .z=0};
__.param.a = {.x=6.283185, .y=3.141593, .z=3.141593, .t=7.695299};
__.param.b = {.x=0.000000, .y=0.000000, .z=0.000000, .t=7.853982};

__.local.rank = 84;
__.local.shape = {.x=8, .y=4, .z=4};
__.local.coord = {.x=5, .y=1, .z=0};

__.block.shape = {.x=66, .y=130, .z=130};
__.block.coord = {.x=320, .y=128, .z=0};
__.block.elems = 1115400;

=======================
__.world.size = 128;
__.world.rank = 85;

__.nodes.shape = {.x=512, .y=512, .z=512, .t=20};
__.nodes.bound = {.x=1.000000, .y=1.000000, .z=1.000000, .t=0.010000};
__.nodes.steps = {.x=0.001953, .y=0.001953, .z=0.001953, .t=0.000500};

__.param.period = {.x=1, .y=0, .z=0};
__.param.a = {.x=6.283185, .y=3.141593, .z=3.141593, .t=7.695299};
__.param.b = {.x=0.000000, .y=0.000000, .z=0.000000, .t=7.853982};

__.local.rank = 85;
__.local.shape = {.x=8, .y=4, .z=4};
__.local.coord = {.x=5, .y=1, .z=1};

__.block.shape = {.x=66, .y=130, .z=130};
__.block.coord = {.x=320, .y=128, .z=128};
__.block.elems = 1115400;

=======================
__.world.size = 128;
__.world.rank = 86;

__.nodes.shape = {.x=512, .y=512, .z=512, .t=20};
__.nodes.bound = {.x=1.000000, .y=1.000000, .z=1.000000, .t=0.010000};
__.nodes.steps = {.x=0.001953, .y=0.001953, .z=0.001953, .t=0.000500};

__.param.period = {.x=1, .y=0, .z=0};
__.param.a = {.x=6.283185, .y=3.141593, .z=3.141593, .t=7.695299};
__.param.b = {.x=0.000000, .y=0.000000, .z=0.000000, .t=7.853982};

__.local.rank = 86;
__.local.shape = {.x=8, .y=4, .z=4};
__.local.coord = {.x=5, .y=1, .z=2};

__.block.shape = {.x=66, .y=130, .z=130};
__.block.coord = {.x=320, .y=128, .z=256};
__.block.elems = 1115400;

=======================
__.world.size = 128;
__.world.rank = 87;

__.nodes.shape = {.x=512, .y=512, .z=512, .t=20};
__.nodes.bound = {.x=1.000000, .y=1.000000, .z=1.000000, .t=0.010000};
__.nodes.steps = {.x=0.001953, .y=0.001953, .z=0.001953, .t=0.000500};

__.param.period = {.x=1, .y=0, .z=0};
__.param.a = {.x=6.283185, .y=3.141593, .z=3.141593, .t=7.695299};
__.param.b = {.x=0.000000, .y=0.000000, .z=0.000000, .t=7.853982};

__.local.rank = 87;
__.local.shape = {.x=8, .y=4, .z=4};
__.local.coord = {.x=5, .y=1, .z=3};

__.block.shape = {.x=66, .y=130, .z=130};
__.block.coord = {.x=320, .y=128, .z=384};
__.block.elems = 1115400;

=======================
__.world.size = 128;
__.world.rank = 88;

__.nodes.shape = {.x=512, .y=512, .z=512, .t=20};
__.nodes.bound = {.x=1.000000, .y=1.000000, .z=1.000000, .t=0.010000};
__.nodes.steps = {.x=0.001953, .y=0.001953, .z=0.001953, .t=0.000500};

__.param.period = {.x=1, .y=0, .z=0};
__.param.a = {.x=6.283185, .y=3.141593, .z=3.141593, .t=7.695299};
__.param.b = {.x=0.000000, .y=0.000000, .z=0.000000, .t=7.853982};

__.local.rank = 88;
__.local.shape = {.x=8, .y=4, .z=4};
__.local.coord = {.x=5, .y=2, .z=0};

__.block.shape = {.x=66, .y=130, .z=130};
__.block.coord = {.x=320, .y=256, .z=0};
__.block.elems = 1115400;

=======================
__.world.size = 128;
__.world.rank = 89;

__.nodes.shape = {.x=512, .y=512, .z=512, .t=20};
__.nodes.bound = {.x=1.000000, .y=1.000000, .z=1.000000, .t=0.010000};
__.nodes.steps = {.x=0.001953, .y=0.001953, .z=0.001953, .t=0.000500};

__.param.period = {.x=1, .y=0, .z=0};
__.param.a = {.x=6.283185, .y=3.141593, .z=3.141593, .t=7.695299};
__.param.b = {.x=0.000000, .y=0.000000, .z=0.000000, .t=7.853982};

__.local.rank = 89;
__.local.shape = {.x=8, .y=4, .z=4};
__.local.coord = {.x=5, .y=2, .z=1};

__.block.shape = {.x=66, .y=130, .z=130};
__.block.coord = {.x=320, .y=256, .z=128};
__.block.elems = 1115400;

=======================
__.world.size = 128;
__.world.rank = 90;

__.nodes.shape = {.x=512, .y=512, .z=512, .t=20};
__.nodes.bound = {.x=1.000000, .y=1.000000, .z=1.000000, .t=0.010000};
__.nodes.steps = {.x=0.001953, .y=0.001953, .z=0.001953, .t=0.000500};

__.param.period = {.x=1, .y=0, .z=0};
__.param.a = {.x=6.283185, .y=3.141593, .z=3.141593, .t=7.695299};
__.param.b = {.x=0.000000, .y=0.000000, .z=0.000000, .t=7.853982};

__.local.rank = 90;
__.local.shape = {.x=8, .y=4, .z=4};
__.local.coord = {.x=5, .y=2, .z=2};

__.block.shape = {.x=66, .y=130, .z=130};
__.block.coord = {.x=320, .y=256, .z=256};
__.block.elems = 1115400;

=======================
__.world.size = 128;
__.world.rank = 91;

__.nodes.shape = {.x=512, .y=512, .z=512, .t=20};
__.nodes.bound = {.x=1.000000, .y=1.000000, .z=1.000000, .t=0.010000};
__.nodes.steps = {.x=0.001953, .y=0.001953, .z=0.001953, .t=0.000500};

__.param.period = {.x=1, .y=0, .z=0};
__.param.a = {.x=6.283185, .y=3.141593, .z=3.141593, .t=7.695299};
__.param.b = {.x=0.000000, .y=0.000000, .z=0.000000, .t=7.853982};

__.local.rank = 91;
__.local.shape = {.x=8, .y=4, .z=4};
__.local.coord = {.x=5, .y=2, .z=3};

__.block.shape = {.x=66, .y=130, .z=130};
__.block.coord = {.x=320, .y=256, .z=384};
__.block.elems = 1115400;

=======================
__.world.size = 128;
__.world.rank = 92;

__.nodes.shape = {.x=512, .y=512, .z=512, .t=20};
__.nodes.bound = {.x=1.000000, .y=1.000000, .z=1.000000, .t=0.010000};
__.nodes.steps = {.x=0.001953, .y=0.001953, .z=0.001953, .t=0.000500};

__.param.period = {.x=1, .y=0, .z=0};
__.param.a = {.x=6.283185, .y=3.141593, .z=3.141593, .t=7.695299};
__.param.b = {.x=0.000000, .y=0.000000, .z=0.000000, .t=7.853982};

__.local.rank = 92;
__.local.shape = {.x=8, .y=4, .z=4};
__.local.coord = {.x=5, .y=3, .z=0};

__.block.shape = {.x=66, .y=130, .z=130};
__.block.coord = {.x=320, .y=384, .z=0};
__.block.elems = 1115400;

=======================
__.world.size = 128;
__.world.rank = 93;

__.nodes.shape = {.x=512, .y=512, .z=512, .t=20};
__.nodes.bound = {.x=1.000000, .y=1.000000, .z=1.000000, .t=0.010000};
__.nodes.steps = {.x=0.001953, .y=0.001953, .z=0.001953, .t=0.000500};
=======================

__.param.period = {.x=1, .y=0, .z=0};
__.param.a = {.x=6.283185, .y=3.141593, .z=3.141593, .t=7.695299};
__.world.size = 128;
__.param.b = {.x=0.000000, .y=0.000000, .z=0.000000, .t=7.853982};
__.world.rank = 96;


__.local.rank = 93;
__.nodes.shape = {.x=512, .y=512, .z=512, .t=20};
__.local.shape = {.x=8, .y=4, .z=4};
__.nodes.bound = {.x=1.000000, .y=1.000000, .z=1.000000, .t=0.010000};
__.local.coord = {.x=5, .y=3, .z=1};
__.nodes.steps = {.x=0.001953, .y=0.001953, .z=0.001953, .t=0.000500};


__.block.shape = {.x=66, .y=130, .z=130};
__.param.period = {.x=1, .y=0, .z=0};
__.block.coord = {.x=320, .y=384, .z=128};
__.param.a = {.x=6.283185, .y=3.141593, .z=3.141593, .t=7.695299};
__.block.elems = 1115400;
__.param.b = {.x=0.000000, .y=0.000000, .z=0.000000, .t=7.853982};


=======================
__.local.rank = 96;
__.world.size = 128;
__.local.shape = {.x=8, .y=4, .z=4};
__.world.rank = 94;
__.local.coord = {.x=6, .y=0, .z=0};


__.nodes.shape = {.x=512, .y=512, .z=512, .t=20};
__.block.shape = {.x=66, .y=130, .z=130};
__.nodes.bound = {.x=1.000000, .y=1.000000, .z=1.000000, .t=0.010000};
__.block.coord = {.x=384, .y=0, .z=0};
__.nodes.steps = {.x=0.001953, .y=0.001953, .z=0.001953, .t=0.000500};
__.block.elems = 1115400;


__.param.period = {.x=1, .y=0, .z=0};
=======================
__.param.a = {.x=6.283185, .y=3.141593, .z=3.141593, .t=7.695299};
__.world.size = 128;
__.param.b = {.x=0.000000, .y=0.000000, .z=0.000000, .t=7.853982};
__.world.rank = 97;


__.local.rank = 94;
__.nodes.shape = {.x=512, .y=512, .z=512, .t=20};
__.local.shape = {.x=8, .y=4, .z=4};
__.nodes.bound = {.x=1.000000, .y=1.000000, .z=1.000000, .t=0.010000};
__.local.coord = {.x=5, .y=3, .z=2};
__.nodes.steps = {.x=0.001953, .y=0.001953, .z=0.001953, .t=0.000500};


__.block.shape = {.x=66, .y=130, .z=130};
__.param.period = {.x=1, .y=0, .z=0};
__.block.coord = {.x=320, .y=384, .z=256};
__.param.a = {.x=6.283185, .y=3.141593, .z=3.141593, .t=7.695299};
__.block.elems = 1115400;
__.param.b = {.x=0.000000, .y=0.000000, .z=0.000000, .t=7.853982};


=======================
__.local.rank = 97;
__.world.size = 128;
__.local.shape = {.x=8, .y=4, .z=4};
__.world.rank = 95;
__.local.coord = {.x=6, .y=0, .z=1};


__.nodes.shape = {.x=512, .y=512, .z=512, .t=20};
__.block.shape = {.x=66, .y=130, .z=130};
__.nodes.bound = {.x=1.000000, .y=1.000000, .z=1.000000, .t=0.010000};
__.block.coord = {.x=384, .y=0, .z=128};
__.nodes.steps = {.x=0.001953, .y=0.001953, .z=0.001953, .t=0.000500};
__.block.elems = 1115400;


__.param.period = {.x=1, .y=0, .z=0};
__.param.a = {.x=6.283185, .y=3.141593, .z=3.141593, .t=7.695299};
__.param.b = {.x=0.000000, .y=0.000000, .z=0.000000, .t=7.853982};
=======================

__.world.size = 128;
__.local.rank = 95;
__.world.rank = 98;
__.local.shape = {.x=8, .y=4, .z=4};

__.local.coord = {.x=5, .y=3, .z=3};
__.nodes.shape = {.x=512, .y=512, .z=512, .t=20};

__.nodes.bound = {.x=1.000000, .y=1.000000, .z=1.000000, .t=0.010000};
__.block.shape = {.x=66, .y=130, .z=130};
__.nodes.steps = {.x=0.001953, .y=0.001953, .z=0.001953, .t=0.000500};
__.block.coord = {.x=320, .y=384, .z=384};

__.block.elems = 1115400;
__.param.period = {.x=1, .y=0, .z=0};

__.param.a = {.x=6.283185, .y=3.141593, .z=3.141593, .t=7.695299};
__.param.b = {.x=0.000000, .y=0.000000, .z=0.000000, .t=7.853982};

__.local.rank = 98;
__.local.shape = {.x=8, .y=4, .z=4};
__.local.coord = {.x=6, .y=0, .z=2};

__.block.shape = {.x=66, .y=130, .z=130};
__.block.coord = {.x=384, .y=0, .z=256};
__.block.elems = 1115400;

=======================
__.world.size = 128;
__.world.rank = 99;

__.nodes.shape = {.x=512, .y=512, .z=512, .t=20};
__.nodes.bound = {.x=1.000000, .y=1.000000, .z=1.000000, .t=0.010000};
__.nodes.steps = {.x=0.001953, .y=0.001953, .z=0.001953, .t=0.000500};

__.param.period = {.x=1, .y=0, .z=0};
__.param.a = {.x=6.283185, .y=3.141593, .z=3.141593, .t=7.695299};
__.param.b = {.x=0.000000, .y=0.000000, .z=0.000000, .t=7.853982};

__.local.rank = 99;
__.local.shape = {.x=8, .y=4, .z=4};
__.local.coord = {.x=6, .y=0, .z=3};

__.block.shape = {.x=66, .y=130, .z=130};
__.block.coord = {.x=384, .y=0, .z=384};
__.block.elems = 1115400;

=======================
__.world.size = 128;
__.world.rank = 100;

__.nodes.shape = {.x=512, .y=512, .z=512, .t=20};
__.nodes.bound = {.x=1.000000, .y=1.000000, .z=1.000000, .t=0.010000};
__.nodes.steps = {.x=0.001953, .y=0.001953, .z=0.001953, .t=0.000500};

__.param.period = {.x=1, .y=0, .z=0};
__.param.a = {.x=6.283185, .y=3.141593, .z=3.141593, .t=7.695299};
__.param.b = {.x=0.000000, .y=0.000000, .z=0.000000, .t=7.853982};

__.local.rank = 100;
__.local.shape = {.x=8, .y=4, .z=4};
__.local.coord = {.x=6, .y=1, .z=0};

__.block.shape = {.x=66, .y=130, .z=130};
__.block.coord = {.x=384, .y=128, .z=0};
__.block.elems = 1115400;

=======================
__.world.size = 128;
__.world.rank = 101;

__.nodes.shape = {.x=512, .y=512, .z=512, .t=20};
__.nodes.bound = {.x=1.000000, .y=1.000000, .z=1.000000, .t=0.010000};
__.nodes.steps = {.x=0.001953, .y=0.001953, .z=0.001953, .t=0.000500};

__.param.period = {.x=1, .y=0, .z=0};
__.param.a = {.x=6.283185, .y=3.141593, .z=3.141593, .t=7.695299};
__.param.b = {.x=0.000000, .y=0.000000, .z=0.000000, .t=7.853982};

__.local.rank = 101;
__.local.shape = {.x=8, .y=4, .z=4};
__.local.coord = {.x=6, .y=1, .z=1};

__.block.shape = {.x=66, .y=130, .z=130};
__.block.coord = {.x=384, .y=128, .z=128};
__.block.elems = 1115400;

=======================
__.world.size = 128;
__.world.rank = 102;

__.nodes.shape = {.x=512, .y=512, .z=512, .t=20};
__.nodes.bound = {.x=1.000000, .y=1.000000, .z=1.000000, .t=0.010000};
__.nodes.steps = {.x=0.001953, .y=0.001953, .z=0.001953, .t=0.000500};

__.param.period = {.x=1, .y=0, .z=0};
__.param.a = {.x=6.283185, .y=3.141593, .z=3.141593, .t=7.695299};
__.param.b = {.x=0.000000, .y=0.000000, .z=0.000000, .t=7.853982};

__.local.rank = 102;
__.local.shape = {.x=8, .y=4, .z=4};
__.local.coord = {.x=6, .y=1, .z=2};

__.block.shape = {.x=66, .y=130, .z=130};
__.block.coord = {.x=384, .y=128, .z=256};
__.block.elems = 1115400;

=======================
__.world.size = 128;
__.world.rank = 103;

__.nodes.shape = {.x=512, .y=512, .z=512, .t=20};
__.nodes.bound = {.x=1.000000, .y=1.000000, .z=1.000000, .t=0.010000};
__.nodes.steps = {.x=0.001953, .y=0.001953, .z=0.001953, .t=0.000500};

__.param.period = {.x=1, .y=0, .z=0};
__.param.a = {.x=6.283185, .y=3.141593, .z=3.141593, .t=7.695299};
__.param.b = {.x=0.000000, .y=0.000000, .z=0.000000, .t=7.853982};

__.local.rank = 103;
__.local.shape = {.x=8, .y=4, .z=4};
__.local.coord = {.x=6, .y=1, .z=3};

__.block.shape = {.x=66, .y=130, .z=130};
__.block.coord = {.x=384, .y=128, .z=384};
__.block.elems = 1115400;

=======================
__.world.size = 128;
__.world.rank = 104;

__.nodes.shape = {.x=512, .y=512, .z=512, .t=20};
__.nodes.bound = {.x=1.000000, .y=1.000000, .z=1.000000, .t=0.010000};
__.nodes.steps = {.x=0.001953, .y=0.001953, .z=0.001953, .t=0.000500};

__.param.period = {.x=1, .y=0, .z=0};
__.param.a = {.x=6.283185, .y=3.141593, .z=3.141593, .t=7.695299};
__.param.b = {.x=0.000000, .y=0.000000, .z=0.000000, .t=7.853982};

__.local.rank = 104;
__.local.shape = {.x=8, .y=4, .z=4};
__.local.coord = {.x=6, .y=2, .z=0};

__.block.shape = {.x=66, .y=130, .z=130};
__.block.coord = {.x=384, .y=256, .z=0};
__.block.elems = 1115400;

=======================
__.world.size = 128;
__.world.rank = 105;

__.nodes.shape = {.x=512, .y=512, .z=512, .t=20};
__.nodes.bound = {.x=1.000000, .y=1.000000, .z=1.000000, .t=0.010000};
__.nodes.steps = {.x=0.001953, .y=0.001953, .z=0.001953, .t=0.000500};

__.param.period = {.x=1, .y=0, .z=0};
__.param.a = {.x=6.283185, .y=3.141593, .z=3.141593, .t=7.695299};
__.param.b = {.x=0.000000, .y=0.000000, .z=0.000000, .t=7.853982};

__.local.rank = 105;
__.local.shape = {.x=8, .y=4, .z=4};
__.local.coord = {.x=6, .y=2, .z=1};

__.block.shape = {.x=66, .y=130, .z=130};
__.block.coord = {.x=384, .y=256, .z=128};
__.block.elems = 1115400;

=======================
__.world.size = 128;
__.world.rank = 106;

__.nodes.shape = {.x=512, .y=512, .z=512, .t=20};
__.nodes.bound = {.x=1.000000, .y=1.000000, .z=1.000000, .t=0.010000};
__.nodes.steps = {.x=0.001953, .y=0.001953, .z=0.001953, .t=0.000500};

__.param.period = {.x=1, .y=0, .z=0};
__.param.a = {.x=6.283185, .y=3.141593, .z=3.141593, .t=7.695299};
__.param.b = {.x=0.000000, .y=0.000000, .z=0.000000, .t=7.853982};

__.local.rank = 106;
__.local.shape = {.x=8, .y=4, .z=4};
__.local.coord = {.x=6, .y=2, .z=2};

__.block.shape = {.x=66, .y=130, .z=130};
__.block.coord = {.x=384, .y=256, .z=256};
__.block.elems = 1115400;

=======================
__.world.size = 128;
__.world.rank = 107;

__.nodes.shape = {.x=512, .y=512, .z=512, .t=20};
__.nodes.bound = {.x=1.000000, .y=1.000000, .z=1.000000, .t=0.010000};
__.nodes.steps = {.x=0.001953, .y=0.001953, .z=0.001953, .t=0.000500};

__.param.period = {.x=1, .y=0, .z=0};
__.param.a = {.x=6.283185, .y=3.141593, .z=3.141593, .t=7.695299};
__.param.b = {.x=0.000000, .y=0.000000, .z=0.000000, .t=7.853982};

__.local.rank = 107;
__.local.shape = {.x=8, .y=4, .z=4};
__.local.coord = {.x=6, .y=2, .z=3};

__.block.shape = {.x=66, .y=130, .z=130};
__.block.coord = {.x=384, .y=256, .z=384};
__.block.elems = 1115400;

=======================
__.world.size = 128;
__.world.rank = 108;

__.nodes.shape = {.x=512, .y=512, .z=512, .t=20};
__.nodes.bound = {.x=1.000000, .y=1.000000, .z=1.000000, .t=0.010000};
__.nodes.steps = {.x=0.001953, .y=0.001953, .z=0.001953, .t=0.000500};

__.param.period = {.x=1, .y=0, .z=0};
__.param.a = {.x=6.283185, .y=3.141593, .z=3.141593, .t=7.695299};
__.param.b = {.x=0.000000, .y=0.000000, .z=0.000000, .t=7.853982};

__.local.rank = 108;
__.local.shape = {.x=8, .y=4, .z=4};
__.local.coord = {.x=6, .y=3, .z=0};

__.block.shape = {.x=66, .y=130, .z=130};
__.block.coord = {.x=384, .y=384, .z=0};
__.block.elems = 1115400;

=======================
__.world.size = 128;
__.world.rank = 109;

__.nodes.shape = {.x=512, .y=512, .z=512, .t=20};
__.nodes.bound = {.x=1.000000, .y=1.000000, .z=1.000000, .t=0.010000};
__.nodes.steps = {.x=0.001953, .y=0.001953, .z=0.001953, .t=0.000500};

__.param.period = {.x=1, .y=0, .z=0};
__.param.a = {.x=6.283185, .y=3.141593, .z=3.141593, .t=7.695299};
__.param.b = {.x=0.000000, .y=0.000000, .z=0.000000, .t=7.853982};

__.local.rank = 109;
__.local.shape = {.x=8, .y=4, .z=4};
__.local.coord = {.x=6, .y=3, .z=1};

__.block.shape = {.x=66, .y=130, .z=130};
__.block.coord = {.x=384, .y=384, .z=128};
__.block.elems = 1115400;

=======================
__.world.size = 128;
__.world.rank = 110;

__.nodes.shape = {.x=512, .y=512, .z=512, .t=20};
__.nodes.bound = {.x=1.000000, .y=1.000000, .z=1.000000, .t=0.010000};
__.nodes.steps = {.x=0.001953, .y=0.001953, .z=0.001953, .t=0.000500};

__.param.period = {.x=1, .y=0, .z=0};
__.param.a = {.x=6.283185, .y=3.141593, .z=3.141593, .t=7.695299};
__.param.b = {.x=0.000000, .y=0.000000, .z=0.000000, .t=7.853982};

__.local.rank = 110;
__.local.shape = {.x=8, .y=4, .z=4};
__.local.coord = {.x=6, .y=3, .z=2};

__.block.shape = {.x=66, .y=130, .z=130};
__.block.coord = {.x=384, .y=384, .z=256};
__.block.elems = 1115400;

=======================
__.world.size = 128;
__.world.rank = 111;

__.nodes.shape = {.x=512, .y=512, .z=512, .t=20};
__.nodes.bound = {.x=1.000000, .y=1.000000, .z=1.000000, .t=0.010000};
__.nodes.steps = {.x=0.001953, .y=0.001953, .z=0.001953, .t=0.000500};

__.param.period = {.x=1, .y=0, .z=0};
__.param.a = {.x=6.283185, .y=3.141593, .z=3.141593, .t=7.695299};
__.param.b = {.x=0.000000, .y=0.000000, .z=0.000000, .t=7.853982};

__.local.rank = 111;
__.local.shape = {.x=8, .y=4, .z=4};
__.local.coord = {.x=6, .y=3, .z=3};

__.block.shape = {.x=66, .y=130, .z=130};
__.block.coord = {.x=384, .y=384, .z=384};
__.block.elems = 1115400;

=======================
__.world.size = 128;
__.world.rank = 112;

__.nodes.shape = {.x=512, .y=512, .z=512, .t=20};
__.nodes.bound = {.x=1.000000, .y=1.000000, .z=1.000000, .t=0.010000};
__.nodes.steps = {.x=0.001953, .y=0.001953, .z=0.001953, .t=0.000500};

__.param.period = {.x=1, .y=0, .z=0};
__.param.a = {.x=6.283185, .y=3.141593, .z=3.141593, .t=7.695299};
__.param.b = {.x=0.000000, .y=0.000000, .z=0.000000, .t=7.853982};

__.local.rank = 112;
__.local.shape = {.x=8, .y=4, .z=4};
__.local.coord = {.x=7, .y=0, .z=0};

__.block.shape = {.x=66, .y=130, .z=130};
__.block.coord = {.x=448, .y=0, .z=0};
__.block.elems = 1115400;

=======================
__.world.size = 128;
__.world.rank = 113;

__.nodes.shape = {.x=512, .y=512, .z=512, .t=20};
__.nodes.bound = {.x=1.000000, .y=1.000000, .z=1.000000, .t=0.010000};
__.nodes.steps = {.x=0.001953, .y=0.001953, .z=0.001953, .t=0.000500};

__.param.period = {.x=1, .y=0, .z=0};
__.param.a = {.x=6.283185, .y=3.141593, .z=3.141593, .t=7.695299};
__.param.b = {.x=0.000000, .y=0.000000, .z=0.000000, .t=7.853982};

__.local.rank = 113;
__.local.shape = {.x=8, .y=4, .z=4};
__.local.coord = {.x=7, .y=0, .z=1};

__.block.shape = {.x=66, .y=130, .z=130};
__.block.coord = {.x=448, .y=0, .z=128};
__.block.elems = 1115400;

=======================
__.world.size = 128;
__.world.rank = 114;

__.nodes.shape = {.x=512, .y=512, .z=512, .t=20};
__.nodes.bound = {.x=1.000000, .y=1.000000, .z=1.000000, .t=0.010000};
__.nodes.steps = {.x=0.001953, .y=0.001953, .z=0.001953, .t=0.000500};

__.param.period = {.x=1, .y=0, .z=0};
__.param.a = {.x=6.283185, .y=3.141593, .z=3.141593, .t=7.695299};
__.param.b = {.x=0.000000, .y=0.000000, .z=0.000000, .t=7.853982};

__.local.rank = 114;
__.local.shape = {.x=8, .y=4, .z=4};
__.local.coord = {.x=7, .y=0, .z=2};

__.block.shape = {.x=66, .y=130, .z=130};
__.block.coord = {.x=448, .y=0, .z=256};
__.block.elems = 1115400;

=======================
__.world.size = 128;
__.world.rank = 115;

__.nodes.shape = {.x=512, .y=512, .z=512, .t=20};
__.nodes.bound = {.x=1.000000, .y=1.000000, .z=1.000000, .t=0.010000};
__.nodes.steps = {.x=0.001953, .y=0.001953, .z=0.001953, .t=0.000500};

__.param.period = {.x=1, .y=0, .z=0};
__.param.a = {.x=6.283185, .y=3.141593, .z=3.141593, .t=7.695299};
__.param.b = {.x=0.000000, .y=0.000000, .z=0.000000, .t=7.853982};

__.local.rank = 115;
__.local.shape = {.x=8, .y=4, .z=4};
__.local.coord = {.x=7, .y=0, .z=3};

__.block.shape = {.x=66, .y=130, .z=130};
__.block.coord = {.x=448, .y=0, .z=384};
__.block.elems = 1115400;

=======================
__.world.size = 128;
__.world.rank = 116;

__.nodes.shape = {.x=512, .y=512, .z=512, .t=20};
__.nodes.bound = {.x=1.000000, .y=1.000000, .z=1.000000, .t=0.010000};
__.nodes.steps = {.x=0.001953, .y=0.001953, .z=0.001953, .t=0.000500};

__.param.period = {.x=1, .y=0, .z=0};
__.param.a = {.x=6.283185, .y=3.141593, .z=3.141593, .t=7.695299};
__.param.b = {.x=0.000000, .y=0.000000, .z=0.000000, .t=7.853982};

__.local.rank = 116;
__.local.shape = {.x=8, .y=4, .z=4};
__.local.coord = {.x=7, .y=1, .z=0};

__.block.shape = {.x=66, .y=130, .z=130};
__.block.coord = {.x=448, .y=128, .z=0};
__.block.elems = 1115400;

=======================
__.world.size = 128;
__.world.rank = 117;

__.nodes.shape = {.x=512, .y=512, .z=512, .t=20};
__.nodes.bound = {.x=1.000000, .y=1.000000, .z=1.000000, .t=0.010000};
__.nodes.steps = {.x=0.001953, .y=0.001953, .z=0.001953, .t=0.000500};

__.param.period = {.x=1, .y=0, .z=0};
__.param.a = {.x=6.283185, .y=3.141593, .z=3.141593, .t=7.695299};
__.param.b = {.x=0.000000, .y=0.000000, .z=0.000000, .t=7.853982};

__.local.rank = 117;
__.local.shape = {.x=8, .y=4, .z=4};
__.local.coord = {.x=7, .y=1, .z=1};

__.block.shape = {.x=66, .y=130, .z=130};
__.block.coord = {.x=448, .y=128, .z=128};
__.block.elems = 1115400;

=======================
__.world.size = 128;
__.world.rank = 118;

__.nodes.shape = {.x=512, .y=512, .z=512, .t=20};
__.nodes.bound = {.x=1.000000, .y=1.000000, .z=1.000000, .t=0.010000};
__.nodes.steps = {.x=0.001953, .y=0.001953, .z=0.001953, .t=0.000500};

__.param.period = {.x=1, .y=0, .z=0};
__.param.a = {.x=6.283185, .y=3.141593, .z=3.141593, .t=7.695299};
__.param.b = {.x=0.000000, .y=0.000000, .z=0.000000, .t=7.853982};

__.local.rank = 118;
__.local.shape = {.x=8, .y=4, .z=4};
__.local.coord = {.x=7, .y=1, .z=2};

__.block.shape = {.x=66, .y=130, .z=130};
__.block.coord = {.x=448, .y=128, .z=256};
__.block.elems = 1115400;

=======================
__.world.size = 128;
__.world.rank = 119;

__.nodes.shape = {.x=512, .y=512, .z=512, .t=20};
__.nodes.bound = {.x=1.000000, .y=1.000000, .z=1.000000, .t=0.010000};
__.nodes.steps = {.x=0.001953, .y=0.001953, .z=0.001953, .t=0.000500};

__.param.period = {.x=1, .y=0, .z=0};
__.param.a = {.x=6.283185, .y=3.141593, .z=3.141593, .t=7.695299};
__.param.b = {.x=0.000000, .y=0.000000, .z=0.000000, .t=7.853982};

__.local.rank = 119;
__.local.shape = {.x=8, .y=4, .z=4};
__.local.coord = {.x=7, .y=1, .z=3};

__.block.shape = {.x=66, .y=130, .z=130};
__.block.coord = {.x=448, .y=128, .z=384};
__.block.elems = 1115400;

=======================
__.world.size = 128;
__.world.rank = 120;

__.nodes.shape = {.x=512, .y=512, .z=512, .t=20};
__.nodes.bound = {.x=1.000000, .y=1.000000, .z=1.000000, .t=0.010000};
__.nodes.steps = {.x=0.001953, .y=0.001953, .z=0.001953, .t=0.000500};

__.param.period = {.x=1, .y=0, .z=0};
__.param.a = {.x=6.283185, .y=3.141593, .z=3.141593, .t=7.695299};
__.param.b = {.x=0.000000, .y=0.000000, .z=0.000000, .t=7.853982};

__.local.rank = 120;
__.local.shape = {.x=8, .y=4, .z=4};
__.local.coord = {.x=7, .y=2, .z=0};

__.block.shape = {.x=66, .y=130, .z=130};
__.block.coord = {.x=448, .y=256, .z=0};
__.block.elems = 1115400;

=======================
__.world.size = 128;
__.world.rank = 121;

__.nodes.shape = {.x=512, .y=512, .z=512, .t=20};
__.nodes.bound = {.x=1.000000, .y=1.000000, .z=1.000000, .t=0.010000};
__.nodes.steps = {.x=0.001953, .y=0.001953, .z=0.001953, .t=0.000500};

__.param.period = {.x=1, .y=0, .z=0};
__.param.a = {.x=6.283185, .y=3.141593, .z=3.141593, .t=7.695299};
__.param.b = {.x=0.000000, .y=0.000000, .z=0.000000, .t=7.853982};

__.local.rank = 121;
__.local.shape = {.x=8, .y=4, .z=4};
__.local.coord = {.x=7, .y=2, .z=1};

__.block.shape = {.x=66, .y=130, .z=130};
__.block.coord = {.x=448, .y=256, .z=128};
__.block.elems = 1115400;

=======================
__.world.size = 128;
__.world.rank = 122;

__.nodes.shape = {.x=512, .y=512, .z=512, .t=20};
__.nodes.bound = {.x=1.000000, .y=1.000000, .z=1.000000, .t=0.010000};
__.nodes.steps = {.x=0.001953, .y=0.001953, .z=0.001953, .t=0.000500};

__.param.period = {.x=1, .y=0, .z=0};
__.param.a = {.x=6.283185, .y=3.141593, .z=3.141593, .t=7.695299};
__.param.b = {.x=0.000000, .y=0.000000, .z=0.000000, .t=7.853982};

__.local.rank = 122;
__.local.shape = {.x=8, .y=4, .z=4};
__.local.coord = {.x=7, .y=2, .z=2};

__.block.shape = {.x=66, .y=130, .z=130};
__.block.coord = {.x=448, .y=256, .z=256};
__.block.elems = 1115400;

=======================
__.world.size = 128;
__.world.rank = 123;

__.nodes.shape = {.x=512, .y=512, .z=512, .t=20};
__.nodes.bound = {.x=1.000000, .y=1.000000, .z=1.000000, .t=0.010000};
__.nodes.steps = {.x=0.001953, .y=0.001953, .z=0.001953, .t=0.000500};

__.param.period = {.x=1, .y=0, .z=0};
__.param.a = {.x=6.283185, .y=3.141593, .z=3.141593, .t=7.695299};
__.param.b = {.x=0.000000, .y=0.000000, .z=0.000000, .t=7.853982};

__.local.rank = 123;
__.local.shape = {.x=8, .y=4, .z=4};
__.local.coord = {.x=7, .y=2, .z=3};

__.block.shape = {.x=66, .y=130, .z=130};
__.block.coord = {.x=448, .y=256, .z=384};
__.block.elems = 1115400;

=======================
__.world.size = 128;
__.world.rank = 124;

__.nodes.shape = {.x=512, .y=512, .z=512, .t=20};
__.nodes.bound = {.x=1.000000, .y=1.000000, .z=1.000000, .t=0.010000};
__.nodes.steps = {.x=0.001953, .y=0.001953, .z=0.001953, .t=0.000500};

__.param.period = {.x=1, .y=0, .z=0};
__.param.a = {.x=6.283185, .y=3.141593, .z=3.141593, .t=7.695299};
__.param.b = {.x=0.000000, .y=0.000000, .z=0.000000, .t=7.853982};

__.local.rank = 124;
__.local.shape = {.x=8, .y=4, .z=4};
__.local.coord = {.x=7, .y=3, .z=0};

__.block.shape = {.x=66, .y=130, .z=130};
__.block.coord = {.x=448, .y=384, .z=0};
__.block.elems = 1115400;

=======================
__.world.size = 128;
__.world.rank = 125;

__.nodes.shape = {.x=512, .y=512, .z=512, .t=20};
__.nodes.bound = {.x=1.000000, .y=1.000000, .z=1.000000, .t=0.010000};
__.nodes.steps = {.x=0.001953, .y=0.001953, .z=0.001953, .t=0.000500};

__.param.period = {.x=1, .y=0, .z=0};
__.param.a = {.x=6.283185, .y=3.141593, .z=3.141593, .t=7.695299};
__.param.b = {.x=0.000000, .y=0.000000, .z=0.000000, .t=7.853982};

__.local.rank = 125;
__.local.shape = {.x=8, .y=4, .z=4};
__.local.coord = {.x=7, .y=3, .z=1};

__.block.shape = {.x=66, .y=130, .z=130};
__.block.coord = {.x=448, .y=384, .z=128};
__.block.elems = 1115400;

=======================
__.world.size = 128;
__.world.rank = 126;

__.nodes.shape = {.x=512, .y=512, .z=512, .t=20};
__.nodes.bound = {.x=1.000000, .y=1.000000, .z=1.000000, .t=0.010000};
__.nodes.steps = {.x=0.001953, .y=0.001953, .z=0.001953, .t=0.000500};

__.param.period = {.x=1, .y=0, .z=0};
__.param.a = {.x=6.283185, .y=3.141593, .z=3.141593, .t=7.695299};
__.param.b = {.x=0.000000, .y=0.000000, .z=0.000000, .t=7.853982};

__.local.rank = 126;
__.local.shape = {.x=8, .y=4, .z=4};
__.local.coord = {.x=7, .y=3, .z=2};

__.block.shape = {.x=66, .y=130, .z=130};
__.block.coord = {.x=448, .y=384, .z=256};
__.block.elems = 1115400;

=======================
__.world.size = 128;
__.world.rank = 127;

__.nodes.shape = {.x=512, .y=512, .z=512, .t=20};
__.nodes.bound = {.x=1.000000, .y=1.000000, .z=1.000000, .t=0.010000};
__.nodes.steps = {.x=0.001953, .y=0.001953, .z=0.001953, .t=0.000500};

__.param.period = {.x=1, .y=0, .z=0};
__.param.a = {.x=6.283185, .y=3.141593, .z=3.141593, .t=7.695299};
__.param.b = {.x=0.000000, .y=0.000000, .z=0.000000, .t=7.853982};

__.local.rank = 127;
__.local.shape = {.x=8, .y=4, .z=4};
__.local.coord = {.x=7, .y=3, .z=3};

__.block.shape = {.x=66, .y=130, .z=130};
__.block.coord = {.x=448, .y=384, .z=384};
__.block.elems = 1115400;

__TRIALS__.append((4.105996e+00, [0.000000e+00, 6.054002e-11, 2.421581e-10, 5.448489e-10, 9.686038e-10, 1.513410e-09, 2.179251e-09, 2.966108e-09, 3.873957e-09, 4.902772e-09, 6.052521e-09, 7.323171e-09, 8.714684e-09, 1.022702e-08, 1.186013e-08, 1.361397e-08, 1.548849e-08, 1.748363e-08, 1.959933e-08, 2.183553e-08, 2.419216e-08, ]))
__TRIALS__.append((4.092668e+00, [0.000000e+00, 6.054002e-11, 2.421581e-10, 5.448489e-10, 9.686038e-10, 1.513410e-09, 2.179251e-09, 2.966108e-09, 3.873957e-09, 4.902772e-09, 6.052521e-09, 7.323171e-09, 8.714684e-09, 1.022702e-08, 1.186013e-08, 1.361397e-08, 1.548849e-08, 1.748363e-08, 1.959933e-08, 2.183553e-08, 2.419216e-08, ]))
__TRIALS__.append((4.079518e+00, [0.000000e+00, 6.054002e-11, 2.421581e-10, 5.448489e-10, 9.686038e-10, 1.513410e-09, 2.179251e-09, 2.966108e-09, 3.873957e-09, 4.902772e-09, 6.052521e-09, 7.323171e-09, 8.714684e-09, 1.022702e-08, 1.186013e-08, 1.361397e-08, 1.548849e-08, 1.748363e-08, 1.959933e-08, 2.183553e-08, 2.419216e-08, ]))
__TRIALS__.append((4.076374e+00, [0.000000e+00, 6.054002e-11, 2.421581e-10, 5.448489e-10, 9.686038e-10, 1.513410e-09, 2.179251e-09, 2.966108e-09, 3.873957e-09, 4.902772e-09, 6.052521e-09, 7.323171e-09, 8.714684e-09, 1.022702e-08, 1.186013e-08, 1.361397e-08, 1.548849e-08, 1.748363e-08, 1.959933e-08, 2.183553e-08, 2.419216e-08, ]))
__TRIALS__.append((4.071849e+00, [0.000000e+00, 6.054002e-11, 2.421581e-10, 5.448489e-10, 9.686038e-10, 1.513410e-09, 2.179251e-09, 2.966108e-09, 3.873957e-09, 4.902772e-09, 6.052521e-09, 7.323171e-09, 8.714684e-09, 1.022702e-08, 1.186013e-08, 1.361397e-08, 1.548849e-08, 1.748363e-08, 1.959933e-08, 2.183553e-08, 2.419216e-08, ]))
__TRIALS__.append((4.079285e+00, [0.000000e+00, 6.054002e-11, 2.421581e-10, 5.448489e-10, 9.686038e-10, 1.513410e-09, 2.179251e-09, 2.966108e-09, 3.873957e-09, 4.902772e-09, 6.052521e-09, 7.323171e-09, 8.714684e-09, 1.022702e-08, 1.186013e-08, 1.361397e-08, 1.548849e-08, 1.748363e-08, 1.959933e-08, 2.183553e-08, 2.419216e-08, ]))
__TRIALS__.append((4.069283e+00, [0.000000e+00, 6.054002e-11, 2.421581e-10, 5.448489e-10, 9.686038e-10, 1.513410e-09, 2.179251e-09, 2.966108e-09, 3.873957e-09, 4.902772e-09, 6.052521e-09, 7.323171e-09, 8.714684e-09, 1.022702e-08, 1.186013e-08, 1.361397e-08, 1.548849e-08, 1.748363e-08, 1.959933e-08, 2.183553e-08, 2.419216e-08, ]))
__TRIALS__.append((4.070088e+00, [0.000000e+00, 6.054002e-11, 2.421581e-10, 5.448489e-10, 9.686038e-10, 1.513410e-09, 2.179251e-09, 2.966108e-09, 3.873957e-09, 4.902772e-09, 6.052521e-09, 7.323171e-09, 8.714684e-09, 1.022702e-08, 1.186013e-08, 1.361397e-08, 1.548849e-08, 1.748363e-08, 1.959933e-08, 2.183553e-08, 2.419216e-08, ]))
__TRIALS__.append((4.076611e+00, [0.000000e+00, 6.054002e-11, 2.421581e-10, 5.448489e-10, 9.686038e-10, 1.513410e-09, 2.179251e-09, 2.966108e-09, 3.873957e-09, 4.902772e-09, 6.052521e-09, 7.323171e-09, 8.714684e-09, 1.022702e-08, 1.186013e-08, 1.361397e-08, 1.548849e-08, 1.748363e-08, 1.959933e-08, 2.183553e-08, 2.419216e-08, ]))
__TRIALS__.append((4.079509e+00, [0.000000e+00, 6.054002e-11, 2.421581e-10, 5.448489e-10, 9.686038e-10, 1.513410e-09, 2.179251e-09, 2.966108e-09, 3.873957e-09, 4.902772e-09, 6.052521e-09, 7.323171e-09, 8.714684e-09, 1.022702e-08, 1.186013e-08, 1.361397e-08, 1.548849e-08, 1.748363e-08, 1.959933e-08, 2.183553e-08, 2.419216e-08, ]))
