# Running __TRIALS__ with ADJUSTED_SAMPLING/DELTA_STOPPING and epsilon=8.000000e-06, comm_size=32, seed=42
__TRIALS__ = [
#   (trial_time, trial_iters, trial_points, trial_error),
    (6.937946e+01, 879648000, 879648000, 9.530953e-06),  # __TRIALS__
    (6.937702e+01, 879648000, 879648000, 1.642863e-05),  # __TRIALS__
    (6.936944e+01, 879648000, 879648000, 8.588964e-06),  # __TRIALS__
    (6.937800e+01, 879648000, 879648000, 6.754667e-06),  # __TRIALS__
    (6.937130e+01, 879648000, 879648000, 4.544169e-06),  # __TRIALS__
    (6.937440e+01, 879648000, 879648000, 1.721592e-06),  # __TRIALS__
    (6.936392e+01, 879648000, 879648000, 1.938188e-06),  # __TRIALS__
    (6.936867e+01, 879648000, 879648000, 6.390749e-06),  # __TRIALS__
    (6.936734e+01, 879648000, 879648000, 1.777348e-05),  # __TRIALS__
    (6.936845e+01, 879648000, 879648000, 7.848329e-07),  # __TRIALS__
]  # __TRIALS__
# Done.
