Sender: LSF System <lsfadmin@polus-c4-ib.bmc.hpc.cs.msu.ru>
Subject: Job 798525: <# this file was automaticly created by mpisubmit.pl script for edu-cmc-skmodel21-622-16 #;source /polusfs/setenv/setup.SMPI;#BSUB -n 1;#BSUB -W 00:30;#BSUB -o main_adjusted_delta.%J.out;#BSUB -e main_adjusted_delta.%J.err;OMP_NUM_THREADS=1 mpiexec main_adjusted_delta 5.0e-6 42> in cluster <MSUCluster> Exited

Job <# this file was automaticly created by mpisubmit.pl script for edu-cmc-skmodel21-622-16 #;source /polusfs/setenv/setup.SMPI;#BSUB -n 1;#BSUB -W 00:30;#BSUB -o main_adjusted_delta.%J.out;#BSUB -e main_adjusted_delta.%J.err;OMP_NUM_THREADS=1 mpiexec main_adjusted_delta 5.0e-6 42> was submitted from host <polus-ib.bmc.hpc.cs.msu.ru> by user <edu-cmc-skmodel21-622-16> in cluster <MSUCluster> at Sun Nov  7 10:13:46 2021
Job was executed on host(s) <polus-c4-ib.bmc.hpc.cs.msu.ru>, in queue <short>, as user <edu-cmc-skmodel21-622-16> in cluster <MSUCluster> at Sun Nov  7 10:13:47 2021
</home_edu/edu-cmc-skmodel21-622/edu-cmc-skmodel21-622-16> was used as the home directory.
</home_edu/edu-cmc-skmodel21-622/edu-cmc-skmodel21-622-16/solution> was used as the working directory.
Started at Sun Nov  7 10:13:47 2021
Terminated at Sun Nov  7 10:43:54 2021
Results reported at Sun Nov  7 10:43:54 2021

Your job looked like:

------------------------------------------------------------
# LSBATCH: User input
# this file was automaticly created by mpisubmit.pl script for edu-cmc-skmodel21-622-16 #
source /polusfs/setenv/setup.SMPI
#BSUB -n 1
#BSUB -W 00:30
#BSUB -o main_adjusted_delta.%J.out
#BSUB -e main_adjusted_delta.%J.err
OMP_NUM_THREADS=1 mpiexec main_adjusted_delta 5.0e-6 42

------------------------------------------------------------

TERM_RUNLIMIT: job killed after reaching LSF run time limit.
Exited with exit code 140.

Resource usage summary:

    CPU time :                                   1806.00 sec.
    Max Memory :                                 70 MB
    Average Memory :                             69.73 MB
    Total Requested Memory :                     -
    Delta Memory :                               -
    Max Swap :                                   -
    Max Processes :                              5
    Max Threads :                                12
    Run time :                                   1807 sec.
    Turnaround time :                            1808 sec.

The output (if any) follows:

# Running __TRIALS__ with ADJUSTED_SAMPLING/DELTA_STOPPING and epsilon=5.000000e-06, comm_size=1, seed=42
__TRIALS__ = [
#   (trial_time, trial_iters, trial_points, trial_error),
    (3.045783e+02, 1407436800, 1407436800, 1.869107e-06),  # __TRIALS__
    (3.046042e+02, 1407436800, 1407436800, 8.753555e-06),  # __TRIALS__
    (3.045489e+02, 1407436800, 1407436800, 3.376120e-06),  # __TRIALS__
    (3.045610e+02, 1407436800, 1407436800, 1.088245e-05),  # __TRIALS__
    (3.045551e+02, 1407436800, 1407436800, 1.742613e-06),  # __TRIALS__
--------------------------------------------------------------------------
mpiexec noticed that process rank 0 with PID 0 on node polus-c4-ib exited on signal 12 (User defined signal 2).
--------------------------------------------------------------------------


PS:

Read file <main_adjusted_delta.798525.err> for stderr output of this job.

