# Running __TRIALS__ with FILTERED_SAMPLING/DELTA_STOPPING and epsilon=8.000000e-06, comm_size=4, seed=42
__TRIALS__ = [
#   (trial_time, trial_iters, trial_points, trial_error),
    (8.190981e+02, 3360000000, 879681849, 3.822609e-05),  # __TRIALS__
    (8.190861e+02, 3360000000, 879673370, 3.583668e-05),  # __TRIALS__
