Sender: LSF System <lsfadmin@polus-c3-ib.bmc.hpc.cs.msu.ru>
Subject: Job 862697: <source /polusfs/setenv/setup.OpenMPI;#BSUB -n 4;#BSUB -W 00:15;#BSUB -gpu "num=2:mode=exclusive_process";#BSUB -R "span[ptile=2]";#BSUB -o main.%J.out;#BSUB -e main.%J.err;OMP_NUM_THREADS=1 mpiexec ./main 1 0.01 128 20> in cluster <MSUCluster> Done

Job <source /polusfs/setenv/setup.OpenMPI;#BSUB -n 4;#BSUB -W 00:15;#BSUB -gpu "num=2:mode=exclusive_process";#BSUB -R "span[ptile=2]";#BSUB -o main.%J.out;#BSUB -e main.%J.err;OMP_NUM_THREADS=1 mpiexec ./main 1 0.01 128 20> was submitted from host <polus-ib.bmc.hpc.cs.msu.ru> by user <edu-cmc-skmodel21-622-16> in cluster <MSUCluster> at Fri Dec 24 04:15:42 2021
Job was executed on host(s) <2*polus-c3-ib.bmc.hpc.cs.msu.ru>, in queue <short>, as user <edu-cmc-skmodel21-622-16> in cluster <MSUCluster> at Fri Dec 24 04:16:30 2021
                            <2*polus-c2-ib.bmc.hpc.cs.msu.ru>
</home_edu/edu-cmc-skmodel21-622/edu-cmc-skmodel21-622-16> was used as the home directory.
</home_edu/edu-cmc-skmodel21-622/edu-cmc-skmodel21-622-16/solution> was used as the working directory.
Started at Fri Dec 24 04:16:30 2021
Terminated at Fri Dec 24 04:16:34 2021
Results reported at Fri Dec 24 04:16:34 2021

Your job looked like:

------------------------------------------------------------
# LSBATCH: User input
source /polusfs/setenv/setup.OpenMPI
#BSUB -n 4
#BSUB -W 00:15
#BSUB -gpu "num=2:mode=exclusive_process"
#BSUB -R "span[ptile=2]"
#BSUB -o main.%J.out
#BSUB -e main.%J.err
OMP_NUM_THREADS=1 mpiexec ./main 1 0.01 128 20

------------------------------------------------------------

Successfully completed.

Resource usage summary:

    CPU time :                                   3.28 sec.
    Max Memory :                                 162 MB
    Average Memory :                             2.33 MB
    Total Requested Memory :                     -
    Delta Memory :                               -
    Max Swap :                                   -
    Max Processes :                              6
    Max Threads :                                19
    Run time :                                   3 sec.
    Turnaround time :                            52 sec.

The output (if any) follows:

WORLD[0/4] | LOCAL[0/2] | CUDA[0/2] | 0002:01:00.0
__PARAMS__ = {'P': 4, 'O': 0, 'L': 1.000000e+00, 'T': 1.000000e-02, 'N': 128, 'K': 20}
WORLD[1/4] | LOCAL[1/2] | CUDA[1/2] | 0006:01:00.0
WORLD[3/4] | LOCAL[1/2] | CUDA[1/2] | 0006:01:00.0
WORLD[2/4] | LOCAL[0/2] | CUDA[0/2] | 0002:01:00.0
=======================
__.world.size = 4;
__.world.rank = 0;

__.nodes.shape = {.x=128, .y=128, .z=128, .t=20};
__.nodes.bound = {.x=1.000000, .y=1.000000, .z=1.000000, .t=0.010000};
__.nodes.steps = {.x=0.007812, .y=0.007812, .z=0.007812, .t=0.000500};

__.param.period = {.x=1, .y=0, .z=0};
__.param.a = {.x=6.283185, .y=3.141593, .z=3.141593, .t=7.695299};
__.param.b = {.x=0.000000, .y=0.000000, .z=0.000000, .t=7.853982};

__.local.rank = 0;
__.local.shape = {.x=2, .y=2, .z=1};
__.local.coord = {.x=0, .y=0, .z=0};

__.block.shape = {.x=66, .y=66, .z=130};
__.block.coord = {.x=0, .y=0, .z=0};
__.block.elems = 566280;

=======================
__.world.size = 4;
__.world.rank = 1;

__.nodes.shape = {.x=128, .y=128, .z=128, .t=20};
__.nodes.bound = {.x=1.000000, .y=1.000000, .z=1.000000, .t=0.010000};
__.nodes.steps = {.x=0.007812, .y=0.007812, .z=0.007812, .t=0.000500};

__.param.period = {.x=1, .y=0, .z=0};
__.param.a = {.x=6.283185, .y=3.141593, .z=3.141593, .t=7.695299};
__.param.b = {.x=0.000000, .y=0.000000, .z=0.000000, .t=7.853982};

__.local.rank = 1;
__.local.shape = {.x=2, .y=2, .z=1};
__.local.coord = {.x=0, .y=1, .z=0};

__.block.shape = {.x=66, .y=66, .z=130};
__.block.coord = {.x=0, .y=64, .z=0};
__.block.elems = 566280;

=======================
__.world.size = 4;
__.world.rank = 3;

__.nodes.shape = {.x=128, .y=128, .z=128, .t=20};
__.nodes.bound = {.x=1.000000, .y=1.000000, .z=1.000000, .t=0.010000};
__.nodes.steps = {.x=0.007812, .y=0.007812, .z=0.007812, .t=0.000500};

__.param.period = {.x=1, .y=0, .z=0};
__.param.a = {.x=6.283185, .y=3.141593, .z=3.141593, .t=7.695299};
__.param.b = {.x=0.000000, .y=0.000000, .z=0.000000, .t=7.853982};

__.local.rank = 3;
__.local.shape = {.x=2, .y=2, .z=1};
__.local.coord = {.x=1, .y=1, .z=0};

__.block.shape = {.x=66, .y=66, .z=130};
__.block.coord = {.x=64, .y=64, .z=0};
__.block.elems = 566280;

=======================
__.world.size = 4;
__.world.rank = 2;

__.nodes.shape = {.x=128, .y=128, .z=128, .t=20};
__.nodes.bound = {.x=1.000000, .y=1.000000, .z=1.000000, .t=0.010000};
__.nodes.steps = {.x=0.007812, .y=0.007812, .z=0.007812, .t=0.000500};

__.param.period = {.x=1, .y=0, .z=0};
__.param.a = {.x=6.283185, .y=3.141593, .z=3.141593, .t=7.695299};
__.param.b = {.x=0.000000, .y=0.000000, .z=0.000000, .t=7.853982};

__.local.rank = 2;
__.local.shape = {.x=2, .y=2, .z=1};
__.local.coord = {.x=1, .y=0, .z=0};

__.block.shape = {.x=66, .y=66, .z=130};
__.block.coord = {.x=64, .y=0, .z=0};
__.block.elems = 566280;

__TRIALS__.append((1.018987e-01, [0.000000e+00, 1.105544e-09, 4.422145e-09, 9.949703e-09, 1.768806e-08, 2.763697e-08, 3.979616e-08, 5.416526e-08, 7.074384e-08, 8.953142e-08, 1.105274e-07, 1.337313e-07, 1.591422e-07, 1.867596e-07, 2.165825e-07, 2.486100e-07, 2.828413e-07, 3.192754e-07, 3.579110e-07, 3.987471e-07, 4.417826e-07, ]))
__TRIALS__.append((5.681682e-02, [0.000000e+00, 1.105544e-09, 4.422145e-09, 9.949703e-09, 1.768806e-08, 2.763697e-08, 3.979616e-08, 5.416526e-08, 7.074384e-08, 8.953142e-08, 1.105274e-07, 1.337313e-07, 1.591422e-07, 1.867596e-07, 2.165825e-07, 2.486100e-07, 2.828413e-07, 3.192754e-07, 3.579110e-07, 3.987471e-07, 4.417826e-07, ]))
__TRIALS__.append((5.686406e-02, [0.000000e+00, 1.105544e-09, 4.422145e-09, 9.949703e-09, 1.768806e-08, 2.763697e-08, 3.979616e-08, 5.416526e-08, 7.074384e-08, 8.953142e-08, 1.105274e-07, 1.337313e-07, 1.591422e-07, 1.867596e-07, 2.165825e-07, 2.486100e-07, 2.828413e-07, 3.192754e-07, 3.579110e-07, 3.987471e-07, 4.417826e-07, ]))
__TRIALS__.append((5.666736e-02, [0.000000e+00, 1.105544e-09, 4.422145e-09, 9.949703e-09, 1.768806e-08, 2.763697e-08, 3.979616e-08, 5.416526e-08, 7.074384e-08, 8.953142e-08, 1.105274e-07, 1.337313e-07, 1.591422e-07, 1.867596e-07, 2.165825e-07, 2.486100e-07, 2.828413e-07, 3.192754e-07, 3.579110e-07, 3.987471e-07, 4.417826e-07, ]))
__TRIALS__.append((5.656234e-02, [0.000000e+00, 1.105544e-09, 4.422145e-09, 9.949703e-09, 1.768806e-08, 2.763697e-08, 3.979616e-08, 5.416526e-08, 7.074384e-08, 8.953142e-08, 1.105274e-07, 1.337313e-07, 1.591422e-07, 1.867596e-07, 2.165825e-07, 2.486100e-07, 2.828413e-07, 3.192754e-07, 3.579110e-07, 3.987471e-07, 4.417826e-07, ]))
__TRIALS__.append((5.654170e-02, [0.000000e+00, 1.105544e-09, 4.422145e-09, 9.949703e-09, 1.768806e-08, 2.763697e-08, 3.979616e-08, 5.416526e-08, 7.074384e-08, 8.953142e-08, 1.105274e-07, 1.337313e-07, 1.591422e-07, 1.867596e-07, 2.165825e-07, 2.486100e-07, 2.828413e-07, 3.192754e-07, 3.579110e-07, 3.987471e-07, 4.417826e-07, ]))
__TRIALS__.append((5.607659e-02, [0.000000e+00, 1.105544e-09, 4.422145e-09, 9.949703e-09, 1.768806e-08, 2.763697e-08, 3.979616e-08, 5.416526e-08, 7.074384e-08, 8.953142e-08, 1.105274e-07, 1.337313e-07, 1.591422e-07, 1.867596e-07, 2.165825e-07, 2.486100e-07, 2.828413e-07, 3.192754e-07, 3.579110e-07, 3.987471e-07, 4.417826e-07, ]))
__TRIALS__.append((5.620607e-02, [0.000000e+00, 1.105544e-09, 4.422145e-09, 9.949703e-09, 1.768806e-08, 2.763697e-08, 3.979616e-08, 5.416526e-08, 7.074384e-08, 8.953142e-08, 1.105274e-07, 1.337313e-07, 1.591422e-07, 1.867596e-07, 2.165825e-07, 2.486100e-07, 2.828413e-07, 3.192754e-07, 3.579110e-07, 3.987471e-07, 4.417826e-07, ]))
__TRIALS__.append((5.617499e-02, [0.000000e+00, 1.105544e-09, 4.422145e-09, 9.949703e-09, 1.768806e-08, 2.763697e-08, 3.979616e-08, 5.416526e-08, 7.074384e-08, 8.953142e-08, 1.105274e-07, 1.337313e-07, 1.591422e-07, 1.867596e-07, 2.165825e-07, 2.486100e-07, 2.828413e-07, 3.192754e-07, 3.579110e-07, 3.987471e-07, 4.417826e-07, ]))
__TRIALS__.append((5.635519e-02, [0.000000e+00, 1.105544e-09, 4.422145e-09, 9.949703e-09, 1.768806e-08, 2.763697e-08, 3.979616e-08, 5.416526e-08, 7.074384e-08, 8.953142e-08, 1.105274e-07, 1.337313e-07, 1.591422e-07, 1.867596e-07, 2.165825e-07, 2.486100e-07, 2.828413e-07, 3.192754e-07, 3.579110e-07, 3.987471e-07, 4.417826e-07, ]))


PS:

Read file <main.862697.err> for stderr output of this job.

