Sender: LSF System <lsfadmin@polus-c1-ib.bmc.hpc.cs.msu.ru>
Subject: Job 836937: <# this file was automaticly created by mpisubmit.pl script for edu-cmc-skmodel21-622-16 #;source /polusfs/setenv/setup.SMPI;#BSUB -n 20;#BSUB -W 00:15;#BSUB -o main.%J.out;#BSUB -e main.%J.err;OMP_NUM_THREADS=1 mpiexec main 3.141592653589793 0.01 512 20> in cluster <MSUCluster> Done

Job <# this file was automaticly created by mpisubmit.pl script for edu-cmc-skmodel21-622-16 #;source /polusfs/setenv/setup.SMPI;#BSUB -n 20;#BSUB -W 00:15;#BSUB -o main.%J.out;#BSUB -e main.%J.err;OMP_NUM_THREADS=1 mpiexec main 3.141592653589793 0.01 512 20> was submitted from host <polus-ib.bmc.hpc.cs.msu.ru> by user <edu-cmc-skmodel21-622-16> in cluster <MSUCluster> at Mon Dec 13 23:17:08 2021
Job was executed on host(s) <9*polus-c1-ib.bmc.hpc.cs.msu.ru>, in queue <short>, as user <edu-cmc-skmodel21-622-16> in cluster <MSUCluster> at Mon Dec 13 23:17:09 2021
                            <11*polus-c2-ib.bmc.hpc.cs.msu.ru>
</home_edu/edu-cmc-skmodel21-622/edu-cmc-skmodel21-622-16> was used as the home directory.
</home_edu/edu-cmc-skmodel21-622/edu-cmc-skmodel21-622-16/solution> was used as the working directory.
Started at Mon Dec 13 23:17:09 2021
Terminated at Mon Dec 13 23:17:56 2021
Results reported at Mon Dec 13 23:17:56 2021

Your job looked like:

------------------------------------------------------------
# LSBATCH: User input
# this file was automaticly created by mpisubmit.pl script for edu-cmc-skmodel21-622-16 #
source /polusfs/setenv/setup.SMPI
#BSUB -n 20
#BSUB -W 00:15
#BSUB -o main.%J.out
#BSUB -e main.%J.err
OMP_NUM_THREADS=1 mpiexec main 3.141592653589793 0.01 512 20

------------------------------------------------------------

Successfully completed.

Resource usage summary:

    CPU time :                                   909.50 sec.
    Max Memory :                                 1934 MB
    Average Memory :                             1696.56 MB
    Total Requested Memory :                     -
    Delta Memory :                               -
    Max Swap :                                   -
    Max Processes :                              13
    Max Threads :                                36
    Run time :                                   46 sec.
    Turnaround time :                            48 sec.

The output (if any) follows:

__PARAMS__ = {'P': 20, 'O': 0, 'L': 3.141593e+00, 'T': 1.000000e-02, 'N': 512, 'K': 20}
=======================
__.world.size = 20;
__.world.rank = 0;

__.nodes.shape = {.x=512, .y=512, .z=512, .t=20};
__.nodes.bound = {.x=3.141593, .y=3.141593, .z=3.141593, .t=0.010000};
__.nodes.steps = {.x=0.006136, .y=0.006136, .z=0.006136, .t=0.000500};

__.param.period = {.x=1, .y=0, .z=0};
__.param.a = {.x=2.000000, .y=1.000000, .z=1.000000, .t=2.449490};
__.param.b = {.x=0.000000, .y=0.000000, .z=0.000000, .t=7.853982};

__.local.rank = 0;
__.local.shape = {.x=5, .y=2, .z=2};
__.local.coord = {.x=0, .y=0, .z=0};

__.block.shape = {.x=105, .y=258, .z=258};
__.block.coord = {.x=0, .y=0, .z=0};
__.block.elems = 6989220;

=======================
__.world.size = 20;
__.world.rank = 1;

__.nodes.shape = {.x=512, .y=512, .z=512, .t=20};
__.nodes.bound = {.x=3.141593, .y=3.141593, .z=3.141593, .t=0.010000};
__.nodes.steps = {.x=0.006136, .y=0.006136, .z=0.006136, .t=0.000500};

__.param.period = {.x=1, .y=0, .z=0};
__.param.a = {.x=2.000000, .y=1.000000, .z=1.000000, .t=2.449490};
__.param.b = {.x=0.000000, .y=0.000000, .z=0.000000, .t=7.853982};

__.local.rank = 1;
__.local.shape = {.x=5, .y=2, .z=2};
__.local.coord = {.x=0, .y=0, .z=1};

__.block.shape = {.x=105, .y=258, .z=258};
__.block.coord = {.x=0, .y=0, .z=256};
__.block.elems = 6989220;

=======================
__.world.size = 20;
__.world.rank = 2;

__.nodes.shape = {.x=512, .y=512, .z=512, .t=20};
__.nodes.bound = {.x=3.141593, .y=3.141593, .z=3.141593, .t=0.010000};
__.nodes.steps = {.x=0.006136, .y=0.006136, .z=0.006136, .t=0.000500};

__.param.period = {.x=1, .y=0, .z=0};
__.param.a = {.x=2.000000, .y=1.000000, .z=1.000000, .t=2.449490};
__.param.b = {.x=0.000000, .y=0.000000, .z=0.000000, .t=7.853982};

__.local.rank = 2;
__.local.shape = {.x=5, .y=2, .z=2};
__.local.coord = {.x=0, .y=1, .z=0};

__.block.shape = {.x=105, .y=258, .z=258};
__.block.coord = {.x=0, .y=256, .z=0};
__.block.elems = 6989220;

=======================
__.world.size = 20;
__.world.rank = 3;

__.nodes.shape = {.x=512, .y=512, .z=512, .t=20};
__.nodes.bound = {.x=3.141593, .y=3.141593, .z=3.141593, .t=0.010000};
__.nodes.steps = {.x=0.006136, .y=0.006136, .z=0.006136, .t=0.000500};

__.param.period = {.x=1, .y=0, .z=0};
__.param.a = {.x=2.000000, .y=1.000000, .z=1.000000, .t=2.449490};
__.param.b = {.x=0.000000, .y=0.000000, .z=0.000000, .t=7.853982};

__.local.rank = 3;
__.local.shape = {.x=5, .y=2, .z=2};
__.local.coord = {.x=0, .y=1, .z=1};

__.block.shape = {.x=105, .y=258, .z=258};
__.block.coord = {.x=0, .y=256, .z=256};
__.block.elems = 6989220;

=======================
__.world.size = 20;
__.world.rank = 4;

__.nodes.shape = {.x=512, .y=512, .z=512, .t=20};
__.nodes.bound = {.x=3.141593, .y=3.141593, .z=3.141593, .t=0.010000};
__.nodes.steps = {.x=0.006136, .y=0.006136, .z=0.006136, .t=0.000500};

__.param.period = {.x=1, .y=0, .z=0};
__.param.a = {.x=2.000000, .y=1.000000, .z=1.000000, .t=2.449490};
__.param.b = {.x=0.000000, .y=0.000000, .z=0.000000, .t=7.853982};

__.local.rank = 4;
__.local.shape = {.x=5, .y=2, .z=2};
__.local.coord = {.x=1, .y=0, .z=0};

__.block.shape = {.x=105, .y=258, .z=258};
__.block.coord = {.x=103, .y=0, .z=0};
__.block.elems = 6989220;

=======================
__.world.size = 20;
__.world.rank = 5;

__.nodes.shape = {.x=512, .y=512, .z=512, .t=20};
__.nodes.bound = {.x=3.141593, .y=3.141593, .z=3.141593, .t=0.010000};
__.nodes.steps = {.x=0.006136, .y=0.006136, .z=0.006136, .t=0.000500};

__.param.period = {.x=1, .y=0, .z=0};
__.param.a = {.x=2.000000, .y=1.000000, .z=1.000000, .t=2.449490};
__.param.b = {.x=0.000000, .y=0.000000, .z=0.000000, .t=7.853982};

__.local.rank = 5;
__.local.shape = {.x=5, .y=2, .z=2};
__.local.coord = {.x=1, .y=0, .z=1};

__.block.shape = {.x=105, .y=258, .z=258};
__.block.coord = {.x=103, .y=0, .z=256};
__.block.elems = 6989220;

=======================
__.world.size = 20;
__.world.rank = 6;

__.nodes.shape = {.x=512, .y=512, .z=512, .t=20};
__.nodes.bound = {.x=3.141593, .y=3.141593, .z=3.141593, .t=0.010000};
__.nodes.steps = {.x=0.006136, .y=0.006136, .z=0.006136, .t=0.000500};

__.param.period = {.x=1, .y=0, .z=0};
__.param.a = {.x=2.000000, .y=1.000000, .z=1.000000, .t=2.449490};
__.param.b = {.x=0.000000, .y=0.000000, .z=0.000000, .t=7.853982};

__.local.rank = 6;
__.local.shape = {.x=5, .y=2, .z=2};
__.local.coord = {.x=1, .y=1, .z=0};

__.block.shape = {.x=105, .y=258, .z=258};
__.block.coord = {.x=103, .y=256, .z=0};
__.block.elems = 6989220;

=======================
__.world.size = 20;
__.world.rank = 7;

__.nodes.shape = {.x=512, .y=512, .z=512, .t=20};
__.nodes.bound = {.x=3.141593, .y=3.141593, .z=3.141593, .t=0.010000};
__.nodes.steps = {.x=0.006136, .y=0.006136, .z=0.006136, .t=0.000500};

__.param.period = {.x=1, .y=0, .z=0};
__.param.a = {.x=2.000000, .y=1.000000, .z=1.000000, .t=2.449490};
__.param.b = {.x=0.000000, .y=0.000000, .z=0.000000, .t=7.853982};

__.local.rank = 7;
__.local.shape = {.x=5, .y=2, .z=2};
__.local.coord = {.x=1, .y=1, .z=1};

__.block.shape = {.x=105, .y=258, .z=258};
__.block.coord = {.x=103, .y=256, .z=256};
__.block.elems = 6989220;

=======================
__.world.size = 20;
__.world.rank = 8;

__.nodes.shape = {.x=512, .y=512, .z=512, .t=20};
__.nodes.bound = {.x=3.141593, .y=3.141593, .z=3.141593, .t=0.010000};
__.nodes.steps = {.x=0.006136, .y=0.006136, .z=0.006136, .t=0.000500};

__.param.period = {.x=1, .y=0, .z=0};
__.param.a = {.x=2.000000, .y=1.000000, .z=1.000000, .t=2.449490};
__.param.b = {.x=0.000000, .y=0.000000, .z=0.000000, .t=7.853982};

__.local.rank = 8;
__.local.shape = {.x=5, .y=2, .z=2};
__.local.coord = {.x=2, .y=0, .z=0};

__.block.shape = {.x=105, .y=258, .z=258};
__.block.coord = {.x=206, .y=0, .z=0};
__.block.elems = 6989220;

=======================
__.world.size = 20;
__.world.rank = 9;

__.nodes.shape = {.x=512, .y=512, .z=512, .t=20};
__.nodes.bound = {.x=3.141593, .y=3.141593, .z=3.141593, .t=0.010000};
__.nodes.steps = {.x=0.006136, .y=0.006136, .z=0.006136, .t=0.000500};

__.param.period = {.x=1, .y=0, .z=0};
__.param.a = {.x=2.000000, .y=1.000000, .z=1.000000, .t=2.449490};
__.param.b = {.x=0.000000, .y=0.000000, .z=0.000000, .t=7.853982};

__.local.rank = 9;
__.local.shape = {.x=5, .y=2, .z=2};
__.local.coord = {.x=2, .y=0, .z=1};

__.block.shape = {.x=105, .y=258, .z=258};
__.block.coord = {.x=206, .y=0, .z=256};
__.block.elems = 6989220;

=======================
__.world.size = 20;
__.world.rank = 10;

__.nodes.shape = {.x=512, .y=512, .z=512, .t=20};
__.nodes.bound = {.x=3.141593, .y=3.141593, .z=3.141593, .t=0.010000};
__.nodes.steps = {.x=0.006136, .y=0.006136, .z=0.006136, .t=0.000500};

__.param.period = {.x=1, .y=0, .z=0};
__.param.a = {.x=2.000000, .y=1.000000, .z=1.000000, .t=2.449490};
__.param.b = {.x=0.000000, .y=0.000000, .z=0.000000, .t=7.853982};

__.local.rank = 10;
__.local.shape = {.x=5, .y=2, .z=2};
__.local.coord = {.x=2, .y=1, .z=0};

__.block.shape = {.x=105, .y=258, .z=258};
__.block.coord = {.x=206, .y=256, .z=0};
__.block.elems = 6989220;

=======================
__.world.size = 20;
__.world.rank = 11;

__.nodes.shape = {.x=512, .y=512, .z=512, .t=20};
__.nodes.bound = {.x=3.141593, .y=3.141593, .z=3.141593, .t=0.010000};
__.nodes.steps = {.x=0.006136, .y=0.006136, .z=0.006136, .t=0.000500};

__.param.period = {.x=1, .y=0, .z=0};
__.param.a = {.x=2.000000, .y=1.000000, .z=1.000000, .t=2.449490};
__.param.b = {.x=0.000000, .y=0.000000, .z=0.000000, .t=7.853982};

__.local.rank = 11;
__.local.shape = {.x=5, .y=2, .z=2};
__.local.coord = {.x=2, .y=1, .z=1};

__.block.shape = {.x=105, .y=258, .z=258};
__.block.coord = {.x=206, .y=256, .z=256};
__.block.elems = 6989220;

=======================
__.world.size = 20;
__.world.rank = 12;

__.nodes.shape = {.x=512, .y=512, .z=512, .t=20};
__.nodes.bound = {.x=3.141593, .y=3.141593, .z=3.141593, .t=0.010000};
__.nodes.steps = {.x=0.006136, .y=0.006136, .z=0.006136, .t=0.000500};

__.param.period = {.x=1, .y=0, .z=0};
__.param.a = {.x=2.000000, .y=1.000000, .z=1.000000, .t=2.449490};
__.param.b = {.x=0.000000, .y=0.000000, .z=0.000000, .t=7.853982};

__.local.rank = 12;
__.local.shape = {.x=5, .y=2, .z=2};
__.local.coord = {.x=3, .y=0, .z=0};

__.block.shape = {.x=105, .y=258, .z=258};
__.block.coord = {.x=309, .y=0, .z=0};
__.block.elems = 6989220;

=======================
__.world.size = 20;
__.world.rank = 13;

__.nodes.shape = {.x=512, .y=512, .z=512, .t=20};
__.nodes.bound = {.x=3.141593, .y=3.141593, .z=3.141593, .t=0.010000};
__.nodes.steps = {.x=0.006136, .y=0.006136, .z=0.006136, .t=0.000500};

__.param.period = {.x=1, .y=0, .z=0};
__.param.a = {.x=2.000000, .y=1.000000, .z=1.000000, .t=2.449490};
__.param.b = {.x=0.000000, .y=0.000000, .z=0.000000, .t=7.853982};

__.local.rank = 13;
__.local.shape = {.x=5, .y=2, .z=2};
__.local.coord = {.x=3, .y=0, .z=1};

__.block.shape = {.x=105, .y=258, .z=258};
__.block.coord = {.x=309, .y=0, .z=256};
__.block.elems = 6989220;

=======================
__.world.size = 20;
__.world.rank = 14;

__.nodes.shape = {.x=512, .y=512, .z=512, .t=20};
__.nodes.bound = {.x=3.141593, .y=3.141593, .z=3.141593, .t=0.010000};
__.nodes.steps = {.x=0.006136, .y=0.006136, .z=0.006136, .t=0.000500};

__.param.period = {.x=1, .y=0, .z=0};
__.param.a = {.x=2.000000, .y=1.000000, .z=1.000000, .t=2.449490};
__.param.b = {.x=0.000000, .y=0.000000, .z=0.000000, .t=7.853982};

__.local.rank = 14;
__.local.shape = {.x=5, .y=2, .z=2};
__.local.coord = {.x=3, .y=1, .z=0};

__.block.shape = {.x=105, .y=258, .z=258};
__.block.coord = {.x=309, .y=256, .z=0};
__.block.elems = 6989220;

=======================
__.world.size = 20;
__.world.rank = 15;

__.nodes.shape = {.x=512, .y=512, .z=512, .t=20};
__.nodes.bound = {.x=3.141593, .y=3.141593, .z=3.141593, .t=0.010000};
__.nodes.steps = {.x=0.006136, .y=0.006136, .z=0.006136, .t=0.000500};

__.param.period = {.x=1, .y=0, .z=0};
__.param.a = {.x=2.000000, .y=1.000000, .z=1.000000, .t=2.449490};
__.param.b = {.x=0.000000, .y=0.000000, .z=0.000000, .t=7.853982};

__.local.rank = 15;
__.local.shape = {.x=5, .y=2, .z=2};
__.local.coord = {.x=3, .y=1, .z=1};

__.block.shape = {.x=105, .y=258, .z=258};
__.block.coord = {.x=309, .y=256, .z=256};
__.block.elems = 6989220;

=======================
__.world.size = 20;
__.world.rank = 16;

__.nodes.shape = {.x=512, .y=512, .z=512, .t=20};
__.nodes.bound = {.x=3.141593, .y=3.141593, .z=3.141593, .t=0.010000};
__.nodes.steps = {.x=0.006136, .y=0.006136, .z=0.006136, .t=0.000500};

__.param.period = {.x=1, .y=0, .z=0};
__.param.a = {.x=2.000000, .y=1.000000, .z=1.000000, .t=2.449490};
__.param.b = {.x=0.000000, .y=0.000000, .z=0.000000, .t=7.853982};

__.local.rank = 16;
__.local.shape = {.x=5, .y=2, .z=2};
__.local.coord = {.x=4, .y=0, .z=0};

__.block.shape = {.x=102, .y=258, .z=258};
__.block.coord = {.x=412, .y=0, .z=0};
__.block.elems = 6789528;

=======================
__.world.size = 20;
__.world.rank = 17;

__.nodes.shape = {.x=512, .y=512, .z=512, .t=20};
__.nodes.bound = {.x=3.141593, .y=3.141593, .z=3.141593, .t=0.010000};
__.nodes.steps = {.x=0.006136, .y=0.006136, .z=0.006136, .t=0.000500};

__.param.period = {.x=1, .y=0, .z=0};
__.param.a = {.x=2.000000, .y=1.000000, .z=1.000000, .t=2.449490};
__.param.b = {.x=0.000000, .y=0.000000, .z=0.000000, .t=7.853982};

__.local.rank = 17;
__.local.shape = {.x=5, .y=2, .z=2};
__.local.coord = {.x=4, .y=0, .z=1};

__.block.shape = {.x=102, .y=258, .z=258};
__.block.coord = {.x=412, .y=0, .z=256};
__.block.elems = 6789528;

=======================
__.world.size = 20;
__.world.rank = 18;

__.nodes.shape = {.x=512, .y=512, .z=512, .t=20};
__.nodes.bound = {.x=3.141593, .y=3.141593, .z=3.141593, .t=0.010000};
__.nodes.steps = {.x=0.006136, .y=0.006136, .z=0.006136, .t=0.000500};

__.param.period = {.x=1, .y=0, .z=0};
__.param.a = {.x=2.000000, .y=1.000000, .z=1.000000, .t=2.449490};
__.param.b = {.x=0.000000, .y=0.000000, .z=0.000000, .t=7.853982};

__.local.rank = 18;
__.local.shape = {.x=5, .y=2, .z=2};
__.local.coord = {.x=4, .y=1, .z=0};

__.block.shape = {.x=102, .y=258, .z=258};
__.block.coord = {.x=412, .y=256, .z=0};
__.block.elems = 6789528;

=======================
__.world.size = 20;
__.world.rank = 19;

__.nodes.shape = {.x=512, .y=512, .z=512, .t=20};
__.nodes.bound = {.x=3.141593, .y=3.141593, .z=3.141593, .t=0.010000};
__.nodes.steps = {.x=0.006136, .y=0.006136, .z=0.006136, .t=0.000500};

__.param.period = {.x=1, .y=0, .z=0};
__.param.a = {.x=2.000000, .y=1.000000, .z=1.000000, .t=2.449490};
__.param.b = {.x=0.000000, .y=0.000000, .z=0.000000, .t=7.853982};

__.local.rank = 19;
__.local.shape = {.x=5, .y=2, .z=2};
__.local.coord = {.x=4, .y=1, .z=1};

__.block.shape = {.x=102, .y=258, .z=258};
__.block.coord = {.x=412, .y=256, .z=256};
__.block.elems = 6789528;

__TRIALS__.append((4.698629e+00, [0.000000e+00, 6.965539e-12, 2.786205e-11, 6.268963e-11, 1.114480e-10, 1.741369e-10, 2.507564e-10, 3.413062e-10, 4.457861e-10, 5.641957e-10, 6.965346e-10, 8.428025e-10, 1.002999e-09, 1.177123e-09, 1.365175e-09, 1.567154e-09, 1.783059e-09, 2.012889e-09, 2.256645e-09, 2.514324e-09, 2.785927e-09, ]))
__TRIALS__.append((4.636211e+00, [0.000000e+00, 6.965539e-12, 2.786205e-11, 6.268963e-11, 1.114480e-10, 1.741369e-10, 2.507564e-10, 3.413062e-10, 4.457861e-10, 5.641957e-10, 6.965346e-10, 8.428025e-10, 1.002999e-09, 1.177123e-09, 1.365175e-09, 1.567154e-09, 1.783059e-09, 2.012889e-09, 2.256645e-09, 2.514324e-09, 2.785927e-09, ]))
__TRIALS__.append((4.418807e+00, [0.000000e+00, 6.965539e-12, 2.786205e-11, 6.268963e-11, 1.114480e-10, 1.741369e-10, 2.507564e-10, 3.413062e-10, 4.457861e-10, 5.641957e-10, 6.965346e-10, 8.428025e-10, 1.002999e-09, 1.177123e-09, 1.365175e-09, 1.567154e-09, 1.783059e-09, 2.012889e-09, 2.256645e-09, 2.514324e-09, 2.785927e-09, ]))
__TRIALS__.append((4.308735e+00, [0.000000e+00, 6.965539e-12, 2.786205e-11, 6.268963e-11, 1.114480e-10, 1.741369e-10, 2.507564e-10, 3.413062e-10, 4.457861e-10, 5.641957e-10, 6.965346e-10, 8.428025e-10, 1.002999e-09, 1.177123e-09, 1.365175e-09, 1.567154e-09, 1.783059e-09, 2.012889e-09, 2.256645e-09, 2.514324e-09, 2.785927e-09, ]))
__TRIALS__.append((4.377448e+00, [0.000000e+00, 6.965539e-12, 2.786205e-11, 6.268963e-11, 1.114480e-10, 1.741369e-10, 2.507564e-10, 3.413062e-10, 4.457861e-10, 5.641957e-10, 6.965346e-10, 8.428025e-10, 1.002999e-09, 1.177123e-09, 1.365175e-09, 1.567154e-09, 1.783059e-09, 2.012889e-09, 2.256645e-09, 2.514324e-09, 2.785927e-09, ]))
__TRIALS__.append((4.420519e+00, [0.000000e+00, 6.965539e-12, 2.786205e-11, 6.268963e-11, 1.114480e-10, 1.741369e-10, 2.507564e-10, 3.413062e-10, 4.457861e-10, 5.641957e-10, 6.965346e-10, 8.428025e-10, 1.002999e-09, 1.177123e-09, 1.365175e-09, 1.567154e-09, 1.783059e-09, 2.012889e-09, 2.256645e-09, 2.514324e-09, 2.785927e-09, ]))
__TRIALS__.append((4.680244e+00, [0.000000e+00, 6.965539e-12, 2.786205e-11, 6.268963e-11, 1.114480e-10, 1.741369e-10, 2.507564e-10, 3.413062e-10, 4.457861e-10, 5.641957e-10, 6.965346e-10, 8.428025e-10, 1.002999e-09, 1.177123e-09, 1.365175e-09, 1.567154e-09, 1.783059e-09, 2.012889e-09, 2.256645e-09, 2.514324e-09, 2.785927e-09, ]))
__TRIALS__.append((4.494302e+00, [0.000000e+00, 6.965539e-12, 2.786205e-11, 6.268963e-11, 1.114480e-10, 1.741369e-10, 2.507564e-10, 3.413062e-10, 4.457861e-10, 5.641957e-10, 6.965346e-10, 8.428025e-10, 1.002999e-09, 1.177123e-09, 1.365175e-09, 1.567154e-09, 1.783059e-09, 2.012889e-09, 2.256645e-09, 2.514324e-09, 2.785927e-09, ]))
__TRIALS__.append((4.745060e+00, [0.000000e+00, 6.965539e-12, 2.786205e-11, 6.268963e-11, 1.114480e-10, 1.741369e-10, 2.507564e-10, 3.413062e-10, 4.457861e-10, 5.641957e-10, 6.965346e-10, 8.428025e-10, 1.002999e-09, 1.177123e-09, 1.365175e-09, 1.567154e-09, 1.783059e-09, 2.012889e-09, 2.256645e-09, 2.514324e-09, 2.785927e-09, ]))
__TRIALS__.append((4.603461e+00, [0.000000e+00, 6.965539e-12, 2.786205e-11, 6.268963e-11, 1.114480e-10, 1.741369e-10, 2.507564e-10, 3.413062e-10, 4.457861e-10, 5.641957e-10, 6.965346e-10, 8.428025e-10, 1.002999e-09, 1.177123e-09, 1.365175e-09, 1.567154e-09, 1.783059e-09, 2.012889e-09, 2.256645e-09, 2.514324e-09, 2.785927e-09, ]))


PS:

Read file <main.836937.err> for stderr output of this job.

