Sender: LSF System <lsfadmin@polus-c2-ib.bmc.hpc.cs.msu.ru>
Subject: Job 798516: <# this file was automaticly created by mpisubmit.pl script for edu-cmc-skmodel21-622-16 #;source /polusfs/setenv/setup.SMPI;#BSUB -n 32;#BSUB -W 00:15;#BSUB -o main_filtered_delta.%J.out;#BSUB -e main_filtered_delta.%J.err;OMP_NUM_THREADS=1 mpiexec main_filtered_delta 5.0e-6 42> in cluster <MSUCluster> Done

Job <# this file was automaticly created by mpisubmit.pl script for edu-cmc-skmodel21-622-16 #;source /polusfs/setenv/setup.SMPI;#BSUB -n 32;#BSUB -W 00:15;#BSUB -o main_filtered_delta.%J.out;#BSUB -e main_filtered_delta.%J.err;OMP_NUM_THREADS=1 mpiexec main_filtered_delta 5.0e-6 42> was submitted from host <polus-ib.bmc.hpc.cs.msu.ru> by user <edu-cmc-skmodel21-622-16> in cluster <MSUCluster> at Sun Nov  7 09:46:28 2021
Job was executed on host(s) <20*polus-c2-ib.bmc.hpc.cs.msu.ru>, in queue <short>, as user <edu-cmc-skmodel21-622-16> in cluster <MSUCluster> at Sun Nov  7 09:47:11 2021
                            <12*polus-c1-ib.bmc.hpc.cs.msu.ru>
</home_edu/edu-cmc-skmodel21-622/edu-cmc-skmodel21-622-16> was used as the home directory.
</home_edu/edu-cmc-skmodel21-622/edu-cmc-skmodel21-622-16/solution> was used as the working directory.
Started at Sun Nov  7 09:47:11 2021
Terminated at Sun Nov  7 09:51:07 2021
Results reported at Sun Nov  7 09:51:07 2021

Your job looked like:

------------------------------------------------------------
# LSBATCH: User input
# this file was automaticly created by mpisubmit.pl script for edu-cmc-skmodel21-622-16 #
source /polusfs/setenv/setup.SMPI
#BSUB -n 32
#BSUB -W 00:15
#BSUB -o main_filtered_delta.%J.out
#BSUB -e main_filtered_delta.%J.err
OMP_NUM_THREADS=1 mpiexec main_filtered_delta 5.0e-6 42

------------------------------------------------------------

Successfully completed.

Resource usage summary:

    CPU time :                                   7518.13 sec.
    Max Memory :                                 1728 MB
    Average Memory :                             1530.31 MB
    Total Requested Memory :                     -
    Delta Memory :                               -
    Max Swap :                                   -
    Max Processes :                              37
    Max Threads :                                109
    Run time :                                   237 sec.
    Turnaround time :                            279 sec.

The output (if any) follows:

# Running __TRIALS__ with FILTERED_SAMPLING/DELTA_STOPPING and epsilon=5.000000e-06, comm_size=32, seed=42
__TRIALS__ = [
#   (trial_time, trial_iters, trial_points, trial_error),
    (2.382638e+01, 5376000000, 1407442257, 4.506431e-07),  # __TRIALS__
    (2.369759e+01, 5376000000, 1407403502, 3.936567e-06),  # __TRIALS__
    (2.298201e+01, 5376000000, 1407416292, 8.674453e-06),  # __TRIALS__
    (2.313474e+01, 5376000000, 1407442773, 1.057512e-06),  # __TRIALS__
    (2.358197e+01, 5376000000, 1407419824, 4.395064e-07),  # __TRIALS__
    (2.367129e+01, 5376000000, 1407449773, 1.304788e-05),  # __TRIALS__
    (2.355474e+01, 5376000000, 1407410285, 1.501510e-05),  # __TRIALS__
    (2.302470e+01, 5376000000, 1407434071, 4.473546e-06),  # __TRIALS__
    (2.361211e+01, 5376000000, 1407428753, 5.872802e-06),  # __TRIALS__
    (2.374936e+01, 5376000000, 1407421800, 7.454978e-06),  # __TRIALS__
]  # __TRIALS__
# Done.


PS:

Read file <main_filtered_delta.798516.err> for stderr output of this job.

