// Jest Snapshot v1, https://goo.gl/fbAQLP

exports[`DetailsComponent should render correctly 1`] = `
<app-details
  isActive="false"
  personService={[Function Object]}
  route={[Function ActivatedRoute]}
>
  
</app-details>
`;
