// Jest Snapshot v1, https://goo.gl/fbAQLP

exports[`CharactersComponent should render correctly 1`] = `
<app-characters
  personService={[Function Object]}
>
  <div
    class="characters"
  >
    <app-character-list />
  </div>
</app-characters>
`;
