// Jest Snapshot v1, https://goo.gl/fbAQLP

exports[`AddCharacterListItemComponent should render correctly 1`] = `
<app-add-character
  addPerson={[Function EventEmitter]}
  isAdd="false"
  isEdit={[Function Boolean]}
>
  <li
    class="add-character-list-item"
  >
    <app-person-form />
  </li>
</app-add-character>
`;
