{
  "openapi": "3.0.1",
  "info": {
    "title": "swag-pi-b",
    "description": "This is a swag-pi-b built with Go and Gin.",
    "termsOfService": "https://example.com/terms",
    "contact": {
      "name": "API Support",
      "url": "https://www.example.com/support"
    },
    "license": {
      "name": "MIT",
      "url": "https://opensource.org/licenses/MIT"
    },
    "version": "1.0"
  },
  "servers": [
    {
      "url": "http://swag-pi-b-service.development.svc.cluster.local"
    }
  ],
  "paths": {
    "/api/v1/swag-pi-b": {
      "get": {
        "summary": "Calculates the Phi value of a number.",
        "description": "This endpoint calculates the Phi value of a number.",
        "operationId": "calculate-phi-value",
        "parameters": [
          {
            "name": "number",
            "in": "query",
            "description": "Number to calculate Phi value for",
            "required": true,
            "schema": {
              "type": "integer"
            }
          }
        ],
        "responses": {
          "200": {
            "description": "Phi value",
            "content": {
              "application/json": {
                "schema": {
                  "type": "string"
                }
              }
            }
          }
        }
      }
    }
  },
  "components": {},
  "x-original-swagger-version": "2.0"
}