{
  "openapi": "3.0.1",
  "info": {
    "title": "swag-pi-a",
    "description": "This is a swag-pi-a built with Go and Gin.",
    "termsOfService": "https://example.com/terms",
    "contact": {
      "name": "API Support",
      "url": "https://www.example.com/support"
    },
    "license": {
      "name": "MIT",
      "url": "https://opensource.org/licenses/MIT"
    },
    "version": "1.0"
  },
  "servers": [
    {
      "url": "http://swag-pi-a-service.development.svc.cluster.local"
    }
  ],
  "paths": {
    "/api/v1/swag-pi-a": {
      "get": {
        "summary": "Returns a random quote.",
        "description": "This endpoint returns a random quote.",
        "operationId": "get-random-quote",
        "responses": {
          "200": {
            "description": "Random quote",
            "content": {
              "application/json": {
                "schema": {
                  "type": "string"
                }
              }
            }
          }
        }
      }
    }
  },
  "components": {},
  "x-original-swagger-version": "2.0"
}