*Vertices 164
*Edges
1 7 0.8350351227702426
1 29 0.7523684621670317
1 43 0.7595353997489598
1 133 0.7485486080439078
1 154 0.8059938693361375
2 3 0.8160879929965207
3 39 0.726130276840751
3 81 0.7294376715218761
3 144 0.7914580290991307
4 52 0.7129238134327363
5 53 0.8058960460869161
5 133 0.7954146326559911
6 156 0.9024199318968303
6 157 0.711493709005803
7 29 0.7267510133384163
7 43 0.8207153191745685
7 133 0.7257879456334932
7 154 0.864328991035651
7 155 0.809008745214961
8 159 0.7882599691596306
9 11 0.7318775219831533
9 158 0.8589252672078564
10 24 0.8240384824269836
10 39 0.7118050662271997
10 40 0.779531897448214
10 157 0.7531903149953235
11 41 0.7080719956748083
11 60 0.719999224264078
11 158 0.7974201333823536
12 13 0.7760667711515608
12 49 0.7373775960886272
13 49 0.7702012925346766
13 50 0.7515229491708839
14 15 0.7463861431734804
20 21 0.725859554219518
20 22 0.7262102590622014
22 134 0.7507289251027256
23 27 0.7096018118365551
26 27 0.7674346587105849
27 158 0.7434137595438869
28 29 0.7261552375256415
29 43 0.7665137435775919
29 133 0.8233217217428818
32 33 0.9131606045146515
32 136 0.809849986942871
32 137 0.8377684159900095
32 138 0.8186647040119588
33 77 0.7080098240457049
33 136 0.8883604574025917
33 137 0.8389420323288941
33 138 0.8761060145654143
34 153 0.9293752131370017
35 152 0.8965634844945449
36 153 0.7873587701686797
37 148 0.7103189231038607
37 152 0.7909412938000439
38 39 0.7105483594496405
38 148 0.8228240559380663
38 149 0.8059499679101108
39 40 0.8493189334371329
39 148 0.7463349450482832
39 157 0.8630913049196924
40 157 0.9355353340885921
41 60 0.7134746478707665
41 76 0.7334720138238067
41 155 0.7580943323975925
41 158 0.7196068667932799
43 133 0.8717942228414427
43 154 0.7430399315060578
43 155 0.7326122781892875
44 45 0.7459621728588096
44 142 0.7131002102893469
45 141 0.7842843078573809
46 47 0.7425396334533911
46 57 0.7003394171800947
46 65 0.8239229495473782
46 88 0.7007599268906775
46 139 0.8783694365494792
47 139 0.7106327773126629
48 132 0.8174664717747958
49 50 0.8466602928192826
52 143 0.7617565129980105
53 132 0.7026604023712866
54 143 0.7494113240931156
55 56 0.7000105155144438
55 135 0.7233402249718414
56 135 0.9694791751433472
57 58 0.7195088567785445
57 88 0.7291023740367819
58 88 0.7810335833852645
58 139 0.7555619748483806
59 60 0.7161855838645245
60 158 0.7749615082034459
60 159 0.7541716720398051
61 62 0.7694760200355782
61 67 0.7042236478290548
65 66 0.8262821954186264
65 139 0.8660347489973411
67 68 0.757485740722245
71 72 0.7191460264642074
74 89 0.7312412751838071
74 140 0.8034011621280152
75 145 0.7983027387709163
77 78 0.7921586250566722
77 79 0.7490071647182662
77 136 0.7916245654495536
77 137 0.8010135392312913
77 138 0.7022872632115703
78 136 0.7953723529924285
78 137 0.7149997802545647
79 138 0.7852618533370329
79 149 0.725719318150578
81 84 0.7459365691975159
84 86 0.7678612172568539
85 161 0.7213923737839277
87 88 0.7140266544251979
88 139 0.744983181934225
89 90 0.8007530394457582
89 140 0.9354980071381337
90 140 0.8041511271423342
91 92 0.8758907441145908
93 94 0.7819113118795493
95 96 0.8743618468007841
99 100 0.7130142706026042
101 102 0.7092354740534715
106 162 0.7334009247640163
107 162 0.7271939869247329
107 163 0.7558406467760228
108 109 0.7810552052536501
108 117 0.7685718604035265
108 163 0.8652556266857763
109 117 0.8018895103052713
109 163 0.8421457171315938
114 115 0.7193547348437719
116 117 0.7381686270670734
116 118 0.8492196362831496
116 119 0.7820205405917093
117 119 0.7031884698637875
117 163 0.7237108138673471
118 119 0.8205277480377783
118 120 0.7581239269673838
119 162 0.7128699099779638
127 162 0.7005735958785256
128 162 0.7106032475501661
129 130 0.7221209062560637
129 162 0.7646182590335173
136 137 0.8992894724070003
136 138 0.7308135071953927
144 145 0.8069716125107955
144 160 0.7065763667718786
154 155 0.8039536847964729
160 161 0.8344014662782815
