*Vertices 164
*Edges
2 85 0.705152373653934
4 5 0.7277411245642191
6 7 0.7889029442488532
6 38 0.7097474686796512
6 40 0.7028442030051308
7 8 0.7106312362852898
7 154 0.7944919847726437
7 155 0.7344796395452624
8 159 0.7654852107752022
9 158 0.7476116681347869
10 36 0.776649638236413
10 38 0.7429706761233954
10 153 0.7285609569707959
12 13 0.7157450679049242
12 32 0.8616985009472432
12 136 0.7317405603180276
12 137 0.8651310731136108
12 138 0.8365535024324787
13 33 0.8970962845973346
13 50 0.7222351242462531
13 136 0.7650718754375387
14 15 0.7394506313888765
21 132 0.8566672389859286
24 38 0.7336448845612059
24 161 0.8499209498424901
25 40 0.7033286740173261
25 41 0.726608035604578
25 160 0.7584020941898143
26 68 0.7291805673980266
28 29 0.7692948913292385
30 31 0.7092925917642287
30 36 0.7158371827885188
30 153 0.7526682157395684
31 36 0.7010104713671269
31 37 0.7741397617391383
31 148 0.718075783265497
32 137 0.7811672667276717
32 138 0.8219626218271647
34 35 0.7332034096361237
34 153 0.7966771886348513
35 152 0.942279054649244
35 153 0.8606938671617718
36 148 0.7557073172222373
36 149 0.759932576388127
36 153 0.8131172036170355
37 148 0.8620072879448915
37 152 0.7088708594546936
38 39 0.7883819847535845
38 40 0.703625653615794
38 157 0.7749406988139345
39 155 0.7877222445327317
40 41 0.7740998264645313
40 157 0.8895069843689123
40 161 0.80171057946682
41 155 0.7748249906190148
41 160 0.7330834848324307
42 43 0.7684895434721997
43 155 0.7293770678033461
44 73 0.7121377218727253
44 142 0.8674483668522196
45 141 0.8290262009080449
46 47 0.8899366878266317
46 65 0.8558602084547379
46 66 0.7603429798158216
46 87 0.8507114485726047
46 139 0.7836721621839631
47 65 0.7014521914917512
48 132 0.7232696541523311
49 50 0.76490901172323
52 53 0.8243337499944026
55 132 0.7347255722224532
56 135 0.9785867960436078
57 58 0.8152893184540241
61 62 0.7981165327739411
65 66 0.8220216625189468
65 87 0.8192586768263299
65 88 0.718046790451071
65 139 0.8745340716824533
66 139 0.7584976118841612
67 68 0.7111241055233865
73 74 0.8001576024308292
73 89 0.7405393302147295
76 144 0.7091072514785365
81 82 0.7193578469449834
81 84 0.7054001416062621
82 84 0.7172931332460017
87 88 0.760992285578339
87 139 0.8528196693611515
88 139 0.7461977832479508
89 90 0.7256379546657817
89 140 0.9152037161734295
90 140 0.8525734044704643
91 92 0.9127715942595245
93 94 0.8164172281162774
95 96 0.8402926494047658
100 102 0.7118481287782853
101 102 0.7425171286067648
106 107 0.7662426139943215
106 163 0.7360041882280196
107 163 0.7573527957284238
108 116 0.746859233124895
108 163 0.8203401238206245
109 117 0.7321482548333664
114 115 0.7211379297581593
116 118 0.7696307665720478
117 119 0.7236281270093108
125 126 0.7378253633120448
136 137 0.811449516651344
146 147 0.7753676580303571
151 153 0.7625497004929878
152 153 0.8393921991333803
154 156 0.7001008032413951
160 161 0.730268546224977
