*Vertices 164
*Edges
1 109 0.9032517731844482
1 138 0.8675247325499591
1 154 1.150737207919369
1 163 0.9505395755063282
2 54 1.0052393757192972
2 81 0.9700285844698131
2 85 1.010746250216541
2 145 0.9511459008728036
7 154 1.1083163134242875
8 159 1.2846273655391496
9 158 0.9688330504760073
11 158 0.9160464891618367
12 13 1.034892849058967
12 32 1.1275999521499378
12 137 0.9864696203508079
12 138 1.0952904839569344
13 32 0.9022486345525251
13 33 1.3260559921863209
13 106 0.8807356243398258
13 108 0.870946359789386
13 136 1.1728836600307444
13 137 0.9132639646255776
13 138 1.1578559802457642
13 163 0.8791280698374595
14 15 1.0550477342460218
20 22 1.0175099481592396
30 34 1.0189086893646644
30 153 0.9949867539210261
32 137 1.1972101624475318
32 138 0.9705995777362724
33 35 1.085717284444394
33 106 0.8915398819570614
33 107 0.9138482660750007
33 108 0.9343413188910142
33 136 1.0187944316597397
33 138 1.0087339154959925
33 163 1.0239191894149862
34 35 0.9371924625857088
34 45 0.9085234473803702
34 153 1.1125088646279182
35 152 1.134319622545149
36 145 0.9617404890245799
36 149 0.9888922300747215
36 153 0.9729492035210169
37 148 1.1489334568382814
37 149 0.882918764391245
37 152 1.0238189072198411
38 149 0.9691958674657585
39 160 0.9266331785637203
40 41 1.1216965135531742
40 134 1.144297616589116
40 157 1.145253371240931
41 160 0.8731090118530185
42 141 0.886369875925598
44 142 1.2883810564698097
45 141 1.611192729788507
46 47 1.2395584433486522
46 65 1.4552439065877512
46 66 1.144105017311972
46 139 1.2733501989535752
47 65 1.113104322349343
47 66 1.1861708567919016
47 87 0.9370893977670162
47 139 1.3578755622698082
48 51 1.0510731925771952
49 86 0.9016918153642715
52 53 0.9049690674899469
52 54 0.953840243528133
52 143 0.9021796459151754
53 132 0.9130351561818173
54 143 1.1906465636094412
55 56 1.001177532900917
55 135 1.0456089825525725
56 135 2.1233815102432927
59 60 0.9845578894216404
61 62 1.278083468877235
61 67 0.9133680741247767
61 68 0.8817062305426011
62 68 1.1708333397711286
62 69 0.9610900381936585
65 66 1.390959651896719
65 139 1.4353607499591083
66 139 1.4967866067830475
67 68 1.0231711773557237
68 69 0.9246817955009151
71 72 0.9643816655814795
76 144 0.9110331042910519
77 85 0.9211677508962767
77 137 1.1440159629233075
78 136 0.9238551110493224
79 86 0.8989849763680873
83 137 0.9098925517678368
84 86 1.021453323162449
84 136 0.9694955997075194
85 86 0.9436983302049871
86 136 0.9724884494154189
87 139 1.1040864934102201
89 90 0.8809382415455995
89 140 1.3597781810090033
91 92 1.0632650813632318
93 94 0.8866034793838575
95 96 1.1562454523403072
106 107 1.1342230271645186
106 108 0.9786250172158779
106 127 0.9347880397096906
106 138 0.9296882316654574
106 162 0.9585896507832178
106 163 1.2087650925396118
107 127 1.0159401288565373
107 128 0.898666721654201
107 162 1.1308973419258632
107 163 1.2671956308117451
108 109 1.0455616811437276
108 116 1.0048744867682378
108 138 0.9224781309877722
108 156 0.9326870083015848
108 163 1.5047220716939615
109 117 0.9496885482708198
109 154 0.8796395955800052
109 163 1.170776622814603
112 126 0.9122941896138752
114 115 1.0155140085142735
115 127 0.872565411081533
115 162 1.1101538813910232
116 118 1.0813347005228986
117 118 0.9070689796115412
117 119 0.8837128073520728
118 119 1.0132834555979986
127 162 1.1186239915106209
128 163 1.0171563428356205
136 137 1.0112831977857164
138 163 1.0017730972329257
141 142 0.8774905016226298
154 163 0.8984886722988189
156 163 0.9338122561140929
