*Vertices 164
*Edges
2 3 0.8729398950948591
2 77 0.7205648999712289
2 83 0.7067873163637488
2 85 0.7049510603821435
2 145 0.710609374331995
3 86 0.7663410399873763
4 52 0.7997088991227923
5 53 0.7314055072100514
6 40 0.7074355757104314
6 156 0.8520111400748779
7 43 0.7684468414378378
7 154 0.9070138792818514
8 159 0.8630682090032141
9 11 0.7277258382387507
9 158 0.8746714010845426
11 158 0.8053496337586399
12 13 0.8027020218022
12 32 0.733071072648255
12 34 0.7116849792339034
12 137 0.8183515093230675
13 33 0.8167962341419295
13 50 0.708057834671441
13 136 0.8048864884646991
13 138 0.7156232221776356
14 15 0.7630986379663887
19 86 0.7779262739211287
20 21 0.7794270473969709
22 161 0.7300546704842087
24 161 0.7983660771583472
32 33 0.803274043175242
32 136 0.7913429958506327
32 137 0.8422072481514158
32 138 0.7321211253409293
33 35 0.8148204052621348
33 136 0.8843864202191623
33 138 0.7776813972498277
33 152 0.7985914378192567
34 35 0.7218573393888419
34 36 0.7925014308729974
34 137 0.7052874643801403
34 153 0.9331256922798171
35 37 0.7618881376598045
35 138 0.7517165419010239
35 152 0.9265627382965108
35 153 0.7226392515419165
36 37 0.7626408620460324
36 152 0.7080414483632642
36 153 0.9228264622951563
37 152 0.8823989262139196
37 153 0.716107011618509
39 41 0.7810327456761041
39 160 0.7759102937606719
40 134 0.7251478242932733
40 156 0.8297213435201942
40 157 0.947926524417275
41 155 0.7665403827035274
41 160 0.8745963181800336
42 134 0.7135942653515172
42 156 0.7527466516846795
43 133 0.7457330845051919
43 154 0.7463047701477595
43 155 0.7119936726520284
44 71 0.7152706263947654
44 74 0.7685396722856354
44 140 0.7582267490373036
44 142 0.8844772251193752
45 141 0.8773404529133926
46 47 0.7957285514096362
46 65 0.7719757650275306
46 66 0.772071929480873
46 87 0.8164352035568049
46 139 0.8697705489225659
47 65 0.8113974411141875
47 66 0.8596127539233234
47 112 0.7687953675567577
47 139 0.829308510573141
48 132 0.7246742627407081
49 145 0.7450129997455293
52 132 0.7705104593031423
53 143 0.7082566324551347
55 56 0.790087381395366
55 135 0.8246883012776107
56 135 0.983637684893959
60 158 0.7324586389019664
65 66 0.8997964637834087
65 139 0.8494226492957643
66 112 0.7667952831927267
66 139 0.841732975304441
67 68 0.7011153393446831
71 72 0.7834753625889123
71 74 0.7514862268175899
71 142 0.7440175445167346
72 142 0.7337515200995804
73 74 0.7636230314529963
73 89 0.7769815546718977
73 140 0.791706864402875
74 89 0.7335382017078191
74 139 0.7107698984284848
74 140 0.7675154036397167
74 142 0.7107624178461315
75 145 0.7841366773694335
76 144 0.8286701104758646
77 86 0.7114012905598757
77 137 0.8853760491131352
78 136 0.7576681798090416
79 85 0.8104137844196554
79 149 0.7539371849464926
85 86 0.7643479630363847
86 137 0.7242277824255005
87 139 0.7705658901934674
89 90 0.7646195570507344
89 140 0.8943189975946657
90 140 0.8461911267327265
91 92 0.8804601408419142
95 96 0.8615742067669994
103 104 0.7476567132066809
106 107 0.800372453985511
106 163 0.8694338767944586
107 163 0.8862862847507147
108 163 0.7307933783197543
109 117 0.7795480828243687
111 112 0.7775913233103253
111 113 0.7346005916543827
112 113 0.7437990489217986
112 139 0.7023530273064837
114 115 0.7594001657495714
128 129 0.7268593820977319
128 162 0.7371558555689789
129 130 0.7529793126908061
129 162 0.8259804266065197
130 162 0.7561901046379756
134 156 0.7692021245569058
136 137 0.7948708349762098
137 153 0.7076612500398323
148 149 0.7554446422809518
152 153 0.733841213242774
156 157 0.8141111141629729
