*Vertices 164
*Edges
8 159 0.9156505273674123
14 15 0.9064483156435833
40 157 0.9128816321179127
44 142 0.9293243119001465
46 47 0.9103655466533476
47 66 0.9098587468082474
56 135 0.9853429931271641
66 139 0.9151937508268672
