*Vertices 164
*Edges
1 7 0.7264217187571363
1 154 0.7872022517363896
2 3 0.7160546293292045
2 144 0.7525272582186298
3 83 0.7283094803534688
3 84 0.7547630581408799
3 144 0.7080259535696057
4 6 0.7681828303759907
4 7 0.7048260477807414
4 24 0.7049386865920169
4 38 0.7308073502699911
4 40 0.7425630610600187
4 52 0.8083049181819131
4 160 0.714683774507501
4 161 0.741126082831738
5 7 0.8063504178788174
5 52 0.7702779222943174
5 53 0.8106388542891664
5 154 0.7163710367964597
6 7 0.8326848354124856
6 24 0.7073146421377015
6 38 0.7702916031976774
6 40 0.7012229226361124
6 42 0.7538551239224255
6 154 0.8059806600994676
6 155 0.722437355534632
6 157 0.8099824562216594
7 39 0.7176262224618465
7 41 0.7971588989026275
7 52 0.7265205351888195
7 53 0.7083093841010387
7 154 0.9120743400661188
7 155 0.8373555316718604
7 157 0.7200929211067288
8 11 0.7263187347098855
8 127 0.7005404903255255
8 159 0.8713809315786143
9 158 0.8718912773695988
10 36 0.8465428391511475
10 149 0.7588811208017566
10 153 0.7049449960012006
12 13 0.8381068449357046
12 32 0.8102242165595894
12 33 0.7076554427773458
12 50 0.7122334794145911
12 136 0.7186518116375193
12 137 0.7958837089976067
12 138 0.763759851924387
13 32 0.7489586057604828
13 33 0.8763383594242186
13 50 0.7264498525723296
13 136 0.8739744378952482
13 137 0.7434034349576929
13 138 0.7480996557059051
14 15 0.7875665959012282
24 38 0.770599828097663
24 39 0.7184482506488354
24 40 0.7003311279817968
24 161 0.7952477130413399
25 41 0.7183025089289471
25 160 0.7767616029122301
26 27 0.7224098442134348
30 31 0.7154882977966284
30 36 0.7452955573251506
30 142 0.7784934233967867
31 37 0.7175780222519434
32 33 0.8425412305500959
32 137 0.7302209549285128
32 138 0.8631179828032963
33 78 0.7526738438877882
33 113 0.718134928614791
33 136 0.8366833132038337
33 138 0.8344926510879623
34 153 0.857174131398919
35 152 0.9066295588804856
36 79 0.7707324692364913
36 149 0.7033168504940114
36 153 0.8756975177073661
37 148 0.8109332840185692
37 152 0.7287231347910841
38 39 0.8597706919641598
38 40 0.7502848756211331
38 149 0.8073917328221099
38 157 0.8260529369694067
38 159 0.7084380157972932
38 160 0.7204238808151667
38 161 0.7612651820250999
39 40 0.702391773525273
39 41 0.8301568517908681
39 155 0.8407881165422869
39 157 0.7649155275174988
39 160 0.7697379531403266
40 41 0.8022466463035653
40 134 0.8004494009046952
40 157 0.8883229069991244
40 160 0.8036036840560349
40 161 0.9107442288311678
41 154 0.7146014967242926
41 155 0.8841720987093971
41 157 0.8182487672827311
41 160 0.845454163607828
42 43 0.8336291377036641
43 155 0.7168038200825082
44 142 0.8630005085398983
45 141 0.8469119785562196
46 47 0.9077918232742743
46 57 0.7690892740626805
46 58 0.7005780997675872
46 65 0.8728203511564063
46 66 0.7767443647444106
46 87 0.9226969208856677
46 88 0.8195672149338952
46 109 0.7554787231969259
46 139 0.9086640905254331
47 57 0.7762530129286279
47 58 0.7770883933251126
47 65 0.8507105884466969
47 66 0.810530475028251
47 87 0.8666375519603419
47 88 0.9105980033749629
47 109 0.7332327861278701
47 139 0.9213946276888884
48 51 0.7495307629873927
49 50 0.7108470936270445
49 77 0.7658439799828559
52 53 0.9001288421376664
52 55 0.7175790100358211
52 143 0.7564111193662947
53 143 0.7375601531320297
54 143 0.7543233605231994
55 56 0.7786764072596922
55 135 0.7592683642996546
56 135 0.9897129068430329
57 58 0.9055597801534824
57 65 0.7240742345443119
57 87 0.8009342908538715
57 88 0.7881046482686022
57 139 0.8824308280815141
58 87 0.7334083175011404
58 88 0.7765006396354166
58 139 0.8795570877174611
61 62 0.8402027449933385
61 67 0.7879804202954412
65 66 0.9048355479011734
65 87 0.8655597468929483
65 88 0.8373234895220621
65 139 0.8737784382769841
66 87 0.7920796562704872
66 88 0.7927933677440756
66 139 0.8136645393269067
67 68 0.851168697208032
72 74 0.7520575893560755
75 145 0.8562282729116741
76 144 0.8190208306662091
77 78 0.7551326323236636
77 83 0.7534691516758646
77 85 0.7083370368964709
78 83 0.7499266488645113
78 85 0.7531378204149667
78 86 0.7617720810543107
79 153 0.7496004754067893
80 85 0.7459462321691857
81 82 0.7207093035210477
83 85 0.7633204678677568
85 86 0.8078637610780507
87 88 0.8403351663636262
87 109 0.7056187412542042
87 139 0.8770100429964627
88 139 0.8798441669967246
89 90 0.8742464523201877
89 140 0.9205223191971875
90 140 0.8713491192103867
91 92 0.8224333689896697
93 94 0.7669010337948756
99 102 0.7139335126587475
100 102 0.7482815787556955
106 163 0.7287437434027243
107 163 0.8245116783980585
108 116 0.7047273882933913
108 163 0.7082314552344271
109 117 0.7810839654465542
109 119 0.774257283472807
109 122 0.7541587214415005
109 163 0.8057204337146089
116 117 0.7723975567774051
116 118 0.857691700579106
116 120 0.7408373689889278
117 118 0.7694426686039313
117 119 0.8303216145494011
117 120 0.7653113378187236
117 122 0.7530616558374935
118 119 0.8352033673987062
118 120 0.8233874481946399
118 122 0.7700217700677445
119 120 0.7615751211718552
119 122 0.8200134180306317
120 121 0.7132095366538921
126 127 0.7018273855239621
128 162 0.7123102926740532
134 161 0.7307316782463025
136 137 0.8586251506935988
144 145 0.7284696309048595
146 147 0.7110724319189605
148 149 0.7344031817936756
151 153 0.7229817984729564
154 155 0.8078606973340452
154 156 0.7177860630239744
155 157 0.7445758097170694
157 160 0.7410973145426033
157 161 0.7615053131606463
160 161 0.8303063039072792
