*Vertices 164
*Edges
1 5 0.8954626367150662
1 7 0.9128745090950361
1 154 0.9612599832105513
2 3 1.1564463540138208
3 78 0.876371976389519
5 53 0.8719175834197209
6 156 0.9484701418682072
7 43 0.907429953969115
7 154 1.2457588892128777
8 159 1.0934160554403995
9 158 1.2062186997119597
12 13 1.1562380957763907
12 32 0.9850580007826681
12 136 0.8898861176964907
12 137 1.0291098909502592
13 33 1.122617968285885
13 50 0.916279648984857
13 136 1.1286271523086193
20 22 0.9263725354321312
21 23 1.2353803708779907
22 23 0.9658833398189846
24 161 1.0756477018893975
28 29 0.9315722581582758
32 138 0.9419868052956013
35 152 0.9158538307831695
36 38 0.9187761331306122
36 149 1.1445564535163928
36 153 1.0472961552034654
37 38 0.9070694572400957
37 39 1.0424809739459018
37 144 0.9415142397322784
37 148 0.9010654053795969
38 145 0.9190805353494731
38 148 1.0160606792960305
38 149 1.043573435442604
40 157 1.5943119077031336
41 155 1.2603318916843484
43 133 1.0847696371468996
43 154 0.9579453650303246
43 155 0.895451634267797
45 141 0.8756658581200559
46 47 1.2400424341211336
46 57 1.046141537750897
46 65 1.673281801201627
46 66 1.480564596249558
46 87 1.1232965748651835
46 139 1.6346996788413684
47 57 1.1827981140073247
47 58 1.018412229394398
47 65 0.9786072228650156
47 66 1.1004596462470562
47 87 1.2544903865890489
47 88 1.0202589565017957
47 139 1.378849727257196
48 132 1.1126444951970342
49 50 0.9602812205243374
54 143 1.0480958486177705
56 135 2.0965784567943
57 58 1.1203848204026061
57 87 1.34498173161127
57 88 0.8796115997417862
57 139 1.2973249740985398
58 87 1.0281344156901093
58 139 0.926073992828103
65 66 1.7597379189981317
65 115 0.9545890263421069
65 139 1.5233771792172186
66 139 1.3924926427139304
73 74 0.9846262597596402
73 90 0.9381877930562884
73 140 1.26199209683516
74 90 0.9208774708100129
74 140 1.0361259994270178
75 145 1.1795496143013462
76 144 1.1106048630886203
77 78 1.0383264441501614
77 136 1.1661269369120852
77 137 1.083371922231395
78 136 0.9476460579654117
79 85 0.9887884243446676
79 86 0.8948238832517665
80 86 0.9074794931183445
80 148 0.9120700500292364
80 149 1.2202375569926065
81 82 1.0447194725272546
83 84 1.029285976276403
85 86 1.0469089091539168
87 88 1.168475898840132
87 139 1.1707851628186312
89 90 0.874533771224087
89 140 0.9079255500734826
90 140 1.4091111505104477
91 92 1.1832398725738262
93 94 1.021621815837272
95 96 0.9258656472373962
114 115 0.8859676983312772
115 139 0.8880526860979987
120 121 0.998627064205881
126 127 0.9117896619461522
130 162 0.8874030198408753
136 137 1.3174880608596264
141 142 0.8944284109091926
145 149 0.8843710518030184
148 149 0.9748184475420999
154 155 0.9141118822054268
160 161 0.8810023390937123
