*Vertices 164
*Edges
1 7 0.7451878090408723
1 154 0.7269949151005559
2 3 0.8295494912991622
3 81 0.7924329459734989
3 82 0.7329445708259613
5 53 0.7487228256625823
6 156 0.9113100844627889
6 157 0.7563392722085838
7 154 0.8999558627182338
8 159 0.8128769220734359
9 158 0.7777715103071633
10 38 0.733376108599471
10 75 0.7974559658748658
10 145 0.7707580535531139
11 158 0.823348357331749
12 32 0.8503972549256571
12 33 0.7052890981789716
12 137 0.7473390237071431
13 33 0.72451751972957
14 15 0.7924195322851135
15 67 0.7292887609118526
18 19 0.7901532129181362
22 23 0.7558662121306946
24 25 0.8635226319859389
24 160 0.8498474337251248
24 161 0.8544883326626771
25 39 0.7930113371825057
25 160 0.9267987500464626
25 161 0.7317171044117903
32 33 0.8084072941918431
32 137 0.7276362843268868
32 138 0.8477504863411961
33 136 0.7767087774764457
33 137 0.7673436933688639
33 138 0.7411915288069042
34 153 0.8191040652710461
35 152 0.8336240043661537
36 153 0.7240922956054432
37 152 0.7802967918074447
38 75 0.7415659307874034
38 145 0.8088595276359366
38 147 0.7453169126797073
38 149 0.8166528479435166
39 148 0.7958276404196257
39 160 0.7158825976338479
40 157 0.8810268765432598
41 160 0.7797483234173931
42 134 0.7676083018037266
43 133 0.8619648291977338
44 45 0.7442968126924344
44 141 0.7079597467411408
44 142 0.8091494030504105
45 141 0.8188930183356128
46 47 0.9067777278401471
46 58 0.7173039146779149
46 65 0.8158330942183475
46 87 0.8995047098329024
46 139 0.8993865863847632
47 58 0.7437467759226314
47 65 0.8147445316341935
47 66 0.7669474036414635
47 87 0.901456274168348
47 139 0.8883008584275169
48 51 0.7165281827893115
52 132 0.7012298179315183
53 54 0.738625386008379
53 143 0.7296297959933077
54 143 0.7553993734378303
55 135 0.7247242718063588
56 57 0.7210427545129688
56 135 0.9824814549893286
57 58 0.8262487635835781
58 87 0.7179474495010271
58 139 0.8331677151986397
61 62 0.7186209303978817
65 66 0.9184601646753086
65 87 0.7126165903721658
65 139 0.8989141594752185
66 88 0.7279743736071703
66 139 0.8079884768293515
70 72 0.7193283397796606
71 72 0.7048935908345455
74 140 0.7227215928149762
75 145 0.823953427374473
76 144 0.7121757489718415
77 78 0.7413083624882943
77 79 0.7012184088296975
77 85 0.7139466549153842
80 86 0.775388085181784
81 82 0.8405666124499311
81 84 0.7512411562690032
81 86 0.7630102508920112
82 84 0.7192638915739512
83 84 0.7238222586160407
83 85 0.8627129291325423
84 86 0.8381757164976334
87 139 0.8308776057842211
89 90 0.8313601803853959
89 140 0.804136890564235
90 140 0.8789855638263342
91 92 0.8317304666296517
93 94 0.7302757373842897
95 96 0.8586965988184345
99 100 0.7291644578338788
100 101 0.7129288857757873
103 104 0.7362944431530571
106 107 0.7273255280915952
106 163 0.7910183322619142
107 162 0.7445176918689621
107 163 0.8645201730994717
108 163 0.7439187262130436
109 163 0.749635396959016
112 113 0.7061192790932594
113 127 0.7645038226021246
114 115 0.8191584776786617
114 127 0.7261773454172483
120 121 0.8070266893118008
125 126 0.7831612148597892
127 128 0.7099824974952611
127 162 0.7008205363371868
128 162 0.8402155732773726
133 134 0.7292149973283816
136 137 0.900685691941238
141 142 0.7290243927785518
145 147 0.7644977418306547
154 155 0.8050896181671593
156 157 0.7334316338700247
160 161 0.7679062419913932
162 163 0.7643124250683343
