*Vertices 164
*Edges
1 5 0.7114036960923671
1 60 0.7133020536175805
2 3 0.8273183986681624
2 79 0.7092412612244994
3 38 0.7066144462704063
3 148 0.7222756082965971
4 14 0.7013612890113398
4 52 0.7526602621539278
5 60 0.7589350438658016
6 156 0.8826074735457541
7 154 0.846154150564202
9 11 0.7104229340327141
9 25 0.700072097313396
9 158 0.7693184921655202
11 158 0.7302191441786389
13 33 0.8045792186830999
13 35 0.7734464849540952
13 36 0.7593915885597479
13 37 0.7650231024493651
13 49 0.7351189689027654
13 50 0.8004277178098711
13 136 0.8327954324880152
13 148 0.7652065316188035
13 149 0.7167181443050246
13 152 0.7886971401526935
14 59 0.7275703564689435
15 21 0.7117980604943138
15 23 0.7147650689369971
15 60 0.7404679946243202
20 21 0.7149759774358209
20 22 0.7116520565351431
21 22 0.775496898561903
21 23 0.8325189515007485
21 25 0.7368063695925591
21 160 0.7312961307014231
22 23 0.8002585610552747
23 25 0.7872597887344804
24 161 0.8584874916568649
25 160 0.7589647657293654
26 27 0.7348619791975773
32 33 0.7242728093405477
32 136 0.7038905334266115
32 137 0.88923047207484
33 50 0.7516858882647244
33 77 0.7943704045779997
33 78 0.7752933459184088
33 136 0.9376380928792848
33 137 0.8814344343880747
33 138 0.7049447441434857
34 35 0.7916899542626616
34 37 0.7866745592613499
34 152 0.7874111471617684
34 153 0.9056052505705144
35 37 0.8632890795230876
35 148 0.7052552025473376
35 152 0.9603604600080164
35 153 0.7917518837634975
36 37 0.8332150107774406
36 38 0.7701919189191163
36 136 0.7202729634222134
36 148 0.7963105010463806
36 149 0.8257144354572122
36 152 0.7319218791479434
36 153 0.734372854828193
37 148 0.8560276944527726
37 149 0.7620676750563262
37 152 0.9216296031324381
37 153 0.8267267060102058
38 148 0.7957838260412814
38 149 0.849171022801241
39 148 0.7413170986182813
40 157 0.9106243834224471
41 160 0.8961490074081352
43 154 0.7021569195300555
44 45 0.8412537629454654
44 74 0.7217000995622139
44 141 0.8320403663781302
44 142 0.7716702620071061
45 74 0.7689120448048253
45 141 0.8638331221670112
46 65 0.8212863192858777
46 87 0.8164779457700296
46 139 0.8119059542661917
47 66 0.7208371308162536
47 139 0.7058164818939258
48 51 0.8349729214748354
48 132 0.8488350509390865
49 50 0.713992345682582
49 136 0.7088263755230939
50 78 0.7568649224198817
50 136 0.7593433064923539
51 132 0.7378555999587665
52 59 0.7880051945976673
53 132 0.7346054294028675
54 143 0.7463692640682639
56 135 0.9820518535279247
57 58 0.7473382666123213
57 87 0.7203109221255903
59 60 0.7300608556767263
60 93 0.7153700985243779
60 158 0.7289838479760885
60 159 0.7103080422455514
65 87 0.7190882615528161
65 139 0.8702455409667359
71 72 0.7462594253793723
71 73 0.7370680617579871
73 74 0.7944286100343623
74 90 0.7678520754530422
74 140 0.7701622683539051
76 144 0.7306205794500916
77 78 0.8404376852601688
77 79 0.7690049152726562
77 80 0.7318482297463454
77 84 0.8279246332741024
77 85 0.7523573518437101
77 86 0.7739651931079754
77 136 0.8404521855622166
77 137 0.8196736198748492
77 138 0.703252998889999
78 79 0.7838178506547347
78 80 0.878833938208043
78 82 0.8021882573723523
78 84 0.7489997264146487
78 85 0.7194297642354688
78 86 0.7704413601848774
78 136 0.8324386083195328
78 137 0.7180123792607821
79 80 0.8637306755420863
79 81 0.7156570339878487
79 84 0.7588314360318602
79 85 0.7665292920054512
79 86 0.8172458294501008
79 136 0.7782911513552294
79 137 0.7265542012621101
79 138 0.7162718966477278
80 81 0.7100124330298563
80 82 0.8246390451366721
80 84 0.7719681921602368
80 85 0.7776238515318348
80 86 0.8559062122365191
80 136 0.7936728669866318
80 138 0.7130189206247783
83 84 0.7268918004806931
83 85 0.7456071643325736
84 85 0.7707045245614772
84 86 0.8455097361332153
84 136 0.7526482503054986
85 86 0.8393188461039955
85 136 0.7309004810055634
85 137 0.7946161014685642
85 138 0.7384281766345574
86 136 0.7458487799713411
86 137 0.7311628006126683
86 138 0.7558581692819563
87 139 0.7889519541308383
90 140 0.7878488746280913
106 163 0.7202039199353834
107 163 0.779044281911891
108 163 0.8061787272977113
109 163 0.7816694287947723
113 115 0.7460336902276757
113 127 0.702481913546257
114 115 0.7477930699312428
115 127 0.7398227544335644
136 137 0.9133948522201738
141 142 0.8457269037270203
143 146 0.7054265343663716
144 145 0.721535371235346
146 147 0.7793374983230843
148 149 0.8347777682188934
148 152 0.7560586257295261
152 153 0.8416604251234119
158 160 0.7544557358087158
