*Vertices 164
*Edges
1 7 0.9758703799260158
1 154 0.9109040474881843
2 3 1.1657064273282551
2 75 0.8706813207142917
2 145 0.921251523144752
4 5 0.939792965629282
4 6 0.8897338927535194
4 52 1.081029315554856
4 59 1.0316980531877697
5 7 1.0432405056867906
5 53 1.0113720888772604
6 7 0.9057654692719507
6 156 1.3383375625955782
6 157 0.920190700521451
7 9 0.9060956190624132
7 146 0.8864752152157883
7 154 1.6178722372613317
8 9 1.0409028070560074
8 10 0.9017640455618834
8 159 1.3108465411768395
9 11 0.9029133456940668
9 25 0.8928904668905793
9 158 0.8920561044340232
10 38 0.8912291930985328
10 75 1.032145533852964
10 145 0.8920816784947438
11 75 0.8812146801085761
12 13 1.4133887034293908
12 32 1.1014221312999244
12 136 0.9896687091137703
12 137 1.2768114892371343
13 32 1.0790153593474041
13 78 0.952938521576342
13 136 1.2071584113191167
13 137 1.1428764864168817
17 82 0.8758729383831595
17 86 0.8713837142080265
21 23 1.1321691042640214
22 40 0.8715694518821069
23 41 1.2517427688673028
23 155 1.092215978858827
24 25 0.8877769673030632
24 161 1.2090166967905873
31 43 0.9025316424828501
32 33 1.0314215317702362
32 77 1.0295351256069558
32 86 0.993735315929605
32 136 1.0854557659447082
32 137 1.2031054487109634
32 138 1.1287606758082074
33 136 1.0837091788930755
33 138 0.9224830876391426
34 36 0.9530511063730023
34 153 1.2588288785375532
35 152 1.0299779356323806
36 153 1.265262053992083
37 152 1.1527174279106869
38 39 0.9622640956512714
38 148 0.9438441058931302
39 161 1.0710093241344198
40 52 1.0205184573964914
40 155 0.9600235167887088
40 157 1.4257000740506656
40 161 0.925451320894521
41 55 1.0628022344657413
41 109 0.8685678153881025
41 132 1.08067663840073
41 155 1.1739950007521023
41 160 0.9015229959614894
42 43 1.0819958693698974
43 133 0.9353691129557353
44 45 1.2607207154505957
44 71 1.1526151005977496
44 72 0.9822053169269697
44 73 1.0941023206546914
44 74 0.9064531963095058
44 141 1.2252293460924069
44 142 1.4268492500390386
45 71 1.0004652487542731
45 72 0.9817446507001069
45 73 1.0254401890368616
45 74 0.8795964550513052
45 141 1.6625484333299407
45 142 1.1164708021468124
46 47 1.5004730677767928
46 87 1.0486177095085272
46 139 0.926592743197595
47 87 0.8783375837632931
47 139 0.954152528163235
48 55 0.8927216491498154
48 132 0.9863005001000307
52 53 0.8939387635989741
52 54 1.1426318678885325
52 59 1.0122020988821234
52 157 0.8704108384771828
53 60 0.8937529991792059
53 132 0.9513813680583169
54 143 0.9703584393150257
55 56 1.31603817599895
55 132 1.0365518197568435
55 134 0.8740050455953013
55 135 1.349220611143045
56 135 2.6658300581567915
57 58 1.3106379788850904
57 65 0.9285401511093124
57 139 1.334825989179188
58 139 1.1751963369908145
59 60 0.9195544689661812
60 158 0.920557438585651
61 62 1.1571797115407607
61 67 1.058306923676118
62 67 1.0843378282370366
62 68 1.0385622741814893
65 66 1.4984983530607416
65 73 1.015541226362239
65 74 0.9019125177911128
65 139 1.5365794118358933
66 73 0.9892079185266439
66 74 0.9062822128161105
66 139 1.151905188242433
67 68 1.0319274740767503
71 72 1.1958796036038688
71 73 1.134468818958943
71 74 0.9350148487592533
71 141 1.0133312348840484
71 142 1.201692406946958
72 73 0.9735975519989539
72 141 1.0443159256281171
72 142 1.0214619805411866
73 74 1.4127414916317391
73 139 0.9419731610307813
73 140 0.8916718617101503
73 141 0.8674727623716848
74 139 0.9141612421911669
74 140 0.9232058781295718
75 145 1.2809373723461346
76 144 1.1446186368596274
76 158 1.0028464534817543
77 86 0.9857154713179589
77 136 1.1747138494284723
77 137 1.366451228575769
78 136 1.005984357521625
78 137 0.8702119927640306
81 86 0.925950049371099
82 86 1.101862430607701
84 86 0.962387496349568
85 86 1.1493132259343546
86 137 0.9655928065659725
89 90 1.2516203187997947
89 139 1.0821892019389834
89 140 1.223120798657281
90 140 0.876948627294717
91 92 1.2248844627156585
95 96 1.0115702905802613
100 102 0.9290882626881274
106 107 1.216108598573822
106 163 1.2133853112398307
107 109 1.0460151224095007
107 163 1.4873305805068342
108 109 1.0207755681214865
108 163 1.1876811478061169
109 117 0.9596882176797127
109 163 1.2545629993395804
116 118 1.007777175141001
118 119 0.9760907644513179
120 121 0.9718284010535446
129 162 1.0950242457461807
136 137 1.5176856045066525
141 142 1.4922807138246912
143 146 0.8823249755487068
147 156 0.9062596812349617
148 149 0.8796533953949245
154 156 0.8942487986676345
156 157 0.9751690739059592
160 161 0.9480893569035541
