*Vertices 164
*Edges
2 3 0.9805910180071404
3 76 0.9911781438293347
3 144 1.2400019456643174
4 5 1.1118000374228711
7 154 0.9062295320689276
8 159 1.2062859361254215
9 11 1.008169928922042
9 158 1.3141681422703295
11 158 0.8791188502279534
12 32 0.9728251885232275
12 137 1.0547250935020434
12 138 0.9290900766547971
13 33 1.093936969801264
13 136 1.1475144937490158
14 15 1.1321309765592993
21 25 0.8685444158938319
22 24 0.9358405594918618
22 161 0.9552174114297081
23 25 0.9318404519103218
23 41 0.9168980673896298
23 160 0.8986302498383024
24 161 1.0901669066234911
25 31 1.0037649484357387
25 160 0.9547046545297715
30 31 0.9142936543918495
30 44 1.0082108026961976
30 74 0.9205099919280382
30 106 0.9786908083893013
30 107 0.9323882033878405
30 163 0.8749155583783153
31 44 0.9323311319870651
31 45 1.0390550960742022
31 46 0.906062064029057
31 47 0.8916891071181372
31 66 0.97804242310874
31 71 0.9465292969878558
31 73 1.0867331567206895
31 74 1.3447682365683469
31 139 0.9499069017273924
31 142 0.8790677221939227
32 34 0.8738471743999594
33 35 1.0050542418068036
33 138 1.1401344922974643
33 152 1.2116967979026623
34 153 1.1628863919141832
35 152 1.7023856495609477
36 153 1.2294852958561941
39 160 0.8818457942841131
40 157 0.9929332443223094
40 161 0.9333327613389336
41 132 0.9728890430905754
41 160 1.1527586469230982
42 43 0.9813212945846902
43 45 0.9253417337119706
43 73 0.8916353969016589
43 142 0.960139180791933
44 45 1.0808279602584243
44 66 0.954881047033044
44 71 0.9134661488759145
44 73 1.3272848872818672
44 74 1.232497951878733
44 139 0.9422481547364784
44 140 1.052254500916822
44 142 1.3383174704463405
45 46 1.0267040552135993
45 47 0.9061196812662612
45 66 0.9748831718453606
45 71 1.1627578629985262
45 72 1.1263218152204169
45 73 1.209481334701015
45 74 1.3034158537399307
45 89 0.8898942766816655
45 139 1.1012182899979839
45 140 0.8962228390247755
45 141 1.520035340541297
45 142 1.3013764170272868
46 47 1.0664728204346998
46 57 1.0381871501455895
46 65 1.142399529257582
46 66 0.9223040028596706
46 71 1.056914615572258
46 73 1.1555069093019472
46 74 0.9944701903267326
46 87 1.08680307796953
46 89 1.1130083763383924
46 139 1.5587502138470026
46 141 1.0432944230093937
46 142 0.9798056691274867
47 66 0.990887588001216
47 71 0.8800959705217537
47 72 0.8675134832534581
47 73 0.9968834609385945
47 74 0.9419065507933959
47 87 1.0417039526863117
47 139 1.3049349417706007
47 141 0.960981348937143
47 142 0.9916409611867814
48 132 0.925341508988766
49 50 1.1173357705305884
52 53 0.9352118136538148
53 132 0.8890124253014684
56 135 2.468924364758279
57 87 1.16214253202557
57 89 0.9940547597536212
57 139 1.2575104494664493
58 139 0.8821251020446187
59 60 1.080590660578306
60 160 0.871765551359151
62 105 0.9087391744646132
65 66 1.2355735263774161
65 71 1.0634161862189624
65 73 1.1325753122309494
65 74 0.9042607823385754
65 89 0.9071113839127344
65 139 1.331617723221505
65 141 0.9169528931779262
65 142 0.9287547503090312
66 71 1.0706461592436554
66 73 1.1607650271798537
66 74 1.213599315489269
66 139 1.2326449881525527
66 141 0.9152774638097028
66 142 0.9761785443702069
67 68 0.9141954757122076
71 72 0.925692674156547
71 73 1.280222833895089
71 74 1.1001849521732732
71 89 0.8718350889993964
71 139 1.1357636331537364
71 141 1.1266812222190095
71 142 1.1625935953452553
72 74 0.9760953431054552
72 139 0.9188812382478121
72 141 1.2303895134789706
72 142 1.0605084877169193
73 74 1.3288912540998337
73 89 1.018294459481714
73 139 1.3500261260699764
73 140 0.9667011021772787
73 141 1.0656141801114003
73 142 1.545884978157742
74 139 1.1616542409938377
74 140 1.0563412266628165
74 141 1.0436080426089709
74 142 1.2147273057767825
75 145 1.0541034217324565
76 144 1.136930078940049
85 86 1.0980804360111067
85 114 1.0707412739671052
85 137 1.0912295187209398
86 137 0.9556530532948976
87 139 1.178408446359723
89 90 1.175793031778866
89 139 1.281386362359966
89 140 0.9956255155906834
89 141 0.9457043201029585
90 139 0.9529624189814833
90 141 0.9931399790955224
91 92 1.1874056731675025
95 96 0.9246583349301661
106 107 1.360741546087453
106 108 0.8792787175510326
106 109 1.029180443310905
106 114 0.9659825512133814
106 140 0.9145235317268573
106 162 0.8961619329610161
106 163 1.5702829128036542
107 109 1.0649774417084206
107 162 0.8705030990467679
107 163 1.8752404356629302
108 109 0.9746741502002698
108 163 1.056270679309544
109 162 0.9670844975018349
109 163 1.2032897187871197
112 113 0.8742348534190053
114 115 1.056824162415443
114 162 0.9491752719780168
115 162 0.993206048401754
128 162 1.0521226059506514
129 162 1.0320757372385048
132 160 0.9851056960250327
139 141 1.2774058328647142
139 142 1.2124063267697407
140 163 0.9351898327788052
141 142 1.3112643373470647
