*Vertices 164
*Edges
1 53 0.7703061310478532
2 77 0.7183254795285615
2 145 0.7314337994026343
3 144 0.7310125780579213
4 5 0.8018977246049508
6 156 0.704927948610361
8 159 0.858775728993125
9 158 0.7236549971588725
10 159 0.7241210571392674
12 13 0.8144887846388591
12 32 0.8712975686188834
12 33 0.7816286894423308
12 137 0.7164788918345026
12 138 0.8514062060915112
13 32 0.7422340544580753
13 33 0.8508398500691313
13 136 0.7208718943560278
13 138 0.8394579026318175
13 150 0.7574233297172811
14 15 0.7260171117548294
29 62 0.7055475658077358
32 33 0.8545044590296004
32 34 0.8141183548284087
32 35 0.7349587865853071
32 137 0.7838575955062821
32 138 0.859603222895585
32 152 0.7159914174188148
32 153 0.7403607835867908
33 136 0.7449781788024792
33 138 0.8851643586585202
34 35 0.8397974393509919
34 152 0.8161543713108053
34 153 0.8993587642618905
35 152 0.9209812310474587
35 153 0.7636114410329871
36 137 0.7302410837096044
36 153 0.7833276970386419
37 148 0.7324257511961482
37 152 0.7152262824782674
40 157 0.7791450466640146
42 43 0.7227988881847911
42 56 0.72132865065655
42 135 0.7542446207366202
42 142 0.7045666630169197
43 56 0.7187922883344391
43 133 0.7334797596515628
43 135 0.7828304598761008
44 45 0.740472071234139
44 46 0.7635323053210139
44 47 0.7734041969063108
44 65 0.7388243967573276
44 71 0.725359597949793
44 73 0.7371518022422495
44 89 0.7528010317691581
44 139 0.7560730191650743
44 141 0.7453414942854372
44 142 0.8824745162318967
45 71 0.7045026855638803
45 74 0.7698147501550607
45 141 0.8537185813824033
46 47 0.8254089212311646
46 65 0.8466012059340717
46 66 0.7873676305481583
46 71 0.7666096608767979
46 73 0.7694340910020225
46 87 0.7961010747075971
46 139 0.9224534636815177
46 141 0.7926223489911595
46 142 0.7210729266940029
47 65 0.761297520825152
47 66 0.7743783800166456
47 73 0.7155606975617387
47 87 0.7164956821364918
47 88 0.7018966062338652
47 139 0.8398157870181319
47 141 0.7335195191826398
52 143 0.8155589107376976
54 143 0.8047763518754196
56 135 0.9732175943846957
57 58 0.7893413812364255
57 139 0.7415470215213551
59 60 0.7573605808678201
60 158 0.706160148864386
61 62 0.7791578586878759
61 70 0.7185808943841728
62 70 0.7130642729789026
63 110 0.7019600565036797
63 112 0.7641385269881467
63 125 0.7317075759540458
65 66 0.8406886540893878
65 71 0.8149493859730311
65 73 0.8488768221734627
65 74 0.7173403280212367
65 139 0.7810698656924859
66 71 0.762074003592624
66 72 0.7436122696006767
66 73 0.840285612554571
66 74 0.7566368816271882
66 139 0.7601332304460877
71 72 0.762541890522901
71 73 0.79286329142
73 74 0.7767826075670953
73 139 0.7703097518488088
76 144 0.7483943006208688
77 137 0.7105887319427049
87 139 0.7928195700960948
88 139 0.7158641519519131
89 90 0.7523154853899244
89 139 0.7324203803029001
89 140 0.8398960463719569
90 140 0.8827483767208921
91 92 0.7877902077534081
93 94 0.7955425614972879
100 102 0.7482101161793059
106 107 0.7392076583758496
106 162 0.818374904029209
106 163 0.8949890141881378
107 109 0.714849192491394
107 115 0.7559088219083122
107 162 0.7831993323241022
107 163 0.904477597712979
108 162 0.7044631300273634
108 163 0.70849558334564
110 111 0.863558809336634
110 124 0.7734229789250927
110 125 0.7047786704133079
111 124 0.7408498453497678
112 125 0.7034485056218713
113 126 0.7614349265488701
113 127 0.7031165209234781
114 115 0.8273945485017398
114 127 0.7858982505830536
114 162 0.7578529719590442
115 127 0.7555533365241704
115 128 0.7415224195771944
115 162 0.8424704828500932
115 163 0.7285474335960133
120 121 0.7273700670940445
121 130 0.7057804862776667
127 128 0.7040540795860094
128 129 0.7632729803569371
128 162 0.8651163376840783
129 162 0.7991651661922679
130 162 0.7104090397746228
136 137 0.7817923310908473
139 141 0.8384452499296747
139 142 0.7921410954740787
141 142 0.7651535022984354
152 153 0.8522665477791975
162 163 0.8158106068103645
