*Vertices 164
*Edges
1 53 1.0159651807690402
2 145 0.9696489309210552
3 144 1.024476652899062
4 5 0.8861353685971017
4 6 1.0023905170780898
5 7 1.0015701842547715
6 7 1.0025759082982941
6 156 1.3408191317958886
7 154 1.2203149244501266
7 156 0.9650619170412537
8 10 0.8974046968011531
8 159 1.4177146231236488
9 158 1.0570572254913058
10 145 1.0351037249399924
11 158 1.00249239836854
11 160 0.9445905738988866
12 32 0.9515953309856912
20 22 0.8800225124296727
20 69 0.8879019666391968
28 69 1.0138613863315296
32 138 0.9297722785339999
33 136 1.0659480229187996
34 35 0.877879256966688
34 153 0.9946926550933847
35 152 1.6605122520840723
35 153 0.8796723079073228
37 152 0.8967297755175714
39 41 0.9419068935566776
39 158 0.8707756724689537
40 41 1.0175947213340117
40 55 1.0354794239797322
40 157 1.2303583288947064
41 155 0.9155916454000321
43 155 0.8885150069731327
44 142 1.0184119280268855
45 141 1.3280586999424067
46 47 1.5676688891246366
46 57 0.9740493305282838
46 58 0.9729831130990049
46 65 0.8866683483637147
46 66 0.8841883963565571
46 87 1.3458690175019812
46 139 1.4514374675236181
47 57 1.2276530391096188
47 58 1.1515274276742278
47 65 1.0045766641578433
47 66 1.0257709857845205
47 87 1.166805011474871
47 139 1.611156275624904
48 132 0.9265562644557196
52 53 1.201067558334247
52 54 0.9693186879105884
52 143 1.0360084278522226
53 54 0.9426066093882682
53 143 0.9002504224325785
54 143 1.4512250455972917
54 146 0.8961415960827295
55 135 0.9173996696131098
56 135 2.258534573381451
57 58 1.5812672081821635
57 65 0.9645207545883103
57 66 0.9697389930800542
57 139 1.4208616503177238
58 65 0.9005610064769312
58 66 0.9962856709330271
58 139 1.531780312624549
61 69 0.9262943912749676
63 99 1.4003332450850328
64 100 1.0521698127161563
64 112 0.887675161692261
65 66 1.494959663915021
65 73 1.0009767896898347
65 139 1.2227717629224852
66 73 0.9079860327538118
66 139 1.2001119647548326
73 74 0.9238807255842877
73 139 1.031039502974804
73 142 1.0788277287713464
74 139 0.8702825101810081
75 145 1.1643046093896539
76 144 1.0835921911073378
77 83 0.9466877764056583
77 137 1.1801387759881856
79 80 1.0704502073347093
79 85 0.9729006029007876
80 85 0.9545780900855317
81 99 0.9024657526497664
85 86 1.0757649383665695
87 139 0.9714007297005532
89 90 1.0107958001705077
89 140 0.997510729916167
90 139 0.9166876957519576
90 140 1.1157467828222503
91 92 0.9102554663339691
93 94 1.0217275566939328
95 96 0.9253660763966609
97 98 0.9761024412707223
100 102 0.9942628699106006
100 112 1.0708259744967885
103 104 1.1922360535646905
106 114 1.1464768600840844
107 163 0.8924030083353859
109 163 1.0299402873811092
111 113 1.0035742936911416
114 127 0.8956219520671836
116 118 0.9752150727256178
118 120 0.9323923113348108
120 121 1.1837996842910843
128 162 1.1689352329850098
129 130 1.14040475124481
129 162 1.162118001457147
130 162 0.9212328105252693
139 142 0.9403781477207384
141 142 0.9570362133543058
143 146 0.9624086672860995
154 156 0.9278208285418734
158 160 0.8763478774582346
