*Vertices 164
*Edges
1 5 0.714081360566589
1 7 0.7225090694458886
1 154 0.744838358472984
2 3 0.819878387172642
3 78 0.7045971209517389
5 53 0.7023470960709256
6 156 0.7390896681094983
7 43 0.7198964258311616
7 154 0.8470900825803804
8 159 0.7981215643124925
9 158 0.8355416276672544
12 13 0.8198101085837302
12 32 0.7552471446831814
12 136 0.7113374786331237
12 137 0.7735511014912951
13 33 0.80847760766694
13 50 0.7241326597011917
13 136 0.8105488846317359
20 22 0.7288981674195469
21 23 0.8441328985244109
22 23 0.7468896713490655
24 161 0.791579530873008
28 29 0.7313260923762929
32 138 0.7361337544405582
35 152 0.7239300645268877
36 38 0.7253179220140533
36 149 0.8159427039116269
36 153 0.7807529357780254
37 38 0.7197227117685969
37 39 0.778865889638858
37 144 0.7359171934836203
37 148 0.7168162387871334
38 145 0.7254621506119627
38 148 0.76825715633047
38 149 0.7792952634351853
40 157 0.9208078394597304
41 155 0.8511555830059664
43 133 0.7949611666422622
43 154 0.743358991097313
43 155 0.7140759683589324
45 141 0.7042413831819081
46 47 0.8454676977090443
46 57 0.7803017378872239
46 65 0.931984252354907
46 66 0.9015737142035968
46 87 0.808712523607679
46 139 0.9267279573214335
47 57 0.8283318826440286
47 58 0.7692190372419163
47 65 0.7524623504985525
47 66 0.8006640665582828
47 87 0.8495380245776313
47 88 0.7699719892949662
47 139 0.8806934322201238
48 132 0.8049951916502321
49 50 0.7444022800706805
54 143 0.7810649610784085
56 135 0.970252061075496
57 58 0.8077027280090804
57 87 0.8728636135294296
57 88 0.7062246894508207
57 139 0.8610329294197461
58 87 0.7731590366719878
58 139 0.7287582078214014
65 66 0.9424737295916248
65 115 0.7418535563798259
65 139 0.9092843917905339
66 139 0.883718087444885
73 74 0.7550616074971483
73 90 0.734388527705365
73 140 0.8516123803433115
74 90 0.7263122582051521
74 140 0.7763536455257833
75 145 0.8273095407279792
76 144 0.8042760966686283
77 78 0.7772263349965021
77 136 0.8230265914041464
77 137 0.7944461843198992
78 136 0.7387155151524525
79 85 0.7568452313261985
79 86 0.7137681724709485
80 86 0.7199202904224011
80 148 0.7221243300443975
80 149 0.8397242364455698
81 82 0.7797449091529451
83 84 0.7736218110177586
85 86 0.7806016995782287
87 88 0.823782966823936
87 139 0.8245237113715749
89 90 0.7036703064364271
89 140 0.7201350936553464
90 140 0.8873052329995973
91 92 0.828470485040562
93 94 0.7705262861162909
95 96 0.7286604973489357
114 115 0.7093963829008457
115 139 0.7104305835263973
120 121 0.7610169549794029
126 127 0.7219901269566862
130 162 0.7101086628395967
136 137 0.8661578839293997
141 142 0.7135741246821445
145 149 0.7086023392225472
148 149 0.7508140870407385
154 155 0.7230999812581685
160 161 0.7069211084908653
