*Vertices 164
*Edges
2 3 1.1294704942463114
3 144 1.141052593280986
3 145 0.8872753684949931
5 27 0.9004204597006378
5 53 1.1383062716558252
7 154 1.0211965530153106
8 159 1.593465481636311
9 11 0.9626039272356651
9 158 1.286622943349027
12 32 1.0533356883117588
12 137 0.891511523859003
13 33 0.9414755781822018
14 15 0.8789550861077757
17 82 0.889261633260663
20 21 0.8993115330988617
24 25 0.8775965611050246
24 161 1.5470557614845484
27 53 0.8723788253112875
34 153 1.0171306878325166
35 150 0.8841771759684409
35 152 1.6095952870027077
36 37 1.0074421663086255
37 80 1.0283105962933867
37 148 1.092324453107141
37 149 0.9120211759636916
37 152 0.8916567112290732
38 39 1.0871319430595388
38 145 0.8841843420516846
38 147 1.0145858837223816
38 148 0.9247816399261719
38 149 1.1002042846676054
39 144 0.9867266186359082
39 160 0.9005108131665012
40 157 1.3794136852471974
41 160 0.8916903068900768
45 141 0.9185370754653696
46 47 1.4600245183935412
46 65 0.8821035946813605
46 66 0.9733258278249114
46 87 1.0115643551526945
46 139 1.0900681877489984
47 66 1.0243930654979794
47 87 1.0660210083269617
47 139 1.0851811183253794
48 51 0.9062968580686295
48 132 1.5300741955040376
49 147 0.8712230100406967
51 132 0.86970226176971
52 54 0.8793712756971801
53 54 0.9210089400053805
54 143 0.9379765321409115
56 135 2.3881144745080687
57 58 1.5648214245661831
57 87 1.1448701850908292
57 88 0.9573951649619825
57 139 1.2974095280562692
58 87 1.0048265088864519
58 88 1.0125586790303218
58 139 1.2045246963978662
59 60 0.8784352912988895
61 62 0.9718316240534318
63 64 0.9493624613694882
65 66 1.5472069283045256
65 139 1.2193105450055097
66 139 1.3586656825284404
72 74 0.9179368400089739
73 74 0.9292095874012655
74 140 0.885720885256436
75 145 1.4373362182454374
75 146 0.9598276880577212
75 147 0.9188695600097376
76 144 0.9776825705561268
78 86 0.8961989676985079
78 136 0.9233249360581588
79 85 0.9425065597911207
79 86 1.0449881176512474
80 86 0.9478392796848563
80 148 1.0932308418598422
80 149 0.968776630335427
81 82 0.9368249767604828
85 86 0.8737514812734638
87 88 1.0212923106390461
87 139 0.9186737534193363
89 140 1.0806277441217649
90 140 1.203748183778968
91 92 1.48667188559943
93 94 0.9182160760705648
95 96 1.2844776222220735
99 100 0.9953740385704903
101 102 0.9193147695455621
106 162 0.9161266633220383
107 163 0.9687237572936057
114 115 1.0278212051470004
116 118 0.9762019485581027
120 121 0.9649696290663412
127 128 1.0038384004038658
136 137 0.9490096250331752
144 145 1.0513213419692198
144 146 0.9803432539672068
144 148 0.900471037541773
145 146 1.0313975335095917
145 147 0.9931637094645623
146 147 1.0686530911416847
148 149 1.4124860514794022
160 161 0.9393138309644915
