*Vertices 164
*Edges
1 53 0.71504819475991
1 146 0.7945065801606893
2 3 0.7164768092586953
2 145 0.7764535210663548
3 144 0.8701034390596092
4 5 0.8415520682719676
4 7 0.7099897658341675
5 7 0.7848612278202378
7 154 0.8122383465036982
8 159 0.8806433912126068
9 158 0.7380090902839798
12 13 0.7997754604563454
12 32 0.8859857674651267
12 33 0.7883342531769982
12 137 0.7138964654082482
12 138 0.8820674133288854
13 32 0.7210227213489872
13 33 0.8765386639945388
13 49 0.7145297338201095
13 136 0.8322189773601995
13 138 0.7845120213025575
14 15 0.749219556093538
14 26 0.7445429983597982
14 27 0.7193324050712349
14 59 0.7136486437601103
15 27 0.8015515182809195
15 59 0.7239927876494551
15 60 0.7728504719920304
19 85 0.7450510723475098
19 137 0.7679487086629356
20 22 0.7100515435084581
22 23 0.7385901608202947
22 161 0.7385424589327584
23 41 0.7441914717948331
23 160 0.8085178744169885
24 161 0.8399739040815757
25 160 0.8535021970342127
26 27 0.7480083263135097
30 44 0.7312404454026907
32 33 0.7380519471931895
32 137 0.7385277375612672
32 138 0.8430687868298306
33 136 0.7928186713845339
33 138 0.8493212905623908
34 152 0.7169698503840578
34 153 0.9590771515583135
35 152 0.9011675069716983
36 38 0.712682724687676
36 137 0.7456885018162177
36 149 0.7279857998624192
36 153 0.7789087226707255
37 152 0.7355163334473099
38 157 0.75031462636097
39 41 0.720003595631732
39 43 0.7231719956084437
39 155 0.7649231352527879
40 157 0.8162297536544463
40 161 0.8067454425413787
41 43 0.7190533650336559
41 55 0.7370846209011219
41 155 0.76576039587573
41 160 0.8139148842419456
42 43 0.7402321247955779
42 135 0.7144839797942011
42 142 0.719533703557382
43 56 0.7424588352002375
43 133 0.8436966095863934
43 135 0.7739094059333547
44 45 0.7543370205728646
44 141 0.7018388892513938
44 142 0.829161816833402
45 140 0.7216287775464114
45 141 0.8552915138420102
45 142 0.7602541734560512
46 47 0.7004159552993815
46 65 0.8034968360346207
46 87 0.877792505305377
46 139 0.8866504099986459
47 88 0.7434617505822084
47 139 0.7882178458988404
48 59 0.7379672698876362
48 60 0.7592016871056096
49 50 0.7512136151917717
49 138 0.7138493281449682
52 53 0.7973634108258835
52 54 0.7507914889414338
52 132 0.7422031854892986
52 143 0.7243378485668379
53 132 0.805946293948168
54 143 0.7629140929952763
56 135 0.9903637929903699
57 58 0.7516753276262316
57 87 0.7413926056202995
57 139 0.7987025436147943
58 88 0.7646047189595042
58 139 0.8013880620421758
59 60 0.8482329791490375
65 139 0.773597909851685
67 68 0.7132619608693024
71 72 0.7083429129063793
71 73 0.7709821895978567
73 74 0.7857921221270462
74 140 0.7391812221215864
75 145 0.7419767159508295
77 79 0.7240124622633062
84 85 0.8085858369490244
84 86 0.7550569067117332
85 86 0.8357840023664813
85 136 0.7234501198479457
85 137 0.8289080994975822
86 136 0.832976172868
86 137 0.8090364903392088
87 139 0.86645921820003
88 139 0.7133068796405633
89 90 0.8716856935094026
89 139 0.707013984034249
89 140 0.8277384419854377
90 139 0.8268955531953485
90 140 0.7901379603628154
90 141 0.7195856862855156
93 94 0.8266668466459277
95 96 0.7072496273072688
106 107 0.7922288384480629
106 115 0.7727863322864237
106 163 0.8539437423636114
107 109 0.7097531549263612
107 115 0.7084741922817411
107 163 0.9376900713964822
112 113 0.8248871075663823
112 126 0.8154016095366962
113 126 0.7177354124825895
114 115 0.7395192440415825
114 127 0.7132744073367768
115 127 0.7718958492489875
115 163 0.7199204824537538
121 130 0.7136334876425421
127 128 0.7070460329029177
136 137 0.8246136921331284
139 141 0.7264251583527812
141 142 0.8738888240047175
152 153 0.7065597146061551
160 161 0.7129896413851529
