*Vertices 164
*Edges
1 109 0.940619683256889
2 3 0.9078166013849998
2 75 0.9313545066992627
2 145 1.1021804854605985
5 53 1.042801283482266
6 40 0.9174053847336279
6 156 1.2243833490768594
6 157 1.10958672933393
7 154 1.3930727068287685
7 155 1.067969153143888
9 11 0.8826293443407418
12 13 0.8883625876765517
12 32 1.1809761548852225
12 77 1.019493698938572
12 137 1.1790378938388824
13 33 0.9669155873930343
13 136 1.1987121060293426
14 15 1.0175293041629354
14 82 0.9302310485828535
15 51 1.0086370266681708
15 62 0.8810736470495029
15 69 0.9315470956397026
15 82 0.9028689201490891
15 102 0.8945040990651001
16 86 0.8773901958250471
17 82 1.0592432185336311
17 86 1.0129502579792373
18 85 0.8760402094752315
19 86 1.0327699998987627
21 23 0.8903300841994592
23 41 0.9141227440909329
25 31 0.9030166272629168
28 29 1.024511788052924
30 31 1.090368250293736
32 77 0.9554147889070242
32 137 0.9954474311444049
32 138 0.9408961338289255
33 136 0.9597649496627305
33 152 0.9494661600178539
34 36 0.8832031731784727
34 153 1.4401274336878078
35 152 1.2405417120057565
36 149 0.951798085856272
36 153 1.131916139955828
37 152 1.0117908522982435
38 148 1.083661181665307
38 149 1.1372217707202303
40 157 1.196562945691724
42 43 0.8753959997335086
44 45 0.8762468374101824
44 71 0.9601400334666335
44 72 0.9109145088941095
44 142 0.9944648947213938
45 72 0.8690011977972834
45 141 1.1635121350390247
46 47 1.5093575191068445
46 65 1.221070642570068
46 66 1.1111949936780912
46 89 0.8852224047840017
46 139 1.5058496406921549
47 65 1.0538732430952695
47 66 1.1514011230142713
47 74 0.9601529840278332
47 89 0.8763684427301703
47 139 1.5202779708996543
48 132 0.9334144198316092
51 69 1.0110973148123859
56 135 2.446507694455297
57 58 0.9877860921864059
57 87 1.0181388014754889
61 62 0.9876947910395759
62 68 1.0202815543127073
62 70 0.9184580794080522
62 102 0.8948675987829471
65 66 1.3079059877651587
65 73 1.0587193556627226
65 74 0.9052020244752196
65 139 1.3895830079121272
66 73 1.0982744940759528
66 74 1.380361460071468
66 139 1.110675264101317
66 140 0.9344291448771366
69 70 1.0726420385029776
71 72 1.0978979535773212
71 73 0.8999048841098392
73 74 1.1732966831079574
73 139 0.8911545186240344
73 140 1.0298883930456104
74 140 1.2290964889832792
74 162 0.9091281431698669
75 145 1.236395343971034
76 144 1.1420508851501139
77 83 0.9534777074187807
77 85 0.9065710967860366
77 137 1.3864472713689215
78 84 0.9332566814033071
78 136 0.970879669709038
82 85 0.9064342280447156
82 86 1.032672241959898
83 85 1.1025895712601101
83 86 0.9619700724267262
85 86 1.2064457146470968
86 137 0.9570450388159132
87 88 0.9906550821687883
89 90 1.0013787254722635
89 139 1.0944872889913213
89 140 0.9021289206490369
90 140 1.0575569578592565
106 107 1.2986317856213918
106 108 1.001997429585444
106 114 1.1387514210685923
106 115 1.027276944533648
106 127 0.9097156580281682
106 162 1.1245587194808115
106 163 1.296792215651758
107 108 0.894220861227297
107 109 1.1266542799584385
107 115 1.0848024973223012
107 162 0.9717406232573814
107 163 1.6367192776419046
108 163 1.271421078499303
109 163 1.3075040728450835
112 113 1.0266283766825064
112 126 0.9925478648276089
113 126 0.875046446172393
114 115 1.1951562982085406
114 127 1.160031450344148
114 162 1.092635166810745
115 119 1.0188485474702305
115 127 1.2400402946065727
115 162 1.1789511987427441
115 163 0.9391842461068031
116 118 1.0752917966670894
118 119 0.8748737923465801
127 162 0.9072851981068751
136 137 0.9049025429217361
141 142 1.0405942061147913
148 149 1.05367056406402
154 155 0.8815807297155311
155 157 1.0562753239217018
156 157 1.0907649238799009
162 163 0.9911687049535238
