module gitlab.com/ruijc/storage/protocol

go 1.23

require google.golang.org/grpc v1.67.1

require (
	github.com/gabriel-vasile/mimetype v1.4.6
	github.com/go-resty/resty/v2 v2.15.3
	github.com/goexl/exception v0.0.1
	github.com/goexl/gox v1.8.9
	github.com/goexl/http v0.2.0
	github.com/goexl/hud v0.1.6
	github.com/goexl/log v0.0.7
	gitlab.com/ruijc/storage/core v0.1.3
)

require (
	golang.org/x/net v0.30.0 // indirect
	golang.org/x/sys v0.26.0 // indirect
	golang.org/x/text v0.19.0 // indirect
	google.golang.org/genproto/googleapis/rpc v0.0.0-20241021214115-324edc3d5d38 // indirect
	google.golang.org/protobuf v1.35.1 // indirect
)
