Jan 19 15:45:15.547 HYPERVISOR: Release 0.2.17-x86/Windows (tag 2017072410)
Jan 19 15:45:15.548 HYPERVISOR: Started on IP = 127.0.0.1, TCP port = 51419.
Jan 19 15:45:16.026 HYPERVISOR: exec_cmd: hypervisor version 
Jan 19 15:45:16.027 HYPERVISOR: exec_cmd: hypervisor working_dir C:\Users\Rui Dias\Desktop\ara_melhoria\ara_melhoria\project-files\dynamips 
Jan 19 15:45:16.027 GENERAL: working_dir=C:\Users\Rui Dias\Desktop\ara_melhoria\ara_melhoria\project-files\dynamips
Jan 19 15:45:16.027 HYPERVISOR: exec_cmd: hypervisor working_dir C:\Users\Rui Dias\Desktop\ara_melhoria\ara_melhoria\project-files\dynamips\6683e5d3-e506-4c63-baf4-db86ce7cdc5f 
Jan 19 15:45:16.028 GENERAL: working_dir=C:\Users\Rui Dias\Desktop\ara_melhoria\ara_melhoria\project-files\dynamips\6683e5d3-e506-4c63-baf4-db86ce7cdc5f
Jan 19 15:45:16.028 HYPERVISOR: exec_cmd: vm create Aveiro 6 c7200 
Jan 19 15:45:16.030 VM: VM Aveiro created.
Jan 19 15:45:16.031 HYPERVISOR: exec_cmd: vm set_con_tcp_port Aveiro 5011 
Jan 19 15:45:16.031 HYPERVISOR: exec_cmd: c7200 get_mac_addr Aveiro 
Jan 19 15:45:16.031 HYPERVISOR: exec_cmd: vm get_status Aveiro 
Jan 19 15:45:16.031 HYPERVISOR: exec_cmd: vm slot_add_binding Aveiro 0 0 C7200-IO-FE 
Jan 19 15:45:16.032 HYPERVISOR: exec_cmd: vm set_disk0 Aveiro 0 
Jan 19 15:45:16.032 HYPERVISOR: exec_cmd: vm set_exec_area Aveiro 64 
Jan 19 15:45:16.032 HYPERVISOR: exec_cmd: vm get_status Aveiro 
Jan 19 15:45:16.033 HYPERVISOR: exec_cmd: vm set_idle_pc Aveiro 0x60891b0c 
Jan 19 15:45:16.034 HYPERVISOR: exec_cmd: vm set_ios Aveiro C:/Users/Rui Dias/GNS3/images/IOS/c7200-a3jk9s-mz.124-25d.image 
Jan 19 15:45:16.034 HYPERVISOR: exec_cmd: c7200 set_mac_addr Aveiro ca06.1890.0000 
Jan 19 15:45:16.035 HYPERVISOR: exec_cmd: vm set_nvram Aveiro 512 
Jan 19 15:45:16.035 HYPERVISOR: exec_cmd: vm set_ram Aveiro 512 
Jan 19 15:45:16.035 HYPERVISOR: exec_cmd: vm get_status Aveiro 
Jan 19 15:45:16.035 HYPERVISOR: exec_cmd: vm slot_remove_binding Aveiro 0 0 
Jan 19 15:45:16.036 HYPERVISOR: exec_cmd: vm get_status Aveiro 
Jan 19 15:45:16.036 HYPERVISOR: exec_cmd: vm slot_add_binding Aveiro 0 0 C7200-IO-2FE 
Jan 19 15:45:16.036 HYPERVISOR: exec_cmd: vm get_status Aveiro 
Jan 19 15:45:16.036 HYPERVISOR: exec_cmd: vm slot_add_binding Aveiro 1 0 PA-2FE-TX 
Jan 19 15:45:16.036 HYPERVISOR: exec_cmd: vm get_status Aveiro 
Jan 19 15:45:16.037 HYPERVISOR: exec_cmd: vm slot_add_binding Aveiro 2 0 PA-2FE-TX 
Jan 19 15:45:16.037 HYPERVISOR: exec_cmd: vm get_status Aveiro 
Jan 19 15:45:16.037 HYPERVISOR: exec_cmd: vm slot_add_binding Aveiro 3 0 PA-2FE-TX 
Jan 19 15:45:27.106 HYPERVISOR: exec_cmd: nio create_udp udp-add348c1-ff2b-4205-a1de-3ce2dbc3302d 10060 127.0.0.1 10061 
Jan 19 15:45:27.656 HYPERVISOR: exec_cmd: vm slot_add_nio_binding Aveiro 1 0 udp-add348c1-ff2b-4205-a1de-3ce2dbc3302d 
Jan 19 15:45:27.656 HYPERVISOR: exec_cmd: vm get_status Aveiro 
Jan 19 15:45:28.412 HYPERVISOR: exec_cmd: nio create_udp udp-c2004784-c5f6-4da9-b61d-59ebffc59fa8 10068 127.0.0.1 10069 
Jan 19 15:45:28.414 HYPERVISOR: exec_cmd: vm slot_add_nio_binding Aveiro 0 0 udp-c2004784-c5f6-4da9-b61d-59ebffc59fa8 
Jan 19 15:45:28.414 HYPERVISOR: exec_cmd: vm get_status Aveiro 
Jan 19 15:45:28.509 HYPERVISOR: exec_cmd: nio create_udp udp-3a82bedc-dd1f-424c-88bd-fe251ef999ca 10072 127.0.0.1 10073 
Jan 19 15:45:28.512 HYPERVISOR: exec_cmd: vm slot_add_nio_binding Aveiro 2 0 udp-3a82bedc-dd1f-424c-88bd-fe251ef999ca 
Jan 19 15:45:28.512 HYPERVISOR: exec_cmd: vm get_status Aveiro 
Jan 19 15:45:29.147 HYPERVISOR: exec_cmd: nio create_udp udp-58c5ac31-c740-431f-adde-31a0822dc183 10078 127.0.0.1 10079 
Jan 19 15:45:29.149 HYPERVISOR: exec_cmd: vm slot_add_nio_binding Aveiro 2 1 udp-58c5ac31-c740-431f-adde-31a0822dc183 
Jan 19 15:45:29.150 HYPERVISOR: exec_cmd: vm get_status Aveiro 
Jan 19 16:17:12.496 HYPERVISOR: exec_cmd: vm create Ghost 0 c7200 
Jan 19 16:17:12.498 VM: VM Ghost created.
Jan 19 16:17:12.498 HYPERVISOR: exec_cmd: vm set_ios Ghost C:/Users/Rui Dias/GNS3/images/IOS/c7200-a3jk9s-mz.124-25d.image 
Jan 19 16:17:12.498 HYPERVISOR: exec_cmd: vm set_ghost_status Ghost 1 
Jan 19 16:17:12.499 HYPERVISOR: exec_cmd: vm set_ghost_file Ghost 'C:\Users\Rui Dias\Desktop\ara_melhoria\ara_melhoria\project-files\dynamips\c7200-a3jk9s-mz.124-25d.image-512.ghost' 
Jan 19 16:17:12.499 HYPERVISOR: exec_cmd: vm get_status Aveiro 
Jan 19 16:17:12.500 HYPERVISOR: exec_cmd: vm set_config Aveiro configs\i6_startup-config.cfg 
Jan 19 16:17:12.500 HYPERVISOR: exec_cmd: vm start Aveiro 
Jan 19 16:17:43.090 HYPERVISOR: exec_cmd: vm extract_config Aveiro 
Jan 19 16:26:41.460 HYPERVISOR: exec_cmd: vm get_status Aveiro 
Jan 19 16:26:41.460 HYPERVISOR: exec_cmd: vm stop Aveiro 
Jan 19 16:26:41.930 VM: VM Aveiro shutdown.
Jan 19 16:26:41.932 HYPERVISOR: exec_cmd: vm extract_config Aveiro 
Jan 19 16:28:38.550 HYPERVISOR: Stopped.
Jan 19 16:28:38.550 VM: VM Ghost destroyed.
Jan 19 16:28:38.578 VM: VM Aveiro destroyed.
Jan 19 16:28:38.615 GENERAL: reset done.
