Jan 29 13:20:58.939 HYPERVISOR: Release 0.2.17-x86/Windows (tag 2017072410)
Jan 29 13:20:58.940 HYPERVISOR: Started on IP = 127.0.0.1, TCP port = 53725.
Jan 29 13:20:59.412 HYPERVISOR: exec_cmd: hypervisor version 
Jan 29 13:20:59.413 HYPERVISOR: exec_cmd: hypervisor working_dir C:\Users\Rui Dias\Desktop\ara_melhoria\ara_melhoria\project-files\dynamips 
Jan 29 13:20:59.413 GENERAL: working_dir=C:\Users\Rui Dias\Desktop\ara_melhoria\ara_melhoria\project-files\dynamips
Jan 29 13:20:59.413 HYPERVISOR: exec_cmd: hypervisor working_dir C:\Users\Rui Dias\Desktop\ara_melhoria\ara_melhoria\project-files\dynamips\7ed7a247-f1f7-48e3-b6b8-62afad7c251c 
Jan 29 13:20:59.414 GENERAL: working_dir=C:\Users\Rui Dias\Desktop\ara_melhoria\ara_melhoria\project-files\dynamips\7ed7a247-f1f7-48e3-b6b8-62afad7c251c
Jan 29 13:20:59.414 HYPERVISOR: exec_cmd: vm create Faro 11 c7200 
Jan 29 13:20:59.417 VM: VM Faro created.
Jan 29 13:20:59.418 HYPERVISOR: exec_cmd: vm set_con_tcp_port Faro 5019 
Jan 29 13:20:59.418 HYPERVISOR: exec_cmd: c7200 get_mac_addr Faro 
Jan 29 13:20:59.418 HYPERVISOR: exec_cmd: vm get_status Faro 
Jan 29 13:20:59.418 HYPERVISOR: exec_cmd: vm slot_add_binding Faro 0 0 C7200-IO-FE 
Jan 29 13:20:59.419 HYPERVISOR: exec_cmd: vm set_disk0 Faro 0 
Jan 29 13:20:59.419 HYPERVISOR: exec_cmd: vm set_exec_area Faro 64 
Jan 29 13:20:59.419 HYPERVISOR: exec_cmd: vm get_status Faro 
Jan 29 13:20:59.420 HYPERVISOR: exec_cmd: vm set_idle_pc Faro 0x60795184 
Jan 29 13:20:59.421 HYPERVISOR: exec_cmd: vm set_ios Faro C:/Users/Rui Dias/GNS3/images/IOS/c7200-a3jk9s-mz.124-25d.image 
Jan 29 13:20:59.421 HYPERVISOR: exec_cmd: c7200 set_mac_addr Faro ca0b.0bbc.0000 
Jan 29 13:20:59.421 HYPERVISOR: exec_cmd: vm set_nvram Faro 512 
Jan 29 13:20:59.422 HYPERVISOR: exec_cmd: vm set_ram Faro 512 
Jan 29 13:20:59.422 HYPERVISOR: exec_cmd: vm get_status Faro 
Jan 29 13:20:59.422 HYPERVISOR: exec_cmd: vm slot_remove_binding Faro 0 0 
Jan 29 13:20:59.423 HYPERVISOR: exec_cmd: vm get_status Faro 
Jan 29 13:20:59.423 HYPERVISOR: exec_cmd: vm slot_add_binding Faro 0 0 C7200-IO-2FE 
Jan 29 13:20:59.423 HYPERVISOR: exec_cmd: vm get_status Faro 
Jan 29 13:20:59.423 HYPERVISOR: exec_cmd: vm slot_add_binding Faro 1 0 PA-2FE-TX 
Jan 29 13:20:59.424 HYPERVISOR: exec_cmd: vm get_status Faro 
Jan 29 13:20:59.424 HYPERVISOR: exec_cmd: vm slot_add_binding Faro 2 0 PA-2FE-TX 
Jan 29 13:20:59.424 HYPERVISOR: exec_cmd: vm get_status Faro 
Jan 29 13:20:59.424 HYPERVISOR: exec_cmd: vm slot_add_binding Faro 3 0 PA-2FE-TX 
Jan 29 13:21:15.617 HYPERVISOR: exec_cmd: nio create_udp udp-53dfcde2-61f7-4417-b307-fc533bdbb536 10092 127.0.0.1 10093 
Jan 29 13:21:16.167 HYPERVISOR: exec_cmd: vm slot_add_nio_binding Faro 0 0 udp-53dfcde2-61f7-4417-b307-fc533bdbb536 
Jan 29 13:21:16.167 HYPERVISOR: exec_cmd: vm get_status Faro 
Jan 29 13:21:17.834 HYPERVISOR: exec_cmd: nio create_udp udp-a6a033b3-63b0-4c63-a8b5-1f315462764a 10104 127.0.0.1 10105 
Jan 29 13:21:17.836 HYPERVISOR: exec_cmd: vm slot_add_nio_binding Faro 2 0 udp-a6a033b3-63b0-4c63-a8b5-1f315462764a 
Jan 29 13:21:17.837 HYPERVISOR: exec_cmd: vm get_status Faro 
Jan 29 13:21:18.031 HYPERVISOR: exec_cmd: nio create_udp udp-601ebe93-f44d-4da8-8867-542f8643efea 10112 127.0.0.1 10113 
Jan 29 13:21:18.034 HYPERVISOR: exec_cmd: vm slot_add_nio_binding Faro 1 1 udp-601ebe93-f44d-4da8-8867-542f8643efea 
Jan 29 13:21:18.034 HYPERVISOR: exec_cmd: vm get_status Faro 
Jan 29 13:22:41.718 HYPERVISOR: exec_cmd: vm create Ghost 0 c7200 
Jan 29 13:22:41.724 VM: VM Ghost created.
Jan 29 13:22:41.724 HYPERVISOR: exec_cmd: vm set_ios Ghost C:/Users/Rui Dias/GNS3/images/IOS/c7200-a3jk9s-mz.124-25d.image 
Jan 29 13:22:41.725 HYPERVISOR: exec_cmd: vm set_ghost_status Ghost 1 
Jan 29 13:22:41.725 HYPERVISOR: exec_cmd: vm set_ghost_file Ghost 'C:\Users\Rui Dias\Desktop\ara_melhoria\ara_melhoria\project-files\dynamips\c7200-a3jk9s-mz.124-25d.image-512.ghost' 
Jan 29 13:22:41.726 HYPERVISOR: exec_cmd: vm get_status Faro 
Jan 29 13:22:41.727 HYPERVISOR: exec_cmd: vm set_config Faro configs\i11_startup-config.cfg 
Jan 29 13:22:41.727 HYPERVISOR: exec_cmd: vm start Faro 
Jan 29 13:23:24.606 HYPERVISOR: exec_cmd: vm extract_config Faro 
Jan 29 13:28:18.217 HYPERVISOR: exec_cmd: vm get_status Faro 
Jan 29 13:28:19.418 HYPERVISOR: exec_cmd: vm set_idle_pc_online Faro 0 0x61c18c78 
Jan 29 13:29:19.933 HYPERVISOR: exec_cmd: vm get_status Faro 
Jan 29 13:29:20.084 HYPERVISOR: exec_cmd: vm set_idle_pc_online Faro 0 0x6075dc04 
Jan 29 13:32:20.111 HYPERVISOR: exec_cmd: vm get_status Faro 
Jan 29 13:32:20.126 HYPERVISOR: exec_cmd: vm set_idle_pc_online Faro 0 0x60d7bf54 
Jan 29 13:33:17.587 HYPERVISOR: exec_cmd: vm get_status Faro 
Jan 29 13:33:18.403 HYPERVISOR: exec_cmd: vm set_idle_pc_online Faro 0 0x60d7be48 
Jan 29 13:35:32.068 HYPERVISOR: exec_cmd: vm get_status Faro 
Jan 29 13:35:32.878 HYPERVISOR: exec_cmd: vm set_idle_pc_online Faro 0 0x6079449c 
Jan 29 15:10:07.906 HYPERVISOR: exec_cmd: vm extract_config Faro 
Jan 29 15:22:15.360 HYPERVISOR: exec_cmd: vm get_status Faro 
Jan 29 15:22:15.360 HYPERVISOR: exec_cmd: vm stop Faro 
Jan 29 15:22:15.817 VM: VM Faro shutdown.
Jan 29 15:22:15.825 HYPERVISOR: exec_cmd: vm extract_config Faro 
Jan 29 16:27:35.616 HYPERVISOR: exec_cmd: vm create Ghost 0 c7200 
Jan 29 16:27:35.623 HYPERVISOR: exec_cmd: vm get_status Faro 
Jan 29 16:27:35.630 HYPERVISOR: exec_cmd: vm set_config Faro configs\i11_startup-config.cfg 
Jan 29 16:27:35.631 HYPERVISOR: exec_cmd: vm start Faro 
Jan 29 16:29:00.021 HYPERVISOR: exec_cmd: vm create Ghost 0 c7200 
Jan 29 16:29:00.044 HYPERVISOR: exec_cmd: vm get_status Faro 
Jan 29 16:30:06.800 HYPERVISOR: exec_cmd: vm get_status Faro 
Jan 29 16:30:06.801 HYPERVISOR: exec_cmd: vm stop Faro 
Jan 29 16:30:07.432 VM: VM Faro shutdown.
Jan 29 16:30:07.433 HYPERVISOR: exec_cmd: vm extract_config Faro 
Jan 29 16:30:17.372 HYPERVISOR: exec_cmd: vm get_status Faro 
Jan 29 16:30:17.373 HYPERVISOR: exec_cmd: vm extract_config Faro 
Jan 29 16:30:28.310 HYPERVISOR: Stopped.
Jan 29 16:30:28.310 VM: VM Ghost destroyed.
Jan 29 16:30:28.340 VM: VM Faro destroyed.
Jan 29 16:30:28.420 GENERAL: reset done.
