Jan 19 15:45:13.409 HYPERVISOR: Release 0.2.17-x86/Windows (tag 2017072410)
Jan 19 15:45:13.410 HYPERVISOR: Started on IP = 127.0.0.1, TCP port = 51405.
Jan 19 15:45:13.888 HYPERVISOR: exec_cmd: hypervisor version 
Jan 19 15:45:13.889 HYPERVISOR: exec_cmd: hypervisor working_dir C:\Users\Rui Dias\Desktop\ara_melhoria\ara_melhoria\project-files\dynamips 
Jan 19 15:45:13.889 GENERAL: working_dir=C:\Users\Rui Dias\Desktop\ara_melhoria\ara_melhoria\project-files\dynamips
Jan 19 15:45:13.889 HYPERVISOR: exec_cmd: ethsw create netX2 
Jan 19 15:45:23.768 HYPERVISOR: exec_cmd: nio create_udp udp-ef62065d-f33f-449b-bd32-28a9396549b7 10004 127.0.0.1 10005 
Jan 19 15:45:23.769 HYPERVISOR: exec_cmd: ethsw add_nio netX2 udp-ef62065d-f33f-449b-bd32-28a9396549b7 
Jan 19 15:45:23.776 HYPERVISOR: exec_cmd: ethsw set_access_port netX2 udp-ef62065d-f33f-449b-bd32-28a9396549b7 1 
Jan 19 16:26:42.738 HYPERVISOR: exec_cmd: ethsw delete netX2 
Jan 19 16:26:42.765 HYPERVISOR: exec_cmd: hypervisor stop 
Jan 19 16:26:43.130 HYPERVISOR: Stopped.
Jan 19 16:26:43.130 GENERAL: reset done.
