{
  "orders": [
    {
      "uuid": "36389ee8-7513-454b-a90a-cb8e8e4264bb",
      "total": 1234,
      "date": 111111111,
      "products": [
        {
          "title": "foo",
          "description": "aaa bbb ccc ddd",
          "price": 1.123,
          "category": "cat1",
          "uuid": "36389ee8-7513-454b-a90a-cb8e8e4264bb",
          "manufacturer": {
            "name": "ABC",
            "location": "Porto",
            "timestamp": 12345678
          }
        },
        {
          "title": "foo bar",
          "description": "aaa bbb ccc ddd",
          "price": 1.123,
          "category": "cat1",
          "uuid": "36389ee8-7513-454b-a90a-cb8e8e4264b1",
          "manufacturer": {
            "name": "Foo",
            "location": "Bar",
            "timestamp": 12345678
          }
        }
      ]
    }
  ]
}
