{
    "runtimes": {
        "runsc": {
            "path": "/usr/local/bin/runsc",
            "runtimeArgs": [
                "--pod-init-config=/etc/themis/process_monitor.json",
                "--overlay2=none"
            ]
        }
    }
}
