{
    "$schema": "https://json-schema.org/draft/2020-12/schema",
    "$id": "https://digitallab.rug.nl/themis/runtime/file-reference.schema.json",
    "title": "File Reference",
    "description": "A reference to a file",

    "type": "string",
    "pattern": "^\\$.*$",
    "$comment": "This is currently just some placeholder logic - we might extend this in the future"
}
