{
    "$schema": "https://json-schema.org/draft/2020-12/schema",
    "$id": "https://digitallab.rug.nl/repoman/course.schema.json",
    "title": "RepoMan Course Configuration",
    "description": "Configuration for RepoMan for a specific course in the Digital Lab environment",

    "$comment": "This is a placeholder to illustrate configuration composability",

    "type": "object",
    "properties": {
        "platform": {
            "description": "The platform on which the repositories should be hosted",

            "type": "string",
            "enum": [ "gitlab" ]
        }
    },

    "required": [ "platform" ],
    "unevaluatedProperties": false
}
