{
    "$schema": "https://json-schema.org/draft/2020-12/schema",
    "$id": "https://digitallab.rug.nl/date-time.schema.json",
    "title": "Date Formatting",
    "description": "Custom date formatting used in the Digital Lab configuration",
    "$comment": "This custom date format is introduced from a usability perspective, as the standard JSON format only supports dates in the form 1970-01-01T00:00:00Z (and similar)",

    "type": "string",
    "oneOf": [
        {
            "format": "date-time",
            "$comment": "We always want to support the date-time RFC format if users wish to"
        },
        {
            "pattern": "^[0-9]{4}-[0-9]{2}-[0-9]{2} [0-9]{2}:[0-9]{2}(:[0-9]{2})?$",
            "$comment": "RFC-like date-time specifiction with optional time and seconds"
        }
    ]
}
