{
    "template": "blocked_account",
    "from": "",
    "subject": "",
    "resultUrl": "",
    "syntax": "liquid",
    "body": "./blocked_account.html",
    "urlLifetimeInSeconds": 432000,
    "enabled": true
}