empno,empname,dept,designation
101,Rahul Sharma,IT,Software Engineer
102,Priya Patel,HR,HR Manager
103,Arjun Desai,Finance,Financial Analyst
104,Ananya Kapoor,Marketing,Marketing Specialist
105,Amit Gupta,IT,Systems Administrator
106,Kavita Reddy,Finance,Accountant
107,Aditya Singh,IT,Data Analyst
108,Meera Joshi,Operations,Operations Manager
109,Vivek Mehta,Marketing,Product Manager
110,Anjali Verma,HR,Recruitment Coordinator