{
    "enabled": true, 
    "interpreter": 1, 
    "key": "teststep2", 
    "name": "Test Step 2", 
    "osCredKey": "cred1", 
    "serverKey": "node1", 
    "successExitCode": 0, 
    "type": "com.servertribe.attune.tuples.StepSshTuple"
}