{
    "acceptOraErrors": null, 
    "commit": true, 
    "enabled": true, 
    "key": "teststep6", 
    "name": "Test Step 6", 
    "osCredKey": "cred1", 
    "plsql": true, 
    "serverKey": "node1", 
    "sql": "select * from table;", 
    "sqlCredKey": "cred3", 
    "type": "com.servertribe.attune.tuples.StepSqlOracleTuple"
}