{
    "enabled": true, 
    "interpreter": 1, 
    "key": "teststep4", 
    "name": "Test Step 4", 
    "osCredKey": "cred1", 
    "serverKey": "node1", 
    "successExitCode": 0, 
    "type": "com.servertribe.attune.tuples.StepSshTuple"
}