{
    "fileName": "WIN_Util_WinSCP.zip", 
    "formatKey": "zip", 
    "key": "winutilwinscp", 
    "md5": "1c77e56a215b0bc8d8f0b2d76de85564", 
    "name": "WIN Util WinSCP", 
    "remoteUri": null, 
    "size": 9843440, 
    "type": "com.servertribe.attune.tuples.FileArchiveLargeTuple"
}