{
    "enabled": true, 
    "interpreter": 1, 
    "key": "ksploaddriversiso", 
    "name": "KSP Load Drivers ISO", 
    "osCredKey": "parallelshostuser", 
    "serverKey": "parallelshost", 
    "successExitCode": 0, 
    "type": "com.servertribe.attune.tuples.StepSshTuple"
}