{
    "enabled": true, 
    "interpreter": 2, 
    "interpreterCommand": null, 
    "interpreterScriptExt": null, 
    "interpreterScriptSyntax": "powershell", 
    "key": "wsuumxtcleanupinstallmobaxterm", 
    "name": "WSUU MXT Cleanup Install MobaXTerm", 
    "osCredKey": "windowsadministrator", 
    "serverKey": "targetserverwin", 
    "successExitCode": 0, 
    "timeout": 30, 
    "type": "com.servertribe.attune.tuples.StepWinRmTuple"
}