{
    "enabled": true, 
    "interpreter": 1, 
    "interpreterCommand": null, 
    "interpreterScriptExt": null, 
    "interpreterScriptSyntax": "batchfile", 
    "key": "wsuuptinstallpowertoys", 
    "name": "WSUU PT Install Power Toys", 
    "osCredKey": "windowsadministrator", 
    "serverKey": "targetserverwin", 
    "successExitCode": 0, 
    "timeout": null, 
    "type": "com.servertribe.attune.tuples.StepWinRmTuple"
}