{
    "archiveKey": "winutilmobaxterm", 
    "deployPath": "/c$/software/mobaxterm", 
    "enabled": true, 
    "key": "wsuumxtdeploymobaxterm", 
    "name": "WSUU MXT Deploy MobaXTerm", 
    "osCredKey": "windowsadministrator", 
    "serverKey": "targetserverwin", 
    "type": "com.servertribe.attune.tuples.StepPushDesignFileTuple", 
    "unpack": true
}