{
    "enabled": true, 
    "interpreter": 1, 
    "key": "cleanuppycharmcommunityinstallers", 
    "name": "Clean Up PyCharm Community Installers", 
    "osCredKey": "linuxpeekuser", 
    "serverKey": "targetserverlin", 
    "successExitCode": 0, 
    "type": "com.servertribe.attune.tuples.StepSshTuple"
}