{
    "concurrency": 1, 
    "enabled": true, 
    "isBlueprint": true, 
    "key": "peekmacosreforkandreclone", 
    "links": [
        {
            "order": 0, 
            "stepKey": "uninstallallexistingplugins"
        }, 
        {
            "order": 20, 
            "stepKey": "recreatedevopsfolders"
        }, 
        {
            "order": 40, 
            "stepKey": "forkallgitlabrepositories1"
        }, 
        {
            "order": 80, 
            "stepKey": "cloneallgitlabreposiories"
        }, 
        {
            "order": 100, 
            "stepKey": "addgitlabupstreams"
        }, 
        {
            "order": 120, 
            "stepKey": "setuprepositoriesaspluginsfordevelopment"
        }, 
        {
            "order": 140, 
            "stepKey": "npminstallpeekplugindependencies"
        }
    ], 
    "name": "Peek macOS Refork and Reclone", 
    "type": "com.servertribe.attune.tuples.StepGroupTuple"
}