{
    "concurrency": 1, 
    "enabled": true, 
    "isBlueprint": false, 
    "key": "forkallgitlabrepositories1", 
    "links": [
        {
            "order": 0, 
            "stepKey": "downloadforkingscript"
        }, 
        {
            "order": 20, 
            "stepKey": "forkallgitlabrepositories2"
        }, 
        {
            "order": 40, 
            "stepKey": "cleanupforkingscript"
        }
    ], 
    "name": "Fork all GitLab Repositories (1)", 
    "type": "com.servertribe.attune.tuples.StepGroupTuple"
}