{
    "enabled": true, 
    "key": "ponrhe8rebootwait", 
    "minDowntime": 1, 
    "name": "PON RHE8 Reboot Wait", 
    "postWait": 20, 
    "preWait": 0, 
    "serverKey": "targetserverlin", 
    "tcpPort": 22, 
    "type": "com.servertribe.attune.tuples.StepTcpPingTuple"
}