{
    "enabled": true, 
    "interpreter": 2, 
    "key": "peekv3linpccconfiguresqlalchemyurl", 
    "name": "Peek v3 LIN PCC Configure SQLAlchemy URL", 
    "osCredKey": "linuxpeekuser", 
    "serverKey": "peekserver", 
    "successExitCode": 0, 
    "type": "com.servertribe.attune.tuples.StepSshTuple"
}