{
    "enabled": true, 
    "interpreter": 1, 
    "key": "peekv3linsetupdblvs", 
    "name": "Peek v3 LIN Setup DB LVs", 
    "osCredKey": "linuxrootuser", 
    "serverKey": "targetserverlin", 
    "successExitCode": 0, 
    "type": "com.servertribe.attune.tuples.StepSshTuple"
}