{
    "enabled": true, 
    "interpreter": 1, 
    "key": "pcfr8createfirewalllogfile", 
    "name": "PCFR8 Create Firewall Log File", 
    "osCredKey": "linuxrootuser", 
    "serverKey": "targetserverlin", 
    "successExitCode": 0, 
    "type": "com.servertribe.attune.tuples.StepSshTuple"
}