{
    "enabled": true, 
    "interpreter": 1, 
    "key": "ponrhel8sethostname", 
    "name": "PON RHEL8 Set Hostname", 
    "osCredKey": "linuxrootuser", 
    "serverKey": "targetserverlin", 
    "successExitCode": 0, 
    "type": "com.servertribe.attune.tuples.StepSshTuple"
}