{
    "enabled": true, 
    "interpreter": 1, 
    "key": "pcfr8setdefaultzonepublic", 
    "name": "PCFR8 Set Default Zone Public", 
    "osCredKey": "linuxrootuser", 
    "serverKey": "targetserverlin", 
    "successExitCode": 0, 
    "type": "com.servertribe.attune.tuples.StepSshTuple"
}