{
    "enabled": true, 
    "interpreter": 1, 
    "key": "peekv3rhel8ipgtunepostgresqlconf", 
    "name": "Peek v3 RHEL8 IPG Tune postgresql.conf", 
    "osCredKey": "linuxpeekuser", 
    "serverKey": "peekserver", 
    "successExitCode": 0, 
    "type": "com.servertribe.attune.tuples.StepSshTuple"
}