{
    "concurrency": 1, 
    "enabled": true, 
    "isBlueprint": false, 
    "key": "recreatedevopsfolders", 
    "links": [
        {
            "order": 0, 
            "stepKey": "removepreexistingdevopsfolders"
        }, 
        {
            "order": 20, 
            "stepKey": "recreateemptydevopsfolders"
        }
    ], 
    "name": "Recreate DevOps Folders", 
    "type": "com.servertribe.attune.tuples.StepGroupTuple"
}