{
    "concurrency": 1, 
    "enabled": true, 
    "isBlueprint": false, 
    "key": "installgnomedesktop", 
    "links": [
        {
            "order": 0, 
            "stepKey": "centos8installdesktop"
        }, 
        {
            "order": 20, 
            "stepKey": "centos8enabledesktop"
        }, 
        {
            "order": 40, 
            "stepKey": "centos8gnometweaks"
        }
    ], 
    "name": "Install Gnome-Desktop", 
    "type": "com.servertribe.attune.tuples.StepGroupTuple"
}