{
    "enabled": true, 
    "interpreter": 1, 
    "key": "ksparallelscopyisolinux", 
    "name": "KS Parallels Copy ISO Linux", 
    "osCredKey": "parallelshostuser", 
    "promptResponses": "Password:==={parallelsHostUser.password}", 
    "serverKey": "parallelshost", 
    "successExitCode": 0, 
    "type": "com.servertribe.attune.tuples.StepSshPromptedTuple"
}