{
    "enabled": true, 
    "interpreter": 1, 
    "key": "disablegpuforbrave", 
    "name": "Disable GPU for Brave", 
    "osCredKey": "linuxrootuser", 
    "serverKey": "targetserverlin", 
    "successExitCode": 0, 
    "type": "com.servertribe.attune.tuples.StepSshTuple"
}