{
    "enabled": true, 
    "interpreter": 1, 
    "key": "ponr8mailsendmailcheckhostsfile", 
    "name": "PONR8 MAIL Sendmail Check Hosts File", 
    "osCredKey": "linuxrootuser", 
    "serverKey": "targetserverlin", 
    "successExitCode": 0, 
    "type": "com.servertribe.attune.tuples.StepSshTuple"
}