{
    "enabled": true, 
    "interpreter": 1, 
    "key": "peekv3linpdrextractdataset", 
    "name": "Peek v3 LIN PDR Extract Dataset", 
    "osCredKey": "linuxpeekuser", 
    "serverKey": "peekserver", 
    "successExitCode": 0, 
    "type": "com.servertribe.attune.tuples.StepSshTuple"
}