{
    "concurrency": 5, 
    "enabled": true, 
    "isBlueprint": true, 
    "key": "peekv3lintestpeekdeployment", 
    "links": [
        {
            "order": 20, 
            "stepKey": "peekv3lintpdtestpeeklogic"
        }, 
        {
            "order": 40, 
            "stepKey": "peekv3lintpdtestpeekagent"
        }, 
        {
            "order": 60, 
            "stepKey": "peekv3lintpdtestpeekworker"
        }, 
        {
            "order": 80, 
            "stepKey": "peekv3lintpdtestpeekfield"
        }, 
        {
            "order": 100, 
            "stepKey": "peekv3lintpdtestpeekoffice"
        }
    ], 
    "name": "Peek v3 LIN Test Peek Deployment", 
    "type": "com.servertribe.attune.tuples.StepGroupTuple"
}