{
    "concurrency": 1, 
    "enabled": true, 
    "isBlueprint": true, 
    "key": "buildpeekv3developmentnodeoncentos8parallels", 
    "links": [
        {
            "order": 0, 
            "stepKey": "buildpeekv3serveroncentos8parallels"
        }, 
        {
            "order": 20, 
            "stepKey": "peekv3lindeploygistilesorion"
        }, 
        {
            "order": 40, 
            "stepKey": "peekv3oriondatasetcustomisation"
        }, 
        {
            "order": 60, 
            "stepKey": "peekv3linpdredeleteoldlogs"
        }, 
        {
            "order": 80, 
            "stepKey": "peekv3linpdrstartpeek"
        }, 
        {
            "order": 100, 
            "stepKey": "peekv3lintestpeekdeployment"
        }
    ], 
    "name": "Build Peek v3 Development Node on CentOS8+Parallels", 
    "type": "com.servertribe.attune.tuples.StepGroupTuple"
}