{
    "enabled": true, 
    "interpreter": 1, 
    "key": "drcustorv3cfggraphdbloader", 
    "name": "DRCUST OR v3 Cfg GraphDB Loader", 
    "osCredKey": "linuxpeekuser", 
    "serverKey": "peekserver", 
    "successExitCode": 0, 
    "type": "com.servertribe.attune.tuples.StepSshTuple"
}