{
    "enabled": true, 
    "interpreter": 1, 
    "key": "uninstallallpeekutilrepositories", 
    "name": "Uninstall all Peek-Util Repositories", 
    "osCredKey": "linuxpeekuser", 
    "serverKey": "peekserver", 
    "successExitCode": 0, 
    "type": "com.servertribe.attune.tuples.StepSshTuple"
}