{
    "concurrency": 3, 
    "enabled": true, 
    "isBlueprint": false, 
    "key": "uninstallallexistingplugins", 
    "links": [
        {
            "order": 0, 
            "stepKey": "uninstallallpeekrepositories"
        }, 
        {
            "order": 20, 
            "stepKey": "uninstallallpeekutilrepositories"
        }
    ], 
    "name": "Uninstall all existing plugins", 
    "type": "com.servertribe.attune.tuples.StepGroupTuple"
}