{
    "moviesData": [
        {
            "id": 1, 
            "image": "", 
            "title": "ZoomIn TV", 
            "favorite": true, 
            "duration": "1h 30m"
        },
        {
            "id": 2, 
            "image": "", 
            "title": "Mobio", 
            "favorite": false, 
            "duration": "2h 15m"
        },
        {
            "id": 3, 
            "image": "", 
            "title": "MTV", 
            "favorite": false, 
            "duration": "3h 30m"
        },
        {
            "id": 4, 
            "image": "", 
            "title": "Mobio Learn", 
            "favorite": true, 
            "duration": "11h 40m"
        },
        {
            "id": 5, 
            "image": "", 
            "title": "Mobio Yoga", 
            "favorite": false, 
            "duration": "2h 55m"
        },
        {
            "id": 6, 
            "image": "", 
            "title": "Mobio She", 
            "favorite": true, 
            "duration": "1h 30m"
        },
        {
            "id": 7, 
            "image": "", 
            "title": "Cooking TV", 
            "favorite": false, 
            "duration": "2h 45m"
        },
        {
            "id": 8, 
            "image": "", 
            "title": "Gossip", 
            "favorite": true, 
            "duration": "1h 30m"
        },
        {
            "id": 9, 
            "image": "", 
            "title": "Fashion TV", 
            "favorite": true, 
            "duration": "2h 30m"
        },
        {
            "id": 10, 
            "image": "", 
            "title": "ZoomIn TV", 
            "favorite": true, 
            "duration": "1h 50m"
        }
    ],
    "relatedVideos": [
        {
            "id": 1, 
            "title": "21005", 
            "favorite": true
        },
        {
            "id": 2, 
            "title": "21585", 
            "favorite": false
        },
        {
            "id": 3, 
            "title": "21905", 
            "favorite": false
        },
        {
            "id": 4, 
            "title": "21889", 
            "favorite": true
        },
        {
            "id": 5, 
            "title": "21785", 
            "favorite": false
        },
        {
            "id": 6, 
            "title": "71305", 
            "favorite": true
        },
        {
            "id": 7, 
            "title": "65005", 
            "favorite": false
        },
        {
            "id": 8, 
            "title": "41065", 
            "favorite": false
        }
    ],
    "favoriteChannels": [
        {
            "id": 1, 
            "title": "Zoom TV", 
            "favorite": true
        },
        {
            "id": 2, 
            "title": "Fitness TV", 
            "favorite": true
        },
        {
            "id": 3, 
            "title": "Football Tv", 
            "favorite": true
        }, 
        {
            "id": 4, 
            "title": "Football Tv", 
            "favorite": true
        } 
    ],
    "favoriteVideos": [
        {
            "id": 1, 
            "title": "MCF 12 - Ricky Martin vs Morgan Miller", 
            "favorite": true
        },
        {
            "id": 2, 
            "title": "Fitness TV", 
            "favorite": true
        },
        {
            "id": 3, 
            "title": "Football Tv", 
            "favorite": true
        }
    ],
    "history": [
        {
            "id": 1, 
            "title": "Mobio She", 
            "isChannel": true,
            "duration": "20 Days"
        },
        {
            "id": 2, 
            "title": "Mobio Learn", 
            "isChannel": true,
            "duration": "15 Days ago"
        },
        {
            "id": 3,
            "title": "Cooking TV",
            "isChannel": true,
            "duration": "20 Days ago"
        },
        {
            "id": 4,
            "title": "Episode 15",
            "isChannel": false,
            "duration": "15 Hours ago"
        },
        {
            "id": 5,
            "title": "Jovetic scores with ice-cool finish",
            "isChannel": false,
            "duration": "10 Hours ago"
        },
        {
            "id": 6,
            "title": "Chelsea have 'difficulties' playing Hazard, Willian and Pedro - Conte",
            "isChannel": false,
            "duration": "8 Hours ago"
        }
    ],
    "smartTv": [
        {
            "id": 1,
            "title": "MobioTV",
            "currentProgram": "Default Program",
            "nextProgram": "Default Program",
            "startTime": "05:30 am",
            "stopTime": "05:29 am"
        },
        {
            "id": 2,
            "title": "Zoom In Tv",
            "currentProgram": "My Fitness Coach",
            "nextProgram": "Pilates",
            "startTime": "05:30 am",
            "stopTime": "05:29 am"
        }
    ]
}