<?xml version="1.0" encoding="iso-8859-1"?>
<svg xmlns="http://www.w3.org/2000/svg" xmlns:xlink="http://www.w3.org/1999/xlink" version="1.1" id="Capa_1" x="0px" y="0px" viewBox="0 0 24 24" style="enable-background:new 0 0 24 24;" xml:space="preserve">
<g>
	<path d="M19,12c0,1.971-0.838,3.862-2.3,5.188c-0.287,0.261-0.647,0.39-1.008,0.39   c-0.408,0-0.814-0.166-1.11-0.492c-0.557-0.613-0.511-1.562,0.103-2.118C15.521,14.208,16,13.127,16,12   c0-1.13-0.478-2.21-1.31-2.965c-0.614-0.556-0.661-1.505-0.104-2.119c0.556-0.615,1.504-0.661,2.118-0.104   C18.163,8.134,19,10.025,19,12z M20.514,3.534c-0.584-0.587-1.535-0.589-2.121-0.005c-0.588,0.584-0.59,1.534-0.006,2.122   C20.072,7.343,21,9.598,21,12c0,2.396-0.93,4.649-2.618,6.347c-0.584,0.587-0.582,1.537,0.006,2.121   c0.292,0.291,0.675,0.437,1.058,0.437c0.385,0,0.771-0.147,1.063-0.442C22.76,18.199,24,15.194,24,12   C24,8.8,22.762,5.793,20.514,3.534z M12,10.187c-1.003,0-1.812,0.809-1.812,1.813c0,1,0.81,1.813,1.813,1.813S13.813,13,13.813,12   C13.813,10.996,13.003,10.187,12,10.187z M9.419,6.914C8.862,6.3,7.914,6.254,7.3,6.811C5.838,8.137,5,10.029,5,12   c0,1.977,0.837,3.867,2.297,5.188c0.287,0.26,0.647,0.388,1.006,0.388c0.409,0,0.816-0.166,1.113-0.493   c0.556-0.614,0.508-1.563-0.106-2.119C8.478,14.211,8,13.131,8,12c0-1.127,0.479-2.208,1.316-2.967   C9.93,8.476,9.976,7.527,9.419,6.914z M3,12c0-2.396,0.93-4.649,2.618-6.346c0.584-0.587,0.583-1.537-0.005-2.121   C5.027,2.948,4.077,2.951,3.492,3.538C1.24,5.8,0,8.806,0,12c0,3.199,1.238,6.206,3.486,8.466c0.293,0.295,0.678,0.442,1.063,0.442   c0.383,0,0.765-0.146,1.058-0.437c0.587-0.584,0.589-1.534,0.005-2.121C3.928,16.656,3,14.401,3,12z" fill="#c8002b"/>
</g>
</svg>
