{
  "IcoMoonType": "selection",
  "icons": [
    {
      "icon": {
        "paths": [
          "M731.321 680.73c-93.81 0-169.834-78.481-169.834-175.249s75.856-175.207 169.834-175.207 169.834 78.481 169.834 175.249-76.023 175.207-169.834 175.207zM111.806 505.522c0-96.768 76.023-175.249 169.834-175.249s169.834 78.481 169.834 175.249-76.065 175.249-169.834 175.249-169.834-78.481-169.834-175.249zM113.597 216.801c-65.526 0-113.597 51.404-113.597 119.054v342.916c0 67.65 48.072 128.427 113.597 128.427h301.176c9.039 0 17.454-7.623 22.495-15.413l47.905-83.438c6.154-7.913 15.676-12.956 26.375-12.956 10.363 0 19.621 4.73 25.733 12.149l0.046 0.057 47.947 84.729c4.999 7.748 13.413 15.038 22.453 15.038h301.135c65.567 0 115.097-60.818 115.097-128.427v-343.083c0.042-67.65-49.488-119.054-115.055-119.054h-795.306z"
        ],
        "attrs": [
          {
            "fill": "rgb(225, 205, 253)"
          }
        ],
        "isMulticolor": false,
        "isMulticolor2": false,
        "grid": 0,
        "tags": [
          "vr"
        ]
      },
      "attrs": [
        {
          "fill": "rgb(225, 205, 253)"
        }
      ],
      "properties": {
        "order": 70,
        "id": 0,
        "name": "vr",
        "prevSize": 32,
        "code": 59781
      },
      "setIdx": 0,
      "setId": 3,
      "iconIdx": 0
    }
  ],
  "height": 1024,
  "metadata": {
    "name": "icomoon"
  },
  "preferences": {
    "showGlyphs": true,
    "showQuickUse": true,
    "showQuickUse2": true,
    "showSVGs": true,
    "fontPref": {
      "prefix": "icon-",
      "metadata": {
        "fontFamily": "icomoon"
      },
      "metrics": {
        "emSize": 1024,
        "baseline": 6.25,
        "whitespace": 50
      },
      "embed": false
    },
    "imagePref": {
      "prefix": "icon-",
      "png": true,
      "useClassSelector": true,
      "color": 0,
      "bgColor": 16777215,
      "classSelector": ".icon",
      "name": "icomoon"
    },
    "historySize": 50,
    "showCodes": true,
    "gridSize": 16
  }
}