{
  "project_info": {
    "project_number": "30552744370",
    "firebase_url": "https://webpizzeta.firebaseio.com",
    "project_id": "webpizzeta",
    "storage_bucket": "webpizzeta.appspot.com"
  },
  "client": [
    {
      "client_info": {
        "mobilesdk_app_id": "1:30552744370:android:0cc9f1a4552deb76",
        "android_client_info": {
          "package_name": "com.tritonsoft.pizzeta"
        }
      },
      "oauth_client": [
        {
          "client_id": "30552744370-c1febl90rrcsmt39jrqkqrt6ihkel51k.apps.googleusercontent.com",
          "client_type": 3
        }
      ],
      "api_key": [
        {
          "current_key": "AIzaSyDa6Qo1XK3XPjn9iyyBcPUO1yaCVtqjpCs"
        }
      ],
      "services": {
        "analytics_service": {
          "status": 1
        },
        "appinvite_service": {
          "status": 1,
          "other_platform_oauth_client": []
        },
        "ads_service": {
          "status": 2
        }
      }
    }
  ],
  "configuration_version": "1"
}