{version=0.1,
net_type=simple,
places=
[adrenalin, desensitisation, GRK2/PKA/PKC,
B2AR, arrestin, Src, B1AR, AC, Gs, Gi, cAMP,
PKA, PI3K, cPLA2, PI3Kg, PDK1, Calcium, Calmodulin,
Calcineurin, Akt, GSK3b, NFAT, NFAT_P, hypertrophic_TFs],
transitions=
[adrenalin_release, desensitisation, desens>GRK2,
desens>arrestin, arrestin>Src, endocytosis,
adrenalin_B1AR, adrenalin_B2AR, Gs<>GRK2,
B2AR>Gs, B1AR>Gs, Gs>AC, AC>cAMP, AC<>Gi, cAMP<>Gi,
B2AR>Gi, cAMP>PKA, PKA>Ca, Ca>CaM, CaM>Caneur,
Caneur>NFAT, NFAT_P>NFAT, NFAT>hyper, Gi>PI3K/cPLA2,
PI3Kg>PDK1, cPLA2>PI3Kg, PI3K>PDK1, PDK1>Akt, GSK3b<>Akt,
NFAT/GSK3b>NFAT_P],
arcs=
[(out, adrenalin, adrenalin_release, 1),
(out, desensitisation, desensitisation, 1),
(in, desensitisation, desens>GRK2, 1),
(out, GRK2/PKA/PKC, desens>GRK2, 1),
(in, desensitisation, desens>arrestin, 1),
(out, arrestin, desens>arrestin, 1),
(in, arrestin, arrestin>Src, 1),
(out, Src, arrestin>Src, 1),
(in, Src, endocytosis, 1),
(in, Gs, endocytosis, 1),
(in, AC, endocytosis, 1),
(in, B1AR, endocytosis, 1),
(out, Akt, endocytosis, 1),
(in, adrenalin, adrenalin_B1AR, 1),
(out, B1AR, adrenalin_B1AR, 1),
(in, adrenalin, adrenalin_B2AR, 1),
(out, B2AR, adrenalin_B2AR, 1),
(in, Gs, Gs<>GRK2, 1),
(out, Gs, Gs<>GRK2, 1),
(in, GRK2/PKA/PKC, Gs<>GRK2, 1),
(in, B2AR, B2AR>Gs, 1),
(out, Gs, B2AR>Gs, 1),
(in, B1AR, B1AR>Gs, 1),
(out, Gs, B1AR>Gs, 1),
(in, Gs, Gs>AC, 1),
(out, AC, Gs>AC, 1),
(in, AC, AC>cAMP, 1),
(out, cAMP, AC>cAMP, 1),
(in, AC, AC<>Gi, 1),
(in, Gi, AC<>Gi, 1),
(in, cAMP, cAMP<>Gi, 1),
(in, Gi, cAMP<>Gi, 1),
(in, B2AR, B2AR>Gi, 1),
(in, GRK2/PKA/PKC, B2AR>Gi, 1),
(out, Gi, B2AR>Gi, 1),
(in, cAMP, cAMP>PKA, 1),
(out, PKA, cAMP>PKA, 1),
(in, PKA, PKA>Ca, 1),
(out, Calcium, PKA>Ca, 1),
(in, Calcium, Ca>CaM, 1),
(out, Calmodulin, Ca>CaM, 1),
(in, Calmodulin, CaM>Caneur, 1),
(out, Calcineurin, CaM>Caneur, 1),
(in, Calcineurin, Caneur>NFAT, 1),
(in, NFAT_P, Caneur>NFAT, 1),
(out, NFAT, Caneur>NFAT, 1),
(in, NFAT_P, NFAT_P>NFAT, 1),
(out, NFAT, NFAT_P>NFAT, 1),
(in, NFAT, NFAT>hyper, 1),
(out, hypertrophic_TFs, NFAT>hyper, 1),
(in, Gi, Gi>PI3K/cPLA2, 1),
(out, cPLA2, Gi>PI3K/cPLA2, 1),
(out, PI3K, Gi>PI3K/cPLA2, 1),
(in, PI3Kg, PI3Kg>PDK1, 1),
(out, PDK1, PI3Kg>PDK1, 1),
(in, cPLA2, cPLA2>PI3Kg, 1),
(out, PI3Kg, cPLA2>PI3Kg, 1),
(in, PI3K, PI3K>PDK1, 1),
(out, PDK1, PI3K>PDK1, 1),
(in, PDK1, PDK1>Akt, 1),
(out, Akt, PDK1>Akt, 1),
(in, Akt, GSK3b<>Akt, 1),
(in, GSK3b, GSK3b<>Akt, 1),
(in, NFAT, NFAT/GSK3b>NFAT_P, 1),
(in, GSK3b, NFAT/GSK3b>NFAT_P, 1),
(out, NFAT_P, NFAT/GSK3b>NFAT_P, 1)
]
}