92 PB2 112-152 (40) PA 1540-1566 (26)
Reference strain: A/WSN/1933
Strain	FE/interaction found	Seg. 1 span	Seg. 2 span	Full bonds/half bonds/no bonds	Mutations in whole site seg.1 / seg. 2
A/WSN/1933	-16.67	29-4 (25)	4-27 (23)	18/2/7	0/0
A/Moscow/10/1999	-15.1	29-4 (25)	4-27 (23)	17/3/7	2/1
A/Bangkok/1/1979	-15.68	29-4 (25)	4-27 (23)	18/2/7	0/1
A/Beijing/353/1989	-15.68	29-4 (25)	4-27 (23)	18/2/7	0/1
A/Leningrad/360/1986	-15.68	29-4 (25)	4-27 (23)	18/2/7	0/1
A/Wellington/01/2004	-16.51	27-4 (23)	7-27 (20)	16/1/8	1/2
A/Beijing/32/1992	-15.68	29-4 (25)	4-27 (23)	18/2/7	0/1
A/Wisconsin/67/2005	-16.51	27-4 (23)	7-27 (20)	16/1/8	1/2
A/Brisbane/10/2007	-16.51	27-4 (23)	7-27 (20)	16/1/8	1/2
A/Shandong/9/1993	-14.78	28-4 (24)	5-27 (22)	17/2/7	1/1
A/Philippines/2/1982	-15.68	29-4 (25)	4-27 (23)	18/2/7	0/1
A/Victoria/210/2009	-16.51	27-4 (23)	7-27 (20)	16/1/8	1/2
A/Texas/50/2012	-16.51	27-4 (23)	7-27 (20)	16/1/8	1/2
A/Victoria/361/2011	-16.51	27-4 (23)	7-27 (20)	16/1/8	1/2
A/Ohio/02/2012	-16.51	27-4 (23)	7-27 (20)	16/1/8	1/2
A/Colorado/06/2017	-15.09	29-4 (25)	4-27 (23)	17/3/7	0/2
A/Brisbane/1/2012	-16.51	27-4 (23)	7-27 (20)	16/1/8	1/2
A/Brisbane/6/2012	-16.51	27-4 (23)	7-27 (20)	16/1/8	1/2
A/South Australia/55/2014	-15.09	29-4 (25)	4-27 (23)	17/3/7	0/2
A/Kansas/14/2017	-15.09	29-4 (25)	4-27 (23)	17/3/7	0/2