3	101	135	4	831	863	26,126
2	1995	2035	7	585	631	25,688
7	382	420	8	605	631	24,944
2	1045	1071	5	1455	1497	22,223
5	1287	1325	7	227	249	20,787
4	107	131	5	1488	1528	20,207
1	377	401	2	307	337	18,046
3	173	215	8	732	760	16,186
3	743	775	7	204	230	17,245
1	110	140	3	1404	1432	14,837
5	1090	1120	7	95	127	16,300
2	2220	2250	3	330	360	13,203
1	2019	2047	3	852	882	11,443
1	1463	1513	5	656	698	10,347
6	58	102	7	838	878	8,053
1	433	465	8	647	681	8,283
1	1006	1050	2	972	1016	7,398
1	1152	1184	3	219	251	8,741
1	2044	2086	4	890	922	6,241
1	1541	1593	2	306	346	6,400
1	1299	1355	2	943	989	7,120
3	406	428	6	1183	1217	6,112
1	1595	1629	5	299	325	6,069
5	356	382	6	409	445	12,256
2	1611	1645	7	515	547	5,634
2	308	340	5	766	790	6,154
2	517	553	3	1373	1405	5,689
3	1539	1561	8	207	261	5,741
5	670	712	7	355	395	5,202
2	1602	1636	3	1371	1395	5,155
2	230	262	8	708	734	5,236
6	981	1011	7	937	967	5,936
3	1945	1971	4	1651	1689	7,230
2	1572	1608	3	97	129	4,655
2	1576	1608	4	89	123	4,738
3	1161	1189	5	681	709	4,341
5	675	717	7	400	434	4,241
3	554	596	5	278	306	4,141
1	1091	1133	3	1403	1427	4,148
1	1543	1579	3	1384	1422	4,067
2	304	342	4	1483	1515	8,472
1	341	379	2	2218	2260	4,321
1	611	641	7	575	617	3,819
1	1055	1087	7	830	860	4,097
2	735	777	8	791	831	4,830
5	1319	1365	7	941	983	3,900
1	2185	2225	5	669	709	3,769
1	1966	2008	8	468	514	3,924
3	112	154	5	1092	1120	3,594
2	920	956	3	606	632	5,017
1	2117	2151	7	224	250	4,022
1	602	638	3	154	190	3,409
6	923	955	7	725	759	3,827
7	116	148	8	510	542	4,660
4	1393	1429	5	258	284	3,166
1	246	272	6	1184	1216	3,387
2	2221	2253	4	1230	1250	3,455
1	1898	1936	6	280	318	2,907
3	1367	1393	5	860	896	3,126
1	1477	1511	2	1938	1974	3,830
1	181	217	3	81	113	2,965
3	25	55	8	661	695	2,985
1	1591	1637	3	85	129	2,912
2	2008	2050	3	1636	1660	2,774
1	1560	1602	4	795	837	2,727
1	1535	1585	3	64	110	2,699
2	355	387	6	52	76	2,721
4	1677	1713	8	593	621	3,002
2	769	803	8	673	703	3,204
2	1432	1482	3	70	98	3,082
2	353	391	7	572	612	2,387
2	2221	2253	3	1377	1409	2,420
2	1093	1125	5	1016	1042	2,345
4	883	923	5	1120	1158	2,450
1	1344	1404	7	216	244	2,373
3	1528	1554	8	422	462	2,284
3	1081	1127	7	789	833	2,507
1	194	222	3	1355	1381	2,327
3	1550	1584	6	878	920	2,166
2	161	195	6	1241	1277	3,153
2	730	772	8	527	565	2,378
6	1162	1198	7	580	638	2,207
2	975	1009	8	153	201	2,354
1	665	711	3	608	634	2,356
5	179	221	7	857	897	2,051
3	1075	1113	6	1050	1080	2,038
1	1561	1593	5	674	704	2,068
4	586	616	8	438	468	2,181
5	683	715	6	1186	1226	2,105
1	2117	2155	5	665	711	2,734
6	132	162	7	941	967	2,287
3	436	474	5	1452	1494	1,936
1	112	152	3	1540	1566	1,887
3	615	637	7	83	121	2,040
1	1445	1487	6	414	452	1,893
2	771	827	5	1087	1131	1,943
6	664	698	7	281	309	1,853
5	1338	1378	6	929	959	1,836
3	612	652	5	689	731	2,312
2	839	877	4	1702	1738	1,876
1	2199	2235	7	288	322	2,197
1	2014	2058	2	604	652	1,831
6	867	911	7	480	512	1,866
3	112	164	7	932	964	1,898
2	2225	2259	7	99	143	1,974
3	330	362	5	302	332	1,820
2	1629	1655	4	71	103	1,897
3	2112	2154	7	227	257	2,137
2	1526	1564	7	509	547	1,854
1	1010	1034	4	444	476	2,146
1	85	121	6	924	952	2,224
2	307	345	5	1012	1054	2,559
2	717	767	7	468	522	2,108
4	1030	1056	8	401	439	1,860
3	1370	1404	8	219	255	2,154
1	1576	1612	7	502	560	1,783
2	514	540	7	598	638	1,665
3	748	782	4	161	193	1,823
4	1649	1687	5	686	722	1,585
1	1851	1879	4	1403	1437	1,750
1	2181	2213	3	74	106	1,717
2	1516	1560	3	792	818	1,661
1	2024	2078	8	687	741	1,569
3	1367	1395	4	976	1008	1,523
2	1204	1230	5	488	522	1,684
1	1006	1044	5	1001	1035	1,546
5	549	593	7	530	606	1,463
1	1565	1605	3	795	845	1,609
5	1438	1486	7	555	593	2,023
1	691	725	6	30	58	1,446
1	1900	1936	4	614	644	1,654
1	214	258	2	2006	2056	1,497
3	1402	1428	6	351	399	1,717
1	1707	1745	2	1573	1615	1,426
4	1189	1219	5	1023	1079	1,918
5	1448	1484	6	1161	1191	1,380
1	2000	2032	2	53	93	1,370
2	2213	2247	7	827	869	1,519
2	1894	1924	5	1111	1149	1,453
3	346	370	4	78	118	1,399
2	2237	2269	4	1166	1200	2,033
2	771	813	7	314	352	1,400
1	1086	1134	8	606	642	1,355
6	157	211	7	594	636	1,342
4	1449	1505	8	230	264	1,345
3	1399	1427	5	968	1006	1,327
3	763	803	6	1233	1277	1,842
2	302	346	7	805	843	1,310
2	1932	1968	6	412	446	1,312
2	1925	1959	5	672	706	1,313
1	1996	2030	2	343	401	1,490
2	340	390	5	1092	1146	1,366
2	975	1021	5	1262	1302	1,228
3	611	645	5	782	812	1,551
2	978	1016	7	838	878	1,218
5	733	775	7	984	1014	1,516
1	1644	1700	2	735	783	1,240
1	1592	1622	4	55	99	1,231
3	765	793	5	812	842	1,691
4	1501	1547	8	759	799	1,515
3	1341	1397	7	575	623	1,198
2	769	811	5	362	400	1,248
1	1672	1702	5	250	282	1,281
3	76	100	6	753	787	1,209
6	1264	1298	7	859	889	1,382
1	1575	1615	2	205	229	1,354
1	523	555	7	601	635	1,158
1	2003	2057	3	1284	1332	1,256
2	2104	2148	4	61	103	1,185
2	742	780	5	1030	1064	1,181
2	1036	1078	8	419	457	1,120
4	1200	1222	5	924	968	1,178
2	748	792	3	611	635	1,096
6	245	299	7	501	543	1,113
4	1302	1328	8	312	362	1,079
1	773	819	7	506	550	1,110
3	2006	2046	8	70	98	1,101
1	1992	2040	3	58	100	1,295
1	399	431	2	1468	1504	1,084
5	873	911	7	938	968	1,066
2	660	710	7	568	620	1,048
4	1032	1070	8	64	104	1,969
1	2114	2158	2	471	511	1,165
2	345	393	7	399	445	1,646
7	974	1016	8	423	459	1,021
4	1484	1528	8	679	719	1,061
2	776	818	4	1650	1684	1,043
2	2225	2269	3	778	812	1,042
4	1441	1483	6	1036	1070	1,194
3	1368	1402	8	725	783	995
2	757	801	7	926	968	983
1	1341	1377	2	1429	1467	1,365
2	1342	1374	8	608	640	1,070
2	1084	1112	8	350	380	1,125
5	732	764	7	298	334	1,046
2	2217	2257	3	717	751	1,105
4	1040	1066	6	160	200	1,051
6	561	605	7	601	641	986
1	1731	1767	2	971	1019	1,134
1	229	273	2	723	787	1,162
1	1981	2015	6	939	977	1,033
3	1759	1789	6	72	100	986
1	1481	1531	4	1083	1117	1,247
1	2003	2033	4	799	825	964
1	826	864	3	234	270	1,129
3	1241	1269	6	501	547	1,193
3	70	102	7	98	126	998
1	1989	2023	7	599	649	1,413
2	1993	2057	3	1373	1413	977
3	1484	1510	6	1264	1296	963
1	1274	1322	8	359	385	996
1	865	903	7	517	553	1,470
3	1315	1357	8	318	356	988
2	2032	2072	5	410	442	1,275
2	305	343	3	1311	1345	1,270
5	177	209	6	1057	1085	965
1	122	160	2	506	534	969
2	727	769	8	207	249	1,058
5	881	927	8	738	766	909
2	361	401	4	879	929	1,257
5	625	667	8	353	397	906
1	2188	2220	2	966	1012	908
2	958	990	5	1427	1453	1,195
1	326	356	3	557	597	1,081
5	497	545	8	512	552	1,016
7	509	547	8	427	465	890
1	1632	1682	3	1744	1778	1,058
3	826	858	4	1077	1111	1,014
2	2211	2247	5	674	714	911
2	415	451	4	56	96	875
1	1124	1152	6	229	275	911
3	70	100	5	939	995	1,621
7	315	357	8	761	799	1,234
3	1753	1801	5	509	555	1,088
3	205	245	8	20	66	991
2	672	718	4	994	1020	1,059
1	1399	1433	3	1378	1420	1,251
4	881	907	6	301	341	912
1	1593	1647	7	231	277	938
4	1278	1312	6	78	120	949
3	551	601	4	818	840	944
4	583	625	5	667	701	864
5	29	61	7	515	545	847
5	1025	1067	8	840	872	1,541
1	1132	1178	8	210	238	984
5	1103	1141	7	347	415	837
4	1277	1327	5	1086	1122	930
1	555	595	3	1651	1683	1,425
5	496	544	7	443	485	1,181
5	499	537	7	388	426	1,050
1	1273	1319	2	2235	2263	886
7	925	969	8	397	445	866
3	1369	1399	4	601	655	845
3	1351	1411	7	373	419	825
1	2035	2095	6	1162	1188	965
5	663	697	7	715	753	955
1	1987	2035	3	1353	1393	1,209
4	1412	1446	8	753	791	966
2	917	961	3	1364	1412	856
4	1479	1513	6	110	152	806
2	833	871	6	728	760	1,009
1	1992	2036	5	1073	1121	904
2	680	728	3	196	244	793
6	1263	1293	7	124	150	827
2	751	801	4	817	863	794
1	1384	1424	2	1118	1154	1,927
4	1077	1113	8	236	276	790
1	123	163	8	365	387	843
1	1910	1952	7	846	878	799
2	749	799	4	819	865	789
3	429	463	8	118	164	805
2	2211	2265	4	85	135	781
2	1280	1304	3	1253	1287	1,042
5	537	579	8	422	462	809
3	2114	2150	7	933	963	785
5	1453	1495	7	942	984	863
2	913	975	7	513	557	767
5	1351	1401	7	599	645	904
5	1314	1350	6	605	635	793
5	150	192	7	609	649	757
2	923	957	4	887	925	766
3	179	245	5	347	409	813
2	303	345	7	856	886	753
2	1445	1485	8	69	95	790
2	943	985	5	202	272	798
2	669	705	7	408	444	862
3	68	102	5	865	901	931
3	186	244	8	231	265	1,220
3	1064	1108	8	578	616	802
1	1488	1532	2	2211	2265	728
1	130	162	3	1940	1970	730
1	124	160	5	282	314	777
2	2193	2235	6	570	620	755
5	274	312	8	766	816	727
1	1984	2042	2	2038	2116	939
5	483	519	7	159	197	721
2	1686	1726	5	273	303	714
1	1904	1948	3	371	405	922
5	697	739	8	358	398	717
3	101	133	4	605	643	750
1	122	156	4	1301	1331	810
7	600	650	8	522	562	707
4	1291	1319	6	567	607	706
1	185	239	5	674	716	751
1	464	508	3	1453	1489	827
3	1550	1602	7	539	587	930
1	1779	1821	7	515	555	835
1	437	471	7	78	116	703
1	1662	1712	2	1412	1466	854
3	1357	1409	7	848	898	791
3	324	360	8	214	254	702
3	1353	1403	7	456	500	737
5	674	712	8	512	550	694
4	743	801	5	1089	1123	815
3	1638	1668	7	373	415	703
2	962	1004	4	1333	1395	724
1	54	100	5	673	705	681
1	1122	1164	6	1158	1184	690
4	1564	1622	5	118	148	694
1	808	856	8	353	401	751
1	1852	1884	5	140	192	806
1	1050	1090	7	934	968	753
1	1353	1399	8	69	105	995
5	1087	1123	8	504	546	679
2	668	712	4	679	721	822
2	2112	2142	5	963	1005	671
1	1478	1522	7	188	236	783
1	178	226	7	299	339	710
2	357	401	3	1159	1211	1,260
2	1390	1434	7	302	348	1,848
5	177	225	7	497	545	664
2	2238	2272	8	87	129	692
2	936	988	4	1654	1716	667
5	1042	1094	6	917	965	716
2	216	274	3	269	323	660
5	486	528	7	214	254	658
1	671	707	5	1326	1372	651
3	599	643	8	214	260	661
1	1403	1463	7	591	641	688
2	549	587	6	856	896	759
1	1997	2031	2	2210	2258	826
3	1392	1424	6	84	132	774
1	442	488	3	1812	1856	646
5	450	500	7	840	882	647
1	1614	1664	3	230	280	668
5	350	384	8	600	630	699
1	1320	1368	4	1415	1457	705
2	1926	1968	6	885	929	690
1	1668	1712	3	1541	1567	667
3	2202	2233	8	577	629	733
1	761	799	5	281	315	635
2	932	974	8	391	447	735
5	953	1003	7	761	817	731
5	247	315	6	256	316	729
2	2023	2071	4	1467	1509	711
1	1987	2025	4	1637	1699	711
4	811	835	5	876	924	645
3	874	916	5	671	705	686
1	1908	1944	5	1492	1528	597
1	1971	2035	5	1452	1516	744
2	292	320	5	37	81	1,405
1	651	699	2	1873	1907	887
1	336	380	4	1055	1099	756
1	1405	1467	5	973	1049	586
1	1596	1656	4	1633	1689	594
1	1008	1046	2	741	787	577
2	340	398	3	203	271	586
5	666	700	8	833	867	605
1	799	831	4	868	906	609
3	1364	1400	5	341	413	597
1	653	719	5	999	1037	573
2	957	1019	4	707	753	607
2	409	447	6	217	257	588
4	1673	1733	6	165	235	602
2	357	395	6	852	892	577
2	2025	2079	6	156	200	559
2	598	638	7	804	852	601
2	948	998	7	212	264	556
2	675	709	3	1471	1503	656
5	181	227	6	253	295	555
1	1468	1508	8	842	874	978
2	1515	1551	5	687	719	567
1	101	165	4	812	838	555
2	1883	1925	3	749	805	678
7	577	617	8	756	792	596
1	835	865	8	429	457	547
1	423	455	8	55	91	627
1	491	525	3	1755	1787	545
3	1802	1846	4	1191	1217	561
2	362	394	7	315	347	845
1	1804	1854	3	766	810	957
3	1515	1553	6	644	694	537
5	683	727	6	238	286	550
2	209	235	7	77	111	529
3	1009	1049	4	883	911	553
5	1193	1237	8	209	245	528
1	2082	2154	6	582	616	585
3	1529	1559	7	402	446	590
3	1636	1668	7	937	965	522
1	249	275	4	512	542	940
4	1122	1156	5	1298	1342	535
1	697	759	2	712	772	590
2	139	161	5	895	935	544
3	406	444	5	1059	1107	700
1	451	509	3	1345	1401	507
5	37	79	8	151	183	515
4	1409	1447	5	499	555	515
1	1046	1084	2	1365	1397	511
2	473	515	8	218	256	510
3	1630	1656	5	445	487	551
1	1468	1526	6	64	114	534
3	1753	1801	6	556	592	519
2	401	447	4	1226	1258	581
2	660	708	5	543	591	681
2	2224	2266	5	1203	1241	505
2	819	863	3	1996	2022	525
2	354	396	4	680	724	730
5	224	252	6	414	440	501
3	1063	1109	8	533	571	505
2	307	347	6	285	335	496
1	703	739	3	2027	2059	643
1	223	273	3	1149	1203	638
2	1912	1964	3	522	562	531
2	779	819	4	1200	1230	571
1	477	521	4	881	925	581
5	722	754	8	778	806	643
2	637	687	3	1044	1094	491
1	1620	1664	3	584	628	574
3	522	572	5	1092	1128	531
1	1316	1374	3	220	278	487
2	2135	2181	3	16	54	495
6	5	57	7	763	797	497
1	1770	1814	4	1275	1317	690
2	1779	1815	3	72	108	486
5	73	111	6	116	150	527
3	1028	1076	5	578	620	504
4	1477	1505	8	118	164	495
3	1761	1791	4	62	106	483
2	396	458	3	484	538	508
4	1394	1442	5	1331	1379	500
3	33	81	8	59	109	484
2	1320	1356	6	836	888	500
3	2023	2055	6	162	200	485
6	510	552	7	866	910	488
3	251	283	7	870	904	483
1	1200	1240	5	238	278	543
3	58	92	4	257	289	519
2	2190	2238	8	748	798	475
2	1054	1104	4	717	749	633
2	217	241	5	816	842	481
3	59	95	6	858	908	538
1	1098	1144	8	62	104	489
2	678	710	4	736	764	696
2	348	396	5	233	277	563
2	2081	2127	6	410	462	478
1	438	480	4	1163	1197	542
1	1386	1432	3	980	1008	536
3	2000	2040	5	1126	1170	475
6	869	919	7	601	647	484
2	1518	1564	4	980	1012	488
1	667	703	2	1424	1458	545
5	148	190	7	196	234	485
4	297	347	8	801	837	595
1	1561	1609	4	1280	1330	519
1	2251	2305	2	728	784	514
1	434	470	4	1222	1258	505
2	2103	2139	4	890	938	517
2	2221	2259	8	402	444	512
3	1528	1560	4	1223	1257	586
1	580	646	2	746	804	450
2	206	230	3	1734	1774	529
1	396	434	3	1144	1180	512
3	319	367	7	657	703	555
2	352	396	4	1643	1691	483
5	545	587	6	1036	1074	459
4	895	939	5	1351	1405	453
1	405	435	3	1755	1787	559
1	1809	1847	7	835	877	470
2	675	725	3	1307	1357	449
5	929	977	6	12	56	489
5	191	227	7	938	966	453
2	2209	2263	4	904	950	449
2	673	725	3	1310	1356	444
2	293	353	8	227	267	448
1	2237	2265	3	638	670	513
1	1696	1740	5	411	455	463
1	432	470	6	377	425	428
3	139	187	8	528	570	441
5	937	979	8	360	396	461
1	883	919	5	1257	1293	458
5	984	1042	7	541	601	433
1	1445	1491	5	1066	1132	423
2	783	821	3	279	319	453
1	1145	1211	4	110	138	458
2	358	388	4	991	1017	505
2	61	85	5	790	828	497
1	2179	2231	3	1373	1411	420
2	1309	1343	5	181	219	437
5	547	577	7	300	330	482
2	243	287	7	215	263	426
1	679	719	5	256	296	415
3	1793	1837	4	802	836	432
2	2025	2063	4	1310	1350	480
2	586	630	3	97	135	423
1	430	476	8	169	207	430
3	2017	2053	4	994	1016	440
1	1556	1606	4	1398	1454	436
2	2091	2137	6	214	268	422
3	70	102	8	784	810	426
1	646	678	7	476	508	450
1	591	635	3	1310	1352	468
1	1996	2042	2	1321	1363	410
3	1609	1649	5	104	144	471
1	1895	1939	8	410	442	413
7	393	437	8	204	248	416
1	768	818	2	302	348	441
1	302	352	4	59	103	428
1	481	513	8	517	549	435
2	677	711	6	894	928	429
2	1592	1646	8	358	390	411
3	140	178	4	1456	1486	404
2	2221	2261	5	310	346	431
1	1688	1728	5	1052	1104	405
1	2000	2040	4	707	739	420
6	48	108	7	472	516	398
2	2042	2088	4	1659	1703	416
3	324	366	8	395	445	410
3	1813	1853	4	1644	1684	429
3	257	313	5	660	710	394
1	725	785	3	87	137	392
1	1632	1662	2	62	94	420
7	594	632	8	66	122	419
1	685	743	4	1294	1324	414
1	1262	1330	7	924	970	387
2	981	1009	3	680	704	409
2	1339	1383	8	469	515	417
3	1362	1398	4	1400	1450	402
2	204	232	7	870	924	390
4	1070	1108	5	485	521	384
1	1057	1105	4	1461	1505	382
3	1541	1565	5	869	919	380
2	164	194	3	236	266	398
5	240	306	6	66	98	386
2	2087	2121	4	1595	1635	401
5	681	715	8	597	627	382
1	1768	1816	2	311	341	384
1	1130	1178	3	1539	1563	384
2	2002	2042	5	1019	1057	390
3	539	581	8	592	628	389
2	478	518	3	1153	1191	375
2	1286	1316	8	41	89	380
6	695	737	7	492	546	386
2	1879	1927	7	358	406	371
3	1385	1425	6	558	594	371
4	1531	1571	6	463	503	383
3	1063	1103	5	1132	1186	383
5	1097	1145	8	598	628	373
4	590	660	6	569	609	375
2	1725	1763	7	950	974	364
3	1834	1876	5	1083	1115	376
1	116	152	7	789	825	366
3	1258	1312	5	489	525	362
3	1381	1421	8	511	551	368
4	1195	1233	6	874	912	364
1	478	532	2	2224	2272	363
5	1003	1053	8	116	166	364
1	1080	1130	4	1315	1343	361
4	1645	1681	5	1105	1143	363
5	869	921	8	214	252	362
3	1370	1404	5	768	798	355
4	898	936	6	1244	1278	362
7	304	346	8	416	454	356
2	1037	1073	4	103	133	344
1	889	931	6	874	924	342
3	1937	1991	8	356	394	347
1	2168	2206	2	215	251	340
5	1008	1036	8	590	618	340
3	2006	2056	8	579	613	329
4	1630	1680	6	400	450	338
1	294	352	7	974	1014	332
1	439	467	2	1601	1641	327
1	1262	1306	4	1196	1232	327
2	1241	1275	4	809	835	300
3	2119	2153	8	509	541	316
1	1040	1100	4	869	923	325
4	713	741	5	870	904	321
1	2171	2197	5	1245	1295	279
1	698	728	3	54	86	311
3	429	461	4	1389	1427	315
5	1216	1246	7	941	973	313
1	1545	1597	2	475	529	303
2	1103	1149	6	1139	1181	304
4	800	838	6	108	156	293
3	2021	2055	7	322	352	280
4	116	148	5	1202	1254	298
7	993	1027	8	584	626	270
2	1595	1633	8	19	49	283
3	19	47	4	432	456	287
7	302	344	8	117	153	298
3	70	102	4	1214	1252	294
3	603	635	4	49	101	280
3	927	971	7	499	547	283
1	149	205	4	111	137	284
1	481	519	4	1299	1335	281
3	1758	1782	4	644	680	282
3	1454	1486	8	687	719	266
4	46	88	6	1115	1155	272
7	113	159	8	357	395	266
2	188	240	6	153	209	263
5	108	156	8	730	770	267
3	1935	1973	8	522	556	248